{"text_format":"1","workbook":"xlsx","n_sheets":3,"sheets":["Cover","Search Page","Hide this - Workings"],"not_rendered":{"charts":0,"images":2,"macros":1,"external_links":0,"defined_names":5,"comments":0,"pivot_tables":0},"unopened":[],"bounds":{"document_bytes":16777216,"sheet_cells":100000,"rows_first":2000,"rows_last":500,"rows_between":2000,"halvings":0,"cell_chars":16384,"cell_head_chars":4096},"cells_cut":0,"cells_raw":0,"read":"whole","date_system":"1900"}

{"sheet":"Cover","index":0,"n_rows":440,"n_cols":10,"rows_kept":440,"cut":false,"hidden":false,"merged":[[26,1,26,9],[27,1,27,9],[25,1,25,9],[13,1,13,9],[14,1,14,9],[15,1,15,9],[16,1,16,9],[17,1,17,9],[18,1,18,9],[23,1,23,9]]}
[]
[]
[]
[]
[]
[]
[]
[null,"Short and Long Term (SALT) Data Return 2022-23"]
[null,"Frequently Asked Questions",null,null,null,null,null,null,null,"Version: 1.0"]
[]
[]
[null,"Instructions for Use:"]
[]
[null,"1. The SALT return has many Frequently Asked Questions which have been added to since the first year of the collection in 2014-15.\n\nRather than include pages of questions in the guidance document, they have all been placed in this searchable database which will allow you to quickly get the most relevant answers without having to read through irrelevant sections.\n"]
[null,"2. Please ensure that you 'enable macros' within Excel so that the database is fully operational."]
[null,"3. You can search either for key terms (e.g. 'personal budget') or for a measure name (e.g. 'STS001').  Some of the questions don't relate to a specific measure. Multiple terms can be entered, and FAQs or answers with the most matched terms will display first. Only FAQs that include at least 1 in 3 of the searched terms are displayed.  If you want to see all FAQs, enter a single space in the search box."]
[]
[null,"This spreadsheet forms part of the Short and Long Term Support (SALT) section on the Social Care Collection Materials webpage"]
[null,"https://digital.nhs.uk/data-and-information/data-collections-and-data-sets/data-collections/social-care-collection-materials-2023#short-and-long-term-support-salt-"]
[]
[null,"If further support is required, please contact the SALT mailbox:"]
[null,"socialcare.statistics@nhs.net"]
[]
[null,"NHS England Helpdesk: 0300 303 5678\n"]
[]
[null,"Copyright 2023 NHS England"]
[]
[]
[]
[]
[]
[]
[]
[]
[]
[]
[]
[]
[]
[]
[]
[]
[]
[]
[]
[]
[]
[]
[]
[]
[]
[]
[]
[]
[]
[]
[]
[]
[]
[]
[]
[]
[]
[]
[]
[]
[]
[]
[]
[]
[]
[]
[]
[]
[]
[]
[]
[]
[]
[]
[]
[]
[]
[]
[]
[]
[]
[]
[]
[]
[]
[]
[]
[]
[]
[]
[]
[]
[]
[]
[]
[]
[]
[]
[]
[]
[]
[]
[]
[]
[]
[]
[]
[]
[]
[]
[]
[]
[]
[]
[]
[]
[]
[]
[]
[]
[]
[]
[]
[]
[]
[]
[]
[]
[]
[]
[]
[]
[]
[]
[]
[]
[]
[]
[]
[]
[]
[]
[]
[]
[]
[]
[]
[]
[]
[]
[]
[]
[]
[]
[]
[]
[]
[]
[]
[]
[]
[]
[]
[]
[]
[]
[]
[]
[]
[]
[]
[]
[]
[]
[]
[]
[]
[]
[]
[]
[]
[]
[]
[]
[]
[]
[]
[]
[]
[]
[]
[]
[]
[]
[]
[]
[]
[]
[]
[]
[]
[]
[]
[]
[]
[]
[]
[]
[]
[]
[]
[]
[]
[]
[]
[]
[]
[]
[]
[]
[]
[]
[]
[]
[]
[]
[]
[]
[]
[]
[]
[]
[]
[]
[]
[]
[]
[]
[]
[]
[]
[]
[]
[]
[]
[]
[]
[]
[]
[]
[]
[]
[]
[]
[]
[]
[]
[]
[]
[]
[]
[]
[]
[]
[]
[]
[]
[]
[]
[]
[]
[]
[]
[]
[]
[]
[]
[]
[]
[]
[null,"LA","LA Code"]
[null,"You have not selected your council","N/A"]
[null,"Barking and Dagenham",716]
[null,"Barnet",717]
[null,"Barnsley",204]
[null,"Bath and North East Somerset",908]
[null,"Bedford Borough",625]
[null,"Bexley",718]
[null,"Birmingham",406]
[null,"Blackburn with Darwen",324]
[null,"Blackpool",325]
[null,"Bolton",304]
[null,"Bournemouth",810]
[null,"Bracknell Forest",614]
[null,"Bradford",209]
[null,"Brent",719]
[null,"Brighton and Hove",816]
[null,"Bristol",909]
[null,"Bromley",720]
[null,"Buckinghamshire",612]
[null,"Bury",305]
[null,"Calderdale",210]
[null,"Cambridgeshire",623]
[null,"Camden",702]
[null,"Central Bedfordshire",626]
[null,"Cheshire East",326]
[null,"Cheshire West and Chester",327]
[null,"City of London",714]
[null,"Cornwall",902]
[null,"Coventry",407]
[null,"Croydon",721]
[null,"Cumbria",102]
[null,"Darlington",117]
[null,"Derby",507]
[null,"Derbyshire",506]
[null,"Devon",912]
[null,"Doncaster",205]
[null,"Dorset",809]
[null,"Dudley",408]
[null,"Durham",116]
[null,"Ealing",722]
[null,"East Riding of Yorkshire",214]
[null,"East Sussex",815]
[null,"Enfield",723]
[null,"Essex",620]
[null,"Gateshead",106]
[null,"Gloucestershire",904]
[null,"Greenwich",703]
[null,"Hackney",704]
[null,"Halton",321]
[null,"Hammersmith and Fulham",705]
[null,"Hampshire",812]
[null,"Haringey",724]
[null,"Harrow",725]
[null,"Hartlepool",111]
[null,"Havering",726]
[null,"Herefordshire",415]
[null,"Hertfordshire",606]
[null,"Hillingdon",727]
[null,"Hounslow",728]
[null,"Isle of Wight Council",803]
[null,"Isles of Scilly",906]
[null,"Islington",706]
[null,"Kensington and Chelsea",707]
[null,"Kent",820]
[null,"Kingston upon Hull",215]
[null,"Kingston upon Thames",729]
[null,"Kirklees",211]
[null,"Knowsley",315]
[null,"Lambeth",708]
[null,"Lancashire",323]
[null,"Leeds",212]
[null,"Leicester",509]
[null,"Leicestershire",508]
[null,"Lewisham",709]
[null,"Lincolnshire",503]
[null,"Liverpool",316]
[null,"Luton",611]
[null,"Manchester",306]
[null,"Medway",821]
[null,"Merton",730]
[null,"Middlesbrough",112]
[null,"Milton Keynes",613]
[null,"Newcastle upon Tyne",107]
[null,"Newham",731]
[null,"Norfolk",607]
[null,"North East Lincolnshire",216]
[null,"North Lincolnshire",217]
[null,"North Somerset",910]
[null,"North Tyneside",108]
[null,"North Yorkshire",218]
[null,"Northamptonshire",504]
[null,"Northumberland",104]
[null,"Nottingham",512]
[null,"Nottinghamshire",511]
[null,"Oldham",307]
[null,"Oxfordshire",608]
[null,"Peterborough",624]
[null,"Plymouth",913]
[null,"Poole",811]
[null,"Portsmouth",813]
[null,"Reading",616]
[null,"Redbridge",732]
[null,"Redcar and Cleveland",113]
[null,"Richmond upon Thames",733]
[null,"Rochdale",308]
[null,"Rotherham",206]
[null,"Rutland",510]
[null,"Salford",309]
[null,"Sandwell",409]
[null,"Sefton",317]
[null,"Sheffield",207]
[null,"Shropshire",417]
[null,"Slough",617]
[null,"Solihull",410]
[null,"Somerset",905]
[null,"South Gloucestershire",911]
[null,"South Tyneside",109]
[null,"Southampton",814]
[null,"Southend on Sea",621]
[null,"Southwark",710]
[null,"St Helens",318]
[null,"Staffordshire",413]
[null,"Stockport",310]
[null,"Stockton on Tees",114]
[null,"Stoke on Trent",414]
[null,"Suffolk",609]
[null,"Sunderland",110]
[null,"Surrey",805]
[null,"Sutton",734]
[null,"Swindon",819]
[null,"Tameside",311]
[null,"Telford and the Wrekin",418]
[null,"Thurrock",622]
[null,"Torbay",914]
[null,"Tower Hamlets",711]
[null,"Trafford",312]
[null,"Wakefield",213]
[null,"Walsall",411]
[null,"Waltham Forest",735]
[null,"Wandsworth",712]
[null,"Warrington",322]
[null,"Warwickshire",404]
[null,"West Berkshire",615]
[null,"West Sussex",807]
[null,"Westminster",713]
[null,"Wigan",313]
[null,"Wiltshire",817]
[null,"Windsor and Maidenhead",618]
[null,"Wirral",319]
[null,"Wokingham",619]
[null,"Wolverhampton",412]
[null,"Worcestershire",416]
[null,"York",219]

{"sheet":"Search Page","index":1,"n_rows":215,"n_cols":3,"rows_kept":215,"cut":false,"hidden":false,"merged":[]}
[]
[]
[null,null,"SALT FAQs 2022-23"]
[]
[null,{"$f":"'Hide this - Workings'!E2","v":0},"FAQs match your search"]
[]
[null,null,"Please Type Your Keyword(s) in the Box"]
[]
[]
[null,null,""]
[]
[null,null,"If your keyword(s) are found in either a Question or Answer in the FAQ database, the relevant questions will appear below."]
[]
[null,null,"To update the height of the rows to display all the text, please deselect the search bar and press CTRL + T"]
["Reference","Question","Answer"]
[{"$f":"'Hide this - Workings'!E214","v":""},{"$f":"IF(A16=\"\",\"\",VLOOKUP(A16,'Hide this - Workings'!$C$5:$AJ$202,10,FALSE))","v":""},{"$f":"IF(A16=\"\",\"\",VLOOKUP(A16,'Hide this - Workings'!$C$5:$AJ$202,11,FALSE))","v":""}]
[{"$f":"'Hide this - Workings'!E215","v":""},{"$f":"IF(A17=\"\",\"\",VLOOKUP(A17,'Hide this - Workings'!$C$5:$AJ$202,10,FALSE))","v":""},{"$f":"IF(A17=\"\",\"\",VLOOKUP(A17,'Hide this - Workings'!$C$5:$AJ$202,11,FALSE))","v":""}]
[{"$f":"'Hide this - Workings'!E216","v":""},{"$f":"IF(A18=\"\",\"\",VLOOKUP(A18,'Hide this - Workings'!$C$5:$AJ$202,10,FALSE))","v":""},{"$f":"IF(A18=\"\",\"\",VLOOKUP(A18,'Hide this - Workings'!$C$5:$AJ$202,11,FALSE))","v":""}]
[{"$f":"'Hide this - Workings'!E217","v":""},{"$f":"IF(A19=\"\",\"\",VLOOKUP(A19,'Hide this - Workings'!$C$5:$AJ$202,10,FALSE))","v":""},{"$f":"IF(A19=\"\",\"\",VLOOKUP(A19,'Hide this - Workings'!$C$5:$AJ$202,11,FALSE))","v":""}]
[{"$f":"'Hide this - Workings'!E218","v":""},{"$f":"IF(A20=\"\",\"\",VLOOKUP(A20,'Hide this - Workings'!$C$5:$AJ$202,10,FALSE))","v":""},{"$f":"IF(A20=\"\",\"\",VLOOKUP(A20,'Hide this - Workings'!$C$5:$AJ$202,11,FALSE))","v":""}]
[{"$f":"'Hide this - Workings'!E219","v":""},{"$f":"IF(A21=\"\",\"\",VLOOKUP(A21,'Hide this - Workings'!$C$5:$AJ$202,10,FALSE))","v":""},{"$f":"IF(A21=\"\",\"\",VLOOKUP(A21,'Hide this - Workings'!$C$5:$AJ$202,11,FALSE))","v":""}]
[{"$f":"'Hide this - Workings'!E220","v":""},{"$f":"IF(A22=\"\",\"\",VLOOKUP(A22,'Hide this - Workings'!$C$5:$AJ$202,10,FALSE))","v":""},{"$f":"IF(A22=\"\",\"\",VLOOKUP(A22,'Hide this - Workings'!$C$5:$AJ$202,11,FALSE))","v":""}]
[{"$f":"'Hide this - Workings'!E221","v":""},{"$f":"IF(A23=\"\",\"\",VLOOKUP(A23,'Hide this - Workings'!$C$5:$AJ$202,10,FALSE))","v":""},{"$f":"IF(A23=\"\",\"\",VLOOKUP(A23,'Hide this - Workings'!$C$5:$AJ$202,11,FALSE))","v":""}]
[{"$f":"'Hide this - Workings'!E222","v":""},{"$f":"IF(A24=\"\",\"\",VLOOKUP(A24,'Hide this - Workings'!$C$5:$AJ$202,10,FALSE))","v":""},{"$f":"IF(A24=\"\",\"\",VLOOKUP(A24,'Hide this - Workings'!$C$5:$AJ$202,11,FALSE))","v":""}]
[{"$f":"'Hide this - Workings'!E223","v":""},{"$f":"IF(A25=\"\",\"\",VLOOKUP(A25,'Hide this - Workings'!$C$5:$AJ$202,10,FALSE))","v":""},{"$f":"IF(A25=\"\",\"\",VLOOKUP(A25,'Hide this - Workings'!$C$5:$AJ$202,11,FALSE))","v":""}]
[{"$f":"'Hide this - Workings'!E224","v":""},{"$f":"IF(A26=\"\",\"\",VLOOKUP(A26,'Hide this - Workings'!$C$5:$AJ$202,10,FALSE))","v":""},{"$f":"IF(A26=\"\",\"\",VLOOKUP(A26,'Hide this - Workings'!$C$5:$AJ$202,11,FALSE))","v":""}]
[{"$f":"'Hide this - Workings'!E225","v":""},{"$f":"IF(A27=\"\",\"\",VLOOKUP(A27,'Hide this - Workings'!$C$5:$AJ$202,10,FALSE))","v":""},{"$f":"IF(A27=\"\",\"\",VLOOKUP(A27,'Hide this - Workings'!$C$5:$AJ$202,11,FALSE))","v":""}]
[{"$f":"'Hide this - Workings'!E226","v":""},{"$f":"IF(A28=\"\",\"\",VLOOKUP(A28,'Hide this - Workings'!$C$5:$AJ$202,10,FALSE))","v":""},{"$f":"IF(A28=\"\",\"\",VLOOKUP(A28,'Hide this - Workings'!$C$5:$AJ$202,11,FALSE))","v":""}]
[{"$f":"'Hide this - Workings'!E227","v":""},{"$f":"IF(A29=\"\",\"\",VLOOKUP(A29,'Hide this - Workings'!$C$5:$AJ$202,10,FALSE))","v":""},{"$f":"IF(A29=\"\",\"\",VLOOKUP(A29,'Hide this - Workings'!$C$5:$AJ$202,11,FALSE))","v":""}]
[{"$f":"'Hide this - Workings'!E228","v":""},{"$f":"IF(A30=\"\",\"\",VLOOKUP(A30,'Hide this - Workings'!$C$5:$AJ$202,10,FALSE))","v":""},{"$f":"IF(A30=\"\",\"\",VLOOKUP(A30,'Hide this - Workings'!$C$5:$AJ$202,11,FALSE))","v":""}]
[{"$f":"'Hide this - Workings'!E229","v":""},{"$f":"IF(A31=\"\",\"\",VLOOKUP(A31,'Hide this - Workings'!$C$5:$AJ$202,10,FALSE))","v":""},{"$f":"IF(A31=\"\",\"\",VLOOKUP(A31,'Hide this - Workings'!$C$5:$AJ$202,11,FALSE))","v":""}]
[{"$f":"'Hide this - Workings'!E230","v":""},{"$f":"IF(A32=\"\",\"\",VLOOKUP(A32,'Hide this - Workings'!$C$5:$AJ$202,10,FALSE))","v":""},{"$f":"IF(A32=\"\",\"\",VLOOKUP(A32,'Hide this - Workings'!$C$5:$AJ$202,11,FALSE))","v":""}]
[{"$f":"'Hide this - Workings'!E231","v":""},{"$f":"IF(A33=\"\",\"\",VLOOKUP(A33,'Hide this - Workings'!$C$5:$AJ$202,10,FALSE))","v":""},{"$f":"IF(A33=\"\",\"\",VLOOKUP(A33,'Hide this - Workings'!$C$5:$AJ$202,11,FALSE))","v":""}]
[{"$f":"'Hide this - Workings'!E232","v":""},{"$f":"IF(A34=\"\",\"\",VLOOKUP(A34,'Hide this - Workings'!$C$5:$AJ$202,10,FALSE))","v":""},{"$f":"IF(A34=\"\",\"\",VLOOKUP(A34,'Hide this - Workings'!$C$5:$AJ$202,11,FALSE))","v":""}]
[{"$f":"'Hide this - Workings'!E233","v":""},{"$f":"IF(A35=\"\",\"\",VLOOKUP(A35,'Hide this - Workings'!$C$5:$AJ$202,10,FALSE))","v":""},{"$f":"IF(A35=\"\",\"\",VLOOKUP(A35,'Hide this - Workings'!$C$5:$AJ$202,11,FALSE))","v":""}]
[{"$f":"'Hide this - Workings'!E234","v":""},{"$f":"IF(A36=\"\",\"\",VLOOKUP(A36,'Hide this - Workings'!$C$5:$AJ$202,10,FALSE))","v":""},{"$f":"IF(A36=\"\",\"\",VLOOKUP(A36,'Hide this - Workings'!$C$5:$AJ$202,11,FALSE))","v":""}]
[{"$f":"'Hide this - Workings'!E235","v":""},{"$f":"IF(A37=\"\",\"\",VLOOKUP(A37,'Hide this - Workings'!$C$5:$AJ$202,10,FALSE))","v":""},{"$f":"IF(A37=\"\",\"\",VLOOKUP(A37,'Hide this - Workings'!$C$5:$AJ$202,11,FALSE))","v":""}]
[{"$f":"'Hide this - Workings'!E236","v":""},{"$f":"IF(A38=\"\",\"\",VLOOKUP(A38,'Hide this - Workings'!$C$5:$AJ$202,10,FALSE))","v":""},{"$f":"IF(A38=\"\",\"\",VLOOKUP(A38,'Hide this - Workings'!$C$5:$AJ$202,11,FALSE))","v":""}]
[{"$f":"'Hide this - Workings'!E237","v":""},{"$f":"IF(A39=\"\",\"\",VLOOKUP(A39,'Hide this - Workings'!$C$5:$AJ$202,10,FALSE))","v":""},{"$f":"IF(A39=\"\",\"\",VLOOKUP(A39,'Hide this - Workings'!$C$5:$AJ$202,11,FALSE))","v":""}]
[{"$f":"'Hide this - Workings'!E238","v":""},{"$f":"IF(A40=\"\",\"\",VLOOKUP(A40,'Hide this - Workings'!$C$5:$AJ$202,10,FALSE))","v":""},{"$f":"IF(A40=\"\",\"\",VLOOKUP(A40,'Hide this - Workings'!$C$5:$AJ$202,11,FALSE))","v":""}]
[{"$f":"'Hide this - Workings'!E239","v":""},{"$f":"IF(A41=\"\",\"\",VLOOKUP(A41,'Hide this - Workings'!$C$5:$AJ$202,10,FALSE))","v":""},{"$f":"IF(A41=\"\",\"\",VLOOKUP(A41,'Hide this - Workings'!$C$5:$AJ$202,11,FALSE))","v":""}]
[{"$f":"'Hide this - Workings'!E240","v":""},{"$f":"IF(A42=\"\",\"\",VLOOKUP(A42,'Hide this - Workings'!$C$5:$AJ$202,10,FALSE))","v":""},{"$f":"IF(A42=\"\",\"\",VLOOKUP(A42,'Hide this - Workings'!$C$5:$AJ$202,11,FALSE))","v":""}]
[{"$f":"'Hide this - Workings'!E241","v":""},{"$f":"IF(A43=\"\",\"\",VLOOKUP(A43,'Hide this - Workings'!$C$5:$AJ$202,10,FALSE))","v":""},{"$f":"IF(A43=\"\",\"\",VLOOKUP(A43,'Hide this - Workings'!$C$5:$AJ$202,11,FALSE))","v":""}]
[{"$f":"'Hide this - Workings'!E242","v":""},{"$f":"IF(A44=\"\",\"\",VLOOKUP(A44,'Hide this - Workings'!$C$5:$AJ$202,10,FALSE))","v":""},{"$f":"IF(A44=\"\",\"\",VLOOKUP(A44,'Hide this - Workings'!$C$5:$AJ$202,11,FALSE))","v":""}]
[{"$f":"'Hide this - Workings'!E243","v":""},{"$f":"IF(A45=\"\",\"\",VLOOKUP(A45,'Hide this - Workings'!$C$5:$AJ$202,10,FALSE))","v":""},{"$f":"IF(A45=\"\",\"\",VLOOKUP(A45,'Hide this - Workings'!$C$5:$AJ$202,11,FALSE))","v":""}]
[{"$f":"'Hide this - Workings'!E244","v":""},{"$f":"IF(A46=\"\",\"\",VLOOKUP(A46,'Hide this - Workings'!$C$5:$AJ$202,10,FALSE))","v":""},{"$f":"IF(A46=\"\",\"\",VLOOKUP(A46,'Hide this - Workings'!$C$5:$AJ$202,11,FALSE))","v":""}]
[{"$f":"'Hide this - Workings'!E245","v":""},{"$f":"IF(A47=\"\",\"\",VLOOKUP(A47,'Hide this - Workings'!$C$5:$AJ$202,10,FALSE))","v":""},{"$f":"IF(A47=\"\",\"\",VLOOKUP(A47,'Hide this - Workings'!$C$5:$AJ$202,11,FALSE))","v":""}]
[{"$f":"'Hide this - Workings'!E246","v":""},{"$f":"IF(A48=\"\",\"\",VLOOKUP(A48,'Hide this - Workings'!$C$5:$AJ$202,10,FALSE))","v":""},{"$f":"IF(A48=\"\",\"\",VLOOKUP(A48,'Hide this - Workings'!$C$5:$AJ$202,11,FALSE))","v":""}]
[{"$f":"'Hide this - Workings'!E247","v":""},{"$f":"IF(A49=\"\",\"\",VLOOKUP(A49,'Hide this - Workings'!$C$5:$AJ$202,10,FALSE))","v":""},{"$f":"IF(A49=\"\",\"\",VLOOKUP(A49,'Hide this - Workings'!$C$5:$AJ$202,11,FALSE))","v":""}]
[{"$f":"'Hide this - Workings'!E248","v":""},{"$f":"IF(A50=\"\",\"\",VLOOKUP(A50,'Hide this - Workings'!$C$5:$AJ$202,10,FALSE))","v":""},{"$f":"IF(A50=\"\",\"\",VLOOKUP(A50,'Hide this - Workings'!$C$5:$AJ$202,11,FALSE))","v":""}]
[{"$f":"'Hide this - Workings'!E249","v":""},{"$f":"IF(A51=\"\",\"\",VLOOKUP(A51,'Hide this - Workings'!$C$5:$AJ$202,10,FALSE))","v":""},{"$f":"IF(A51=\"\",\"\",VLOOKUP(A51,'Hide this - Workings'!$C$5:$AJ$202,11,FALSE))","v":""}]
[{"$f":"'Hide this - Workings'!E250","v":""},{"$f":"IF(A52=\"\",\"\",VLOOKUP(A52,'Hide this - Workings'!$C$5:$AJ$202,10,FALSE))","v":""},{"$f":"IF(A52=\"\",\"\",VLOOKUP(A52,'Hide this - Workings'!$C$5:$AJ$202,11,FALSE))","v":""}]
[{"$f":"'Hide this - Workings'!E251","v":""},{"$f":"IF(A53=\"\",\"\",VLOOKUP(A53,'Hide this - Workings'!$C$5:$AJ$202,10,FALSE))","v":""},{"$f":"IF(A53=\"\",\"\",VLOOKUP(A53,'Hide this - Workings'!$C$5:$AJ$202,11,FALSE))","v":""}]
[{"$f":"'Hide this - Workings'!E252","v":""},{"$f":"IF(A54=\"\",\"\",VLOOKUP(A54,'Hide this - Workings'!$C$5:$AJ$202,10,FALSE))","v":""},{"$f":"IF(A54=\"\",\"\",VLOOKUP(A54,'Hide this - Workings'!$C$5:$AJ$202,11,FALSE))","v":""}]
[{"$f":"'Hide this - Workings'!E253","v":""},{"$f":"IF(A55=\"\",\"\",VLOOKUP(A55,'Hide this - Workings'!$C$5:$AJ$202,10,FALSE))","v":""},{"$f":"IF(A55=\"\",\"\",VLOOKUP(A55,'Hide this - Workings'!$C$5:$AJ$202,11,FALSE))","v":""}]
[{"$f":"'Hide this - Workings'!E254","v":""},{"$f":"IF(A56=\"\",\"\",VLOOKUP(A56,'Hide this - Workings'!$C$5:$AJ$202,10,FALSE))","v":""},{"$f":"IF(A56=\"\",\"\",VLOOKUP(A56,'Hide this - Workings'!$C$5:$AJ$202,11,FALSE))","v":""}]
[{"$f":"'Hide this - Workings'!E255","v":""},{"$f":"IF(A57=\"\",\"\",VLOOKUP(A57,'Hide this - Workings'!$C$5:$AJ$202,10,FALSE))","v":""},{"$f":"IF(A57=\"\",\"\",VLOOKUP(A57,'Hide this - Workings'!$C$5:$AJ$202,11,FALSE))","v":""}]
[{"$f":"'Hide this - Workings'!E256","v":""},{"$f":"IF(A58=\"\",\"\",VLOOKUP(A58,'Hide this - Workings'!$C$5:$AJ$202,10,FALSE))","v":""},{"$f":"IF(A58=\"\",\"\",VLOOKUP(A58,'Hide this - Workings'!$C$5:$AJ$202,11,FALSE))","v":""}]
[{"$f":"'Hide this - Workings'!E257","v":""},{"$f":"IF(A59=\"\",\"\",VLOOKUP(A59,'Hide this - Workings'!$C$5:$AJ$202,10,FALSE))","v":""},{"$f":"IF(A59=\"\",\"\",VLOOKUP(A59,'Hide this - Workings'!$C$5:$AJ$202,11,FALSE))","v":""}]
[{"$f":"'Hide this - Workings'!E258","v":""},{"$f":"IF(A60=\"\",\"\",VLOOKUP(A60,'Hide this - Workings'!$C$5:$AJ$202,10,FALSE))","v":""},{"$f":"IF(A60=\"\",\"\",VLOOKUP(A60,'Hide this - Workings'!$C$5:$AJ$202,11,FALSE))","v":""}]
[{"$f":"'Hide this - Workings'!E259","v":""},{"$f":"IF(A61=\"\",\"\",VLOOKUP(A61,'Hide this - Workings'!$C$5:$AJ$202,10,FALSE))","v":""},{"$f":"IF(A61=\"\",\"\",VLOOKUP(A61,'Hide this - Workings'!$C$5:$AJ$202,11,FALSE))","v":""}]
[{"$f":"'Hide this - Workings'!E260","v":""},{"$f":"IF(A62=\"\",\"\",VLOOKUP(A62,'Hide this - Workings'!$C$5:$AJ$202,10,FALSE))","v":""},{"$f":"IF(A62=\"\",\"\",VLOOKUP(A62,'Hide this - Workings'!$C$5:$AJ$202,11,FALSE))","v":""}]
[{"$f":"'Hide this - Workings'!E261","v":""},{"$f":"IF(A63=\"\",\"\",VLOOKUP(A63,'Hide this - Workings'!$C$5:$AJ$202,10,FALSE))","v":""},{"$f":"IF(A63=\"\",\"\",VLOOKUP(A63,'Hide this - Workings'!$C$5:$AJ$202,11,FALSE))","v":""}]
[{"$f":"'Hide this - Workings'!E262","v":""},{"$f":"IF(A64=\"\",\"\",VLOOKUP(A64,'Hide this - Workings'!$C$5:$AJ$202,10,FALSE))","v":""},{"$f":"IF(A64=\"\",\"\",VLOOKUP(A64,'Hide this - Workings'!$C$5:$AJ$202,11,FALSE))","v":""}]
[{"$f":"'Hide this - Workings'!E263","v":""},{"$f":"IF(A65=\"\",\"\",VLOOKUP(A65,'Hide this - Workings'!$C$5:$AJ$202,10,FALSE))","v":""},{"$f":"IF(A65=\"\",\"\",VLOOKUP(A65,'Hide this - Workings'!$C$5:$AJ$202,11,FALSE))","v":""}]
[{"$f":"'Hide this - Workings'!E264","v":""},{"$f":"IF(A66=\"\",\"\",VLOOKUP(A66,'Hide this - Workings'!$C$5:$AJ$202,10,FALSE))","v":""},{"$f":"IF(A66=\"\",\"\",VLOOKUP(A66,'Hide this - Workings'!$C$5:$AJ$202,11,FALSE))","v":""}]
[{"$f":"'Hide this - Workings'!E265","v":""},{"$f":"IF(A67=\"\",\"\",VLOOKUP(A67,'Hide this - Workings'!$C$5:$AJ$202,10,FALSE))","v":""},{"$f":"IF(A67=\"\",\"\",VLOOKUP(A67,'Hide this - Workings'!$C$5:$AJ$202,11,FALSE))","v":""}]
[{"$f":"'Hide this - Workings'!E266","v":""},{"$f":"IF(A68=\"\",\"\",VLOOKUP(A68,'Hide this - Workings'!$C$5:$AJ$202,10,FALSE))","v":""},{"$f":"IF(A68=\"\",\"\",VLOOKUP(A68,'Hide this - Workings'!$C$5:$AJ$202,11,FALSE))","v":""}]
[{"$f":"'Hide this - Workings'!E267","v":""},{"$f":"IF(A69=\"\",\"\",VLOOKUP(A69,'Hide this - Workings'!$C$5:$AJ$202,10,FALSE))","v":""},{"$f":"IF(A69=\"\",\"\",VLOOKUP(A69,'Hide this - Workings'!$C$5:$AJ$202,11,FALSE))","v":""}]
[{"$f":"'Hide this - Workings'!E268","v":""},{"$f":"IF(A70=\"\",\"\",VLOOKUP(A70,'Hide this - Workings'!$C$5:$AJ$202,10,FALSE))","v":""},{"$f":"IF(A70=\"\",\"\",VLOOKUP(A70,'Hide this - Workings'!$C$5:$AJ$202,11,FALSE))","v":""}]
[{"$f":"'Hide this - Workings'!E269","v":""},{"$f":"IF(A71=\"\",\"\",VLOOKUP(A71,'Hide this - Workings'!$C$5:$AJ$202,10,FALSE))","v":""},{"$f":"IF(A71=\"\",\"\",VLOOKUP(A71,'Hide this - Workings'!$C$5:$AJ$202,11,FALSE))","v":""}]
[{"$f":"'Hide this - Workings'!E270","v":""},{"$f":"IF(A72=\"\",\"\",VLOOKUP(A72,'Hide this - Workings'!$C$5:$AJ$202,10,FALSE))","v":""},{"$f":"IF(A72=\"\",\"\",VLOOKUP(A72,'Hide this - Workings'!$C$5:$AJ$202,11,FALSE))","v":""}]
[{"$f":"'Hide this - Workings'!E271","v":""},{"$f":"IF(A73=\"\",\"\",VLOOKUP(A73,'Hide this - Workings'!$C$5:$AJ$202,10,FALSE))","v":""},{"$f":"IF(A73=\"\",\"\",VLOOKUP(A73,'Hide this - Workings'!$C$5:$AJ$202,11,FALSE))","v":""}]
[{"$f":"'Hide this - Workings'!E272","v":""},{"$f":"IF(A74=\"\",\"\",VLOOKUP(A74,'Hide this - Workings'!$C$5:$AJ$202,10,FALSE))","v":""},{"$f":"IF(A74=\"\",\"\",VLOOKUP(A74,'Hide this - Workings'!$C$5:$AJ$202,11,FALSE))","v":""}]
[{"$f":"'Hide this - Workings'!E273","v":""},{"$f":"IF(A75=\"\",\"\",VLOOKUP(A75,'Hide this - Workings'!$C$5:$AJ$202,10,FALSE))","v":""},{"$f":"IF(A75=\"\",\"\",VLOOKUP(A75,'Hide this - Workings'!$C$5:$AJ$202,11,FALSE))","v":""}]
[{"$f":"'Hide this - Workings'!E274","v":""},{"$f":"IF(A76=\"\",\"\",VLOOKUP(A76,'Hide this - Workings'!$C$5:$AJ$202,10,FALSE))","v":""},{"$f":"IF(A76=\"\",\"\",VLOOKUP(A76,'Hide this - Workings'!$C$5:$AJ$202,11,FALSE))","v":""}]
[{"$f":"'Hide this - Workings'!E275","v":""},{"$f":"IF(A77=\"\",\"\",VLOOKUP(A77,'Hide this - Workings'!$C$5:$AJ$202,10,FALSE))","v":""},{"$f":"IF(A77=\"\",\"\",VLOOKUP(A77,'Hide this - Workings'!$C$5:$AJ$202,11,FALSE))","v":""}]
[{"$f":"'Hide this - Workings'!E276","v":""},{"$f":"IF(A78=\"\",\"\",VLOOKUP(A78,'Hide this - Workings'!$C$5:$AJ$202,10,FALSE))","v":""},{"$f":"IF(A78=\"\",\"\",VLOOKUP(A78,'Hide this - Workings'!$C$5:$AJ$202,11,FALSE))","v":""}]
[{"$f":"'Hide this - Workings'!E277","v":""},{"$f":"IF(A79=\"\",\"\",VLOOKUP(A79,'Hide this - Workings'!$C$5:$AJ$202,10,FALSE))","v":""},{"$f":"IF(A79=\"\",\"\",VLOOKUP(A79,'Hide this - Workings'!$C$5:$AJ$202,11,FALSE))","v":""}]
[{"$f":"'Hide this - Workings'!E278","v":""},{"$f":"IF(A80=\"\",\"\",VLOOKUP(A80,'Hide this - Workings'!$C$5:$AJ$202,10,FALSE))","v":""},{"$f":"IF(A80=\"\",\"\",VLOOKUP(A80,'Hide this - Workings'!$C$5:$AJ$202,11,FALSE))","v":""}]
[{"$f":"'Hide this - Workings'!E279","v":""},{"$f":"IF(A81=\"\",\"\",VLOOKUP(A81,'Hide this - Workings'!$C$5:$AJ$202,10,FALSE))","v":""},{"$f":"IF(A81=\"\",\"\",VLOOKUP(A81,'Hide this - Workings'!$C$5:$AJ$202,11,FALSE))","v":""}]
[{"$f":"'Hide this - Workings'!E280","v":""},{"$f":"IF(A82=\"\",\"\",VLOOKUP(A82,'Hide this - Workings'!$C$5:$AJ$202,10,FALSE))","v":""},{"$f":"IF(A82=\"\",\"\",VLOOKUP(A82,'Hide this - Workings'!$C$5:$AJ$202,11,FALSE))","v":""}]
[{"$f":"'Hide this - Workings'!E281","v":""},{"$f":"IF(A83=\"\",\"\",VLOOKUP(A83,'Hide this - Workings'!$C$5:$AJ$202,10,FALSE))","v":""},{"$f":"IF(A83=\"\",\"\",VLOOKUP(A83,'Hide this - Workings'!$C$5:$AJ$202,11,FALSE))","v":""}]
[{"$f":"'Hide this - Workings'!E282","v":""},{"$f":"IF(A84=\"\",\"\",VLOOKUP(A84,'Hide this - Workings'!$C$5:$AJ$202,10,FALSE))","v":""},{"$f":"IF(A84=\"\",\"\",VLOOKUP(A84,'Hide this - Workings'!$C$5:$AJ$202,11,FALSE))","v":""}]
[{"$f":"'Hide this - Workings'!E283","v":""},{"$f":"IF(A85=\"\",\"\",VLOOKUP(A85,'Hide this - Workings'!$C$5:$AJ$202,10,FALSE))","v":""},{"$f":"IF(A85=\"\",\"\",VLOOKUP(A85,'Hide this - Workings'!$C$5:$AJ$202,11,FALSE))","v":""}]
[{"$f":"'Hide this - Workings'!E284","v":""},{"$f":"IF(A86=\"\",\"\",VLOOKUP(A86,'Hide this - Workings'!$C$5:$AJ$202,10,FALSE))","v":""},{"$f":"IF(A86=\"\",\"\",VLOOKUP(A86,'Hide this - Workings'!$C$5:$AJ$202,11,FALSE))","v":""}]
[{"$f":"'Hide this - Workings'!E285","v":""},{"$f":"IF(A87=\"\",\"\",VLOOKUP(A87,'Hide this - Workings'!$C$5:$AJ$202,10,FALSE))","v":""},{"$f":"IF(A87=\"\",\"\",VLOOKUP(A87,'Hide this - Workings'!$C$5:$AJ$202,11,FALSE))","v":""}]
[{"$f":"'Hide this - Workings'!E286","v":""},{"$f":"IF(A88=\"\",\"\",VLOOKUP(A88,'Hide this - Workings'!$C$5:$AJ$202,10,FALSE))","v":""},{"$f":"IF(A88=\"\",\"\",VLOOKUP(A88,'Hide this - Workings'!$C$5:$AJ$202,11,FALSE))","v":""}]
[{"$f":"'Hide this - Workings'!E287","v":""},{"$f":"IF(A89=\"\",\"\",VLOOKUP(A89,'Hide this - Workings'!$C$5:$AJ$202,10,FALSE))","v":""},{"$f":"IF(A89=\"\",\"\",VLOOKUP(A89,'Hide this - Workings'!$C$5:$AJ$202,11,FALSE))","v":""}]
[{"$f":"'Hide this - Workings'!E288","v":""},{"$f":"IF(A90=\"\",\"\",VLOOKUP(A90,'Hide this - Workings'!$C$5:$AJ$202,10,FALSE))","v":""},{"$f":"IF(A90=\"\",\"\",VLOOKUP(A90,'Hide this - Workings'!$C$5:$AJ$202,11,FALSE))","v":""}]
[{"$f":"'Hide this - Workings'!E289","v":""},{"$f":"IF(A91=\"\",\"\",VLOOKUP(A91,'Hide this - Workings'!$C$5:$AJ$202,10,FALSE))","v":""},{"$f":"IF(A91=\"\",\"\",VLOOKUP(A91,'Hide this - Workings'!$C$5:$AJ$202,11,FALSE))","v":""}]
[{"$f":"'Hide this - Workings'!E290","v":""},{"$f":"IF(A92=\"\",\"\",VLOOKUP(A92,'Hide this - Workings'!$C$5:$AJ$202,10,FALSE))","v":""},{"$f":"IF(A92=\"\",\"\",VLOOKUP(A92,'Hide this - Workings'!$C$5:$AJ$202,11,FALSE))","v":""}]
[{"$f":"'Hide this - Workings'!E291","v":""},{"$f":"IF(A93=\"\",\"\",VLOOKUP(A93,'Hide this - Workings'!$C$5:$AJ$202,10,FALSE))","v":""},{"$f":"IF(A93=\"\",\"\",VLOOKUP(A93,'Hide this - Workings'!$C$5:$AJ$202,11,FALSE))","v":""}]
[{"$f":"'Hide this - Workings'!E292","v":""},{"$f":"IF(A94=\"\",\"\",VLOOKUP(A94,'Hide this - Workings'!$C$5:$AJ$202,10,FALSE))","v":""},{"$f":"IF(A94=\"\",\"\",VLOOKUP(A94,'Hide this - Workings'!$C$5:$AJ$202,11,FALSE))","v":""}]
[{"$f":"'Hide this - Workings'!E293","v":""},{"$f":"IF(A95=\"\",\"\",VLOOKUP(A95,'Hide this - Workings'!$C$5:$AJ$202,10,FALSE))","v":""},{"$f":"IF(A95=\"\",\"\",VLOOKUP(A95,'Hide this - Workings'!$C$5:$AJ$202,11,FALSE))","v":""}]
[{"$f":"'Hide this - Workings'!E294","v":""},{"$f":"IF(A96=\"\",\"\",VLOOKUP(A96,'Hide this - Workings'!$C$5:$AJ$202,10,FALSE))","v":""},{"$f":"IF(A96=\"\",\"\",VLOOKUP(A96,'Hide this - Workings'!$C$5:$AJ$202,11,FALSE))","v":""}]
[{"$f":"'Hide this - Workings'!E295","v":""},{"$f":"IF(A97=\"\",\"\",VLOOKUP(A97,'Hide this - Workings'!$C$5:$AJ$202,10,FALSE))","v":""},{"$f":"IF(A97=\"\",\"\",VLOOKUP(A97,'Hide this - Workings'!$C$5:$AJ$202,11,FALSE))","v":""}]
[{"$f":"'Hide this - Workings'!E296","v":""},{"$f":"IF(A98=\"\",\"\",VLOOKUP(A98,'Hide this - Workings'!$C$5:$AJ$202,10,FALSE))","v":""},{"$f":"IF(A98=\"\",\"\",VLOOKUP(A98,'Hide this - Workings'!$C$5:$AJ$202,11,FALSE))","v":""}]
[{"$f":"'Hide this - Workings'!E297","v":""},{"$f":"IF(A99=\"\",\"\",VLOOKUP(A99,'Hide this - Workings'!$C$5:$AJ$202,10,FALSE))","v":""},{"$f":"IF(A99=\"\",\"\",VLOOKUP(A99,'Hide this - Workings'!$C$5:$AJ$202,11,FALSE))","v":""}]
[{"$f":"'Hide this - Workings'!E298","v":""},{"$f":"IF(A100=\"\",\"\",VLOOKUP(A100,'Hide this - Workings'!$C$5:$AJ$202,10,FALSE))","v":""},{"$f":"IF(A100=\"\",\"\",VLOOKUP(A100,'Hide this - Workings'!$C$5:$AJ$202,11,FALSE))","v":""}]
[{"$f":"'Hide this - Workings'!E299","v":""},{"$f":"IF(A101=\"\",\"\",VLOOKUP(A101,'Hide this - Workings'!$C$5:$AJ$202,10,FALSE))","v":""},{"$f":"IF(A101=\"\",\"\",VLOOKUP(A101,'Hide this - Workings'!$C$5:$AJ$202,11,FALSE))","v":""}]
[{"$f":"'Hide this - Workings'!E300","v":""},{"$f":"IF(A102=\"\",\"\",VLOOKUP(A102,'Hide this - Workings'!$C$5:$AJ$202,10,FALSE))","v":""},{"$f":"IF(A102=\"\",\"\",VLOOKUP(A102,'Hide this - Workings'!$C$5:$AJ$202,11,FALSE))","v":""}]
[{"$f":"'Hide this - Workings'!E301","v":""},{"$f":"IF(A103=\"\",\"\",VLOOKUP(A103,'Hide this - Workings'!$C$5:$AJ$202,10,FALSE))","v":""},{"$f":"IF(A103=\"\",\"\",VLOOKUP(A103,'Hide this - Workings'!$C$5:$AJ$202,11,FALSE))","v":""}]
[{"$f":"'Hide this - Workings'!E302","v":""},{"$f":"IF(A104=\"\",\"\",VLOOKUP(A104,'Hide this - Workings'!$C$5:$AJ$202,10,FALSE))","v":""},{"$f":"IF(A104=\"\",\"\",VLOOKUP(A104,'Hide this - Workings'!$C$5:$AJ$202,11,FALSE))","v":""}]
[{"$f":"'Hide this - Workings'!E303","v":""},{"$f":"IF(A105=\"\",\"\",VLOOKUP(A105,'Hide this - Workings'!$C$5:$AJ$202,10,FALSE))","v":""},{"$f":"IF(A105=\"\",\"\",VLOOKUP(A105,'Hide this - Workings'!$C$5:$AJ$202,11,FALSE))","v":""}]
[{"$f":"'Hide this - Workings'!E304","v":""},{"$f":"IF(A106=\"\",\"\",VLOOKUP(A106,'Hide this - Workings'!$C$5:$AJ$202,10,FALSE))","v":""},{"$f":"IF(A106=\"\",\"\",VLOOKUP(A106,'Hide this - Workings'!$C$5:$AJ$202,11,FALSE))","v":""}]
[{"$f":"'Hide this - Workings'!E305","v":""},{"$f":"IF(A107=\"\",\"\",VLOOKUP(A107,'Hide this - Workings'!$C$5:$AJ$202,10,FALSE))","v":""},{"$f":"IF(A107=\"\",\"\",VLOOKUP(A107,'Hide this - Workings'!$C$5:$AJ$202,11,FALSE))","v":""}]
[{"$f":"'Hide this - Workings'!E306","v":""},{"$f":"IF(A108=\"\",\"\",VLOOKUP(A108,'Hide this - Workings'!$C$5:$AJ$202,10,FALSE))","v":""},{"$f":"IF(A108=\"\",\"\",VLOOKUP(A108,'Hide this - Workings'!$C$5:$AJ$202,11,FALSE))","v":""}]
[{"$f":"'Hide this - Workings'!E307","v":""},{"$f":"IF(A109=\"\",\"\",VLOOKUP(A109,'Hide this - Workings'!$C$5:$AJ$202,10,FALSE))","v":""},{"$f":"IF(A109=\"\",\"\",VLOOKUP(A109,'Hide this - Workings'!$C$5:$AJ$202,11,FALSE))","v":""}]
[{"$f":"'Hide this - Workings'!E308","v":""},{"$f":"IF(A110=\"\",\"\",VLOOKUP(A110,'Hide this - Workings'!$C$5:$AJ$202,10,FALSE))","v":""},{"$f":"IF(A110=\"\",\"\",VLOOKUP(A110,'Hide this - Workings'!$C$5:$AJ$202,11,FALSE))","v":""}]
[{"$f":"'Hide this - Workings'!E309","v":""},{"$f":"IF(A111=\"\",\"\",VLOOKUP(A111,'Hide this - Workings'!$C$5:$AJ$202,10,FALSE))","v":""},{"$f":"IF(A111=\"\",\"\",VLOOKUP(A111,'Hide this - Workings'!$C$5:$AJ$202,11,FALSE))","v":""}]
[{"$f":"'Hide this - Workings'!E310","v":""},{"$f":"IF(A112=\"\",\"\",VLOOKUP(A112,'Hide this - Workings'!$C$5:$AJ$202,10,FALSE))","v":""},{"$f":"IF(A112=\"\",\"\",VLOOKUP(A112,'Hide this - Workings'!$C$5:$AJ$202,11,FALSE))","v":""}]
[{"$f":"'Hide this - Workings'!E311","v":""},{"$f":"IF(A113=\"\",\"\",VLOOKUP(A113,'Hide this - Workings'!$C$5:$AJ$202,10,FALSE))","v":""},{"$f":"IF(A113=\"\",\"\",VLOOKUP(A113,'Hide this - Workings'!$C$5:$AJ$202,11,FALSE))","v":""}]
[{"$f":"'Hide this - Workings'!E312","v":""},{"$f":"IF(A114=\"\",\"\",VLOOKUP(A114,'Hide this - Workings'!$C$5:$AJ$202,10,FALSE))","v":""},{"$f":"IF(A114=\"\",\"\",VLOOKUP(A114,'Hide this - Workings'!$C$5:$AJ$202,11,FALSE))","v":""}]
[{"$f":"'Hide this - Workings'!E313","v":""},{"$f":"IF(A115=\"\",\"\",VLOOKUP(A115,'Hide this - Workings'!$C$5:$AJ$202,10,FALSE))","v":""},{"$f":"IF(A115=\"\",\"\",VLOOKUP(A115,'Hide this - Workings'!$C$5:$AJ$202,11,FALSE))","v":""}]
[{"$f":"'Hide this - Workings'!E314","v":""},{"$f":"IF(A116=\"\",\"\",VLOOKUP(A116,'Hide this - Workings'!$C$5:$AJ$202,10,FALSE))","v":""},{"$f":"IF(A116=\"\",\"\",VLOOKUP(A116,'Hide this - Workings'!$C$5:$AJ$202,11,FALSE))","v":""}]
[{"$f":"'Hide this - Workings'!E315","v":""},{"$f":"IF(A117=\"\",\"\",VLOOKUP(A117,'Hide this - Workings'!$C$5:$AJ$202,10,FALSE))","v":""},{"$f":"IF(A117=\"\",\"\",VLOOKUP(A117,'Hide this - Workings'!$C$5:$AJ$202,11,FALSE))","v":""}]
[{"$f":"'Hide this - Workings'!E316","v":""},{"$f":"IF(A118=\"\",\"\",VLOOKUP(A118,'Hide this - Workings'!$C$5:$AJ$202,10,FALSE))","v":""},{"$f":"IF(A118=\"\",\"\",VLOOKUP(A118,'Hide this - Workings'!$C$5:$AJ$202,11,FALSE))","v":""}]
[{"$f":"'Hide this - Workings'!E317","v":""},{"$f":"IF(A119=\"\",\"\",VLOOKUP(A119,'Hide this - Workings'!$C$5:$AJ$202,10,FALSE))","v":""},{"$f":"IF(A119=\"\",\"\",VLOOKUP(A119,'Hide this - Workings'!$C$5:$AJ$202,11,FALSE))","v":""}]
[{"$f":"'Hide this - Workings'!E318","v":""},{"$f":"IF(A120=\"\",\"\",VLOOKUP(A120,'Hide this - Workings'!$C$5:$AJ$202,10,FALSE))","v":""},{"$f":"IF(A120=\"\",\"\",VLOOKUP(A120,'Hide this - Workings'!$C$5:$AJ$202,11,FALSE))","v":""}]
[{"$f":"'Hide this - Workings'!E319","v":""},{"$f":"IF(A121=\"\",\"\",VLOOKUP(A121,'Hide this - Workings'!$C$5:$AJ$202,10,FALSE))","v":""},{"$f":"IF(A121=\"\",\"\",VLOOKUP(A121,'Hide this - Workings'!$C$5:$AJ$202,11,FALSE))","v":""}]
[{"$f":"'Hide this - Workings'!E320","v":""},{"$f":"IF(A122=\"\",\"\",VLOOKUP(A122,'Hide this - Workings'!$C$5:$AJ$202,10,FALSE))","v":""},{"$f":"IF(A122=\"\",\"\",VLOOKUP(A122,'Hide this - Workings'!$C$5:$AJ$202,11,FALSE))","v":""}]
[{"$f":"'Hide this - Workings'!E321","v":""},{"$f":"IF(A123=\"\",\"\",VLOOKUP(A123,'Hide this - Workings'!$C$5:$AJ$202,10,FALSE))","v":""},{"$f":"IF(A123=\"\",\"\",VLOOKUP(A123,'Hide this - Workings'!$C$5:$AJ$202,11,FALSE))","v":""}]
[{"$f":"'Hide this - Workings'!E322","v":""},{"$f":"IF(A124=\"\",\"\",VLOOKUP(A124,'Hide this - Workings'!$C$5:$AJ$202,10,FALSE))","v":""},{"$f":"IF(A124=\"\",\"\",VLOOKUP(A124,'Hide this - Workings'!$C$5:$AJ$202,11,FALSE))","v":""}]
[{"$f":"'Hide this - Workings'!E323","v":""},{"$f":"IF(A125=\"\",\"\",VLOOKUP(A125,'Hide this - Workings'!$C$5:$AJ$202,10,FALSE))","v":""},{"$f":"IF(A125=\"\",\"\",VLOOKUP(A125,'Hide this - Workings'!$C$5:$AJ$202,11,FALSE))","v":""}]
[{"$f":"'Hide this - Workings'!E324","v":""},{"$f":"IF(A126=\"\",\"\",VLOOKUP(A126,'Hide this - Workings'!$C$5:$AJ$202,10,FALSE))","v":""},{"$f":"IF(A126=\"\",\"\",VLOOKUP(A126,'Hide this - Workings'!$C$5:$AJ$202,11,FALSE))","v":""}]
[{"$f":"'Hide this - Workings'!E325","v":""},{"$f":"IF(A127=\"\",\"\",VLOOKUP(A127,'Hide this - Workings'!$C$5:$AJ$202,10,FALSE))","v":""},{"$f":"IF(A127=\"\",\"\",VLOOKUP(A127,'Hide this - Workings'!$C$5:$AJ$202,11,FALSE))","v":""}]
[{"$f":"'Hide this - Workings'!E326","v":""},{"$f":"IF(A128=\"\",\"\",VLOOKUP(A128,'Hide this - Workings'!$C$5:$AJ$202,10,FALSE))","v":""},{"$f":"IF(A128=\"\",\"\",VLOOKUP(A128,'Hide this - Workings'!$C$5:$AJ$202,11,FALSE))","v":""}]
[{"$f":"'Hide this - Workings'!E327","v":""},{"$f":"IF(A129=\"\",\"\",VLOOKUP(A129,'Hide this - Workings'!$C$5:$AJ$202,10,FALSE))","v":""},{"$f":"IF(A129=\"\",\"\",VLOOKUP(A129,'Hide this - Workings'!$C$5:$AJ$202,11,FALSE))","v":""}]
[{"$f":"'Hide this - Workings'!E328","v":""},{"$f":"IF(A130=\"\",\"\",VLOOKUP(A130,'Hide this - Workings'!$C$5:$AJ$202,10,FALSE))","v":""},{"$f":"IF(A130=\"\",\"\",VLOOKUP(A130,'Hide this - Workings'!$C$5:$AJ$202,11,FALSE))","v":""}]
[{"$f":"'Hide this - Workings'!E329","v":""},{"$f":"IF(A131=\"\",\"\",VLOOKUP(A131,'Hide this - Workings'!$C$5:$AJ$202,10,FALSE))","v":""},{"$f":"IF(A131=\"\",\"\",VLOOKUP(A131,'Hide this - Workings'!$C$5:$AJ$202,11,FALSE))","v":""}]
[{"$f":"'Hide this - Workings'!E330","v":""},{"$f":"IF(A132=\"\",\"\",VLOOKUP(A132,'Hide this - Workings'!$C$5:$AJ$202,10,FALSE))","v":""},{"$f":"IF(A132=\"\",\"\",VLOOKUP(A132,'Hide this - Workings'!$C$5:$AJ$202,11,FALSE))","v":""}]
[{"$f":"'Hide this - Workings'!E331","v":""},{"$f":"IF(A133=\"\",\"\",VLOOKUP(A133,'Hide this - Workings'!$C$5:$AJ$202,10,FALSE))","v":""},{"$f":"IF(A133=\"\",\"\",VLOOKUP(A133,'Hide this - Workings'!$C$5:$AJ$202,11,FALSE))","v":""}]
[{"$f":"'Hide this - Workings'!E332","v":""},{"$f":"IF(A134=\"\",\"\",VLOOKUP(A134,'Hide this - Workings'!$C$5:$AJ$202,10,FALSE))","v":""},{"$f":"IF(A134=\"\",\"\",VLOOKUP(A134,'Hide this - Workings'!$C$5:$AJ$202,11,FALSE))","v":""}]
[{"$f":"'Hide this - Workings'!E333","v":""},{"$f":"IF(A135=\"\",\"\",VLOOKUP(A135,'Hide this - Workings'!$C$5:$AJ$202,10,FALSE))","v":""},{"$f":"IF(A135=\"\",\"\",VLOOKUP(A135,'Hide this - Workings'!$C$5:$AJ$202,11,FALSE))","v":""}]
[{"$f":"'Hide this - Workings'!E334","v":""},{"$f":"IF(A136=\"\",\"\",VLOOKUP(A136,'Hide this - Workings'!$C$5:$AJ$202,10,FALSE))","v":""},{"$f":"IF(A136=\"\",\"\",VLOOKUP(A136,'Hide this - Workings'!$C$5:$AJ$202,11,FALSE))","v":""}]
[{"$f":"'Hide this - Workings'!E335","v":""},{"$f":"IF(A137=\"\",\"\",VLOOKUP(A137,'Hide this - Workings'!$C$5:$AJ$202,10,FALSE))","v":""},{"$f":"IF(A137=\"\",\"\",VLOOKUP(A137,'Hide this - Workings'!$C$5:$AJ$202,11,FALSE))","v":""}]
[null,{"$f":"IF(A138=\"\",\"\",VLOOKUP(A138,'Hide this - Workings'!$C$5:$AJ$202,10,FALSE))","v":""},{"$f":"IF(A138=\"\",\"\",VLOOKUP(A138,'Hide this - Workings'!$C$5:$AJ$202,11,FALSE))","v":""}]
[null,{"$f":"IF(A139=\"\",\"\",VLOOKUP(A139,'Hide this - Workings'!$C$5:$AJ$202,10,FALSE))","v":""},{"$f":"IF(A139=\"\",\"\",VLOOKUP(A139,'Hide this - Workings'!$C$5:$AJ$202,11,FALSE))","v":""}]
[null,{"$f":"IF(A140=\"\",\"\",VLOOKUP(A140,'Hide this - Workings'!$C$5:$AJ$202,10,FALSE))","v":""},{"$f":"IF(A140=\"\",\"\",VLOOKUP(A140,'Hide this - Workings'!$C$5:$AJ$202,11,FALSE))","v":""}]
[null,{"$f":"IF(A141=\"\",\"\",VLOOKUP(A141,'Hide this - Workings'!$C$5:$AJ$202,10,FALSE))","v":""},{"$f":"IF(A141=\"\",\"\",VLOOKUP(A141,'Hide this - Workings'!$C$5:$AJ$202,11,FALSE))","v":""}]
[null,{"$f":"IF(A142=\"\",\"\",VLOOKUP(A142,'Hide this - Workings'!$C$5:$AJ$202,10,FALSE))","v":""},{"$f":"IF(A142=\"\",\"\",VLOOKUP(A142,'Hide this - Workings'!$C$5:$AJ$202,11,FALSE))","v":""}]
[null,{"$f":"IF(A143=\"\",\"\",VLOOKUP(A143,'Hide this - Workings'!$C$5:$AJ$202,10,FALSE))","v":""},{"$f":"IF(A143=\"\",\"\",VLOOKUP(A143,'Hide this - Workings'!$C$5:$AJ$202,11,FALSE))","v":""}]
[null,{"$f":"IF(A144=\"\",\"\",VLOOKUP(A144,'Hide this - Workings'!$C$5:$AJ$202,10,FALSE))","v":""},{"$f":"IF(A144=\"\",\"\",VLOOKUP(A144,'Hide this - Workings'!$C$5:$AJ$202,11,FALSE))","v":""}]
[null,{"$f":"IF(A145=\"\",\"\",VLOOKUP(A145,'Hide this - Workings'!$C$5:$AJ$202,10,FALSE))","v":""},{"$f":"IF(A145=\"\",\"\",VLOOKUP(A145,'Hide this - Workings'!$C$5:$AJ$202,11,FALSE))","v":""}]
[null,{"$f":"IF(A146=\"\",\"\",VLOOKUP(A146,'Hide this - Workings'!$C$5:$AJ$202,10,FALSE))","v":""},{"$f":"IF(A146=\"\",\"\",VLOOKUP(A146,'Hide this - Workings'!$C$5:$AJ$202,11,FALSE))","v":""}]
[null,{"$f":"IF(A147=\"\",\"\",VLOOKUP(A147,'Hide this - Workings'!$C$5:$AJ$202,10,FALSE))","v":""},{"$f":"IF(A147=\"\",\"\",VLOOKUP(A147,'Hide this - Workings'!$C$5:$AJ$202,11,FALSE))","v":""}]
[null,{"$f":"IF(A148=\"\",\"\",VLOOKUP(A148,'Hide this - Workings'!$C$5:$AJ$202,10,FALSE))","v":""},{"$f":"IF(A148=\"\",\"\",VLOOKUP(A148,'Hide this - Workings'!$C$5:$AJ$202,11,FALSE))","v":""}]
[null,{"$f":"IF(A149=\"\",\"\",VLOOKUP(A149,'Hide this - Workings'!$C$5:$AJ$202,10,FALSE))","v":""},{"$f":"IF(A149=\"\",\"\",VLOOKUP(A149,'Hide this - Workings'!$C$5:$AJ$202,11,FALSE))","v":""}]
[null,{"$f":"IF(A150=\"\",\"\",VLOOKUP(A150,'Hide this - Workings'!$C$5:$AJ$202,10,FALSE))","v":""},{"$f":"IF(A150=\"\",\"\",VLOOKUP(A150,'Hide this - Workings'!$C$5:$AJ$202,11,FALSE))","v":""}]
[null,{"$f":"IF(A151=\"\",\"\",VLOOKUP(A151,'Hide this - Workings'!$C$5:$AJ$202,10,FALSE))","v":""},{"$f":"IF(A151=\"\",\"\",VLOOKUP(A151,'Hide this - Workings'!$C$5:$AJ$202,11,FALSE))","v":""}]
[null,{"$f":"IF(A152=\"\",\"\",VLOOKUP(A152,'Hide this - Workings'!$C$5:$AJ$202,10,FALSE))","v":""},{"$f":"IF(A152=\"\",\"\",VLOOKUP(A152,'Hide this - Workings'!$C$5:$AJ$202,11,FALSE))","v":""}]
[null,{"$f":"IF(A153=\"\",\"\",VLOOKUP(A153,'Hide this - Workings'!$C$5:$AJ$202,10,FALSE))","v":""},{"$f":"IF(A153=\"\",\"\",VLOOKUP(A153,'Hide this - Workings'!$C$5:$AJ$202,11,FALSE))","v":""}]
[null,{"$f":"IF(A154=\"\",\"\",VLOOKUP(A154,'Hide this - Workings'!$C$5:$AJ$202,10,FALSE))","v":""},{"$f":"IF(A154=\"\",\"\",VLOOKUP(A154,'Hide this - Workings'!$C$5:$AJ$202,11,FALSE))","v":""}]
[null,{"$f":"IF(A155=\"\",\"\",VLOOKUP(A155,'Hide this - Workings'!$C$5:$AJ$202,10,FALSE))","v":""},{"$f":"IF(A155=\"\",\"\",VLOOKUP(A155,'Hide this - Workings'!$C$5:$AJ$202,11,FALSE))","v":""}]
[null,{"$f":"IF(A156=\"\",\"\",VLOOKUP(A156,'Hide this - Workings'!$C$5:$AJ$202,10,FALSE))","v":""},{"$f":"IF(A156=\"\",\"\",VLOOKUP(A156,'Hide this - Workings'!$C$5:$AJ$202,11,FALSE))","v":""}]
[null,{"$f":"IF(A157=\"\",\"\",VLOOKUP(A157,'Hide this - Workings'!$C$5:$AJ$202,10,FALSE))","v":""},{"$f":"IF(A157=\"\",\"\",VLOOKUP(A157,'Hide this - Workings'!$C$5:$AJ$202,11,FALSE))","v":""}]
[null,{"$f":"IF(A158=\"\",\"\",VLOOKUP(A158,'Hide this - Workings'!$C$5:$AJ$202,10,FALSE))","v":""},{"$f":"IF(A158=\"\",\"\",VLOOKUP(A158,'Hide this - Workings'!$C$5:$AJ$202,11,FALSE))","v":""}]
[null,{"$f":"IF(A159=\"\",\"\",VLOOKUP(A159,'Hide this - Workings'!$C$5:$AJ$202,10,FALSE))","v":""},{"$f":"IF(A159=\"\",\"\",VLOOKUP(A159,'Hide this - Workings'!$C$5:$AJ$202,11,FALSE))","v":""}]
[null,{"$f":"IF(A160=\"\",\"\",VLOOKUP(A160,'Hide this - Workings'!$C$5:$AJ$202,10,FALSE))","v":""},{"$f":"IF(A160=\"\",\"\",VLOOKUP(A160,'Hide this - Workings'!$C$5:$AJ$202,11,FALSE))","v":""}]
[null,{"$f":"IF(A161=\"\",\"\",VLOOKUP(A161,'Hide this - Workings'!$C$5:$AJ$202,10,FALSE))","v":""},{"$f":"IF(A161=\"\",\"\",VLOOKUP(A161,'Hide this - Workings'!$C$5:$AJ$202,11,FALSE))","v":""}]
[null,{"$f":"IF(A162=\"\",\"\",VLOOKUP(A162,'Hide this - Workings'!$C$5:$AJ$202,10,FALSE))","v":""},{"$f":"IF(A162=\"\",\"\",VLOOKUP(A162,'Hide this - Workings'!$C$5:$AJ$202,11,FALSE))","v":""}]
[null,{"$f":"IF(A163=\"\",\"\",VLOOKUP(A163,'Hide this - Workings'!$C$5:$AJ$202,10,FALSE))","v":""},{"$f":"IF(A163=\"\",\"\",VLOOKUP(A163,'Hide this - Workings'!$C$5:$AJ$202,11,FALSE))","v":""}]
[null,{"$f":"IF(A164=\"\",\"\",VLOOKUP(A164,'Hide this - Workings'!$C$5:$AJ$202,10,FALSE))","v":""},{"$f":"IF(A164=\"\",\"\",VLOOKUP(A164,'Hide this - Workings'!$C$5:$AJ$202,11,FALSE))","v":""}]
[null,{"$f":"IF(A165=\"\",\"\",VLOOKUP(A165,'Hide this - Workings'!$C$5:$AJ$202,10,FALSE))","v":""},{"$f":"IF(A165=\"\",\"\",VLOOKUP(A165,'Hide this - Workings'!$C$5:$AJ$202,11,FALSE))","v":""}]
[null,{"$f":"IF(A166=\"\",\"\",VLOOKUP(A166,'Hide this - Workings'!$C$5:$AJ$202,10,FALSE))","v":""},{"$f":"IF(A166=\"\",\"\",VLOOKUP(A166,'Hide this - Workings'!$C$5:$AJ$202,11,FALSE))","v":""}]
[null,{"$f":"IF(A167=\"\",\"\",VLOOKUP(A167,'Hide this - Workings'!$C$5:$AJ$202,10,FALSE))","v":""},{"$f":"IF(A167=\"\",\"\",VLOOKUP(A167,'Hide this - Workings'!$C$5:$AJ$202,11,FALSE))","v":""}]
[null,{"$f":"IF(A168=\"\",\"\",VLOOKUP(A168,'Hide this - Workings'!$C$5:$AJ$202,10,FALSE))","v":""},{"$f":"IF(A168=\"\",\"\",VLOOKUP(A168,'Hide this - Workings'!$C$5:$AJ$202,11,FALSE))","v":""}]
[null,{"$f":"IF(A169=\"\",\"\",VLOOKUP(A169,'Hide this - Workings'!$C$5:$AJ$202,10,FALSE))","v":""},{"$f":"IF(A169=\"\",\"\",VLOOKUP(A169,'Hide this - Workings'!$C$5:$AJ$202,11,FALSE))","v":""}]
[null,{"$f":"IF(A170=\"\",\"\",VLOOKUP(A170,'Hide this - Workings'!$C$5:$AJ$202,10,FALSE))","v":""},{"$f":"IF(A170=\"\",\"\",VLOOKUP(A170,'Hide this - Workings'!$C$5:$AJ$202,11,FALSE))","v":""}]
[null,{"$f":"IF(A171=\"\",\"\",VLOOKUP(A171,'Hide this - Workings'!$C$5:$AJ$202,10,FALSE))","v":""},{"$f":"IF(A171=\"\",\"\",VLOOKUP(A171,'Hide this - Workings'!$C$5:$AJ$202,11,FALSE))","v":""}]
[null,{"$f":"IF(A172=\"\",\"\",VLOOKUP(A172,'Hide this - Workings'!$C$5:$AJ$202,10,FALSE))","v":""},{"$f":"IF(A172=\"\",\"\",VLOOKUP(A172,'Hide this - Workings'!$C$5:$AJ$202,11,FALSE))","v":""}]
[null,{"$f":"IF(A173=\"\",\"\",VLOOKUP(A173,'Hide this - Workings'!$C$5:$AJ$202,10,FALSE))","v":""},{"$f":"IF(A173=\"\",\"\",VLOOKUP(A173,'Hide this - Workings'!$C$5:$AJ$202,11,FALSE))","v":""}]
[null,{"$f":"IF(A174=\"\",\"\",VLOOKUP(A174,'Hide this - Workings'!$C$5:$AJ$202,10,FALSE))","v":""},{"$f":"IF(A174=\"\",\"\",VLOOKUP(A174,'Hide this - Workings'!$C$5:$AJ$202,11,FALSE))","v":""}]
[null,{"$f":"IF(A175=\"\",\"\",VLOOKUP(A175,'Hide this - Workings'!$C$5:$AJ$202,10,FALSE))","v":""},{"$f":"IF(A175=\"\",\"\",VLOOKUP(A175,'Hide this - Workings'!$C$5:$AJ$202,11,FALSE))","v":""}]
[null,{"$f":"IF(A176=\"\",\"\",VLOOKUP(A176,'Hide this - Workings'!$C$5:$AJ$202,10,FALSE))","v":""},{"$f":"IF(A176=\"\",\"\",VLOOKUP(A176,'Hide this - Workings'!$C$5:$AJ$202,11,FALSE))","v":""}]
[null,{"$f":"IF(A177=\"\",\"\",VLOOKUP(A177,'Hide this - Workings'!$C$5:$AJ$202,10,FALSE))","v":""},{"$f":"IF(A177=\"\",\"\",VLOOKUP(A177,'Hide this - Workings'!$C$5:$AJ$202,11,FALSE))","v":""}]
[null,{"$f":"IF(A178=\"\",\"\",VLOOKUP(A178,'Hide this - Workings'!$C$5:$AJ$202,10,FALSE))","v":""},{"$f":"IF(A178=\"\",\"\",VLOOKUP(A178,'Hide this - Workings'!$C$5:$AJ$202,11,FALSE))","v":""}]
[null,{"$f":"IF(A179=\"\",\"\",VLOOKUP(A179,'Hide this - Workings'!$C$5:$AJ$202,10,FALSE))","v":""},{"$f":"IF(A179=\"\",\"\",VLOOKUP(A179,'Hide this - Workings'!$C$5:$AJ$202,11,FALSE))","v":""}]
[null,{"$f":"IF(A180=\"\",\"\",VLOOKUP(A180,'Hide this - Workings'!$C$5:$AJ$202,10,FALSE))","v":""},{"$f":"IF(A180=\"\",\"\",VLOOKUP(A180,'Hide this - Workings'!$C$5:$AJ$202,11,FALSE))","v":""}]
[null,{"$f":"IF(A181=\"\",\"\",VLOOKUP(A181,'Hide this - Workings'!$C$5:$AJ$202,10,FALSE))","v":""},{"$f":"IF(A181=\"\",\"\",VLOOKUP(A181,'Hide this - Workings'!$C$5:$AJ$202,11,FALSE))","v":""}]
[null,{"$f":"IF(A182=\"\",\"\",VLOOKUP(A182,'Hide this - Workings'!$C$5:$AJ$202,10,FALSE))","v":""},{"$f":"IF(A182=\"\",\"\",VLOOKUP(A182,'Hide this - Workings'!$C$5:$AJ$202,11,FALSE))","v":""}]
[null,{"$f":"IF(A183=\"\",\"\",VLOOKUP(A183,'Hide this - Workings'!$C$5:$AJ$202,10,FALSE))","v":""},{"$f":"IF(A183=\"\",\"\",VLOOKUP(A183,'Hide this - Workings'!$C$5:$AJ$202,11,FALSE))","v":""}]
[null,{"$f":"IF(A184=\"\",\"\",VLOOKUP(A184,'Hide this - Workings'!$C$5:$AJ$202,10,FALSE))","v":""},{"$f":"IF(A184=\"\",\"\",VLOOKUP(A184,'Hide this - Workings'!$C$5:$AJ$202,11,FALSE))","v":""}]
[null,{"$f":"IF(A185=\"\",\"\",VLOOKUP(A185,'Hide this - Workings'!$C$5:$AJ$202,10,FALSE))","v":""},{"$f":"IF(A185=\"\",\"\",VLOOKUP(A185,'Hide this - Workings'!$C$5:$AJ$202,11,FALSE))","v":""}]
[null,{"$f":"IF(A186=\"\",\"\",VLOOKUP(A186,'Hide this - Workings'!$C$5:$AJ$202,10,FALSE))","v":""},{"$f":"IF(A186=\"\",\"\",VLOOKUP(A186,'Hide this - Workings'!$C$5:$AJ$202,11,FALSE))","v":""}]
[null,{"$f":"IF(A187=\"\",\"\",VLOOKUP(A187,'Hide this - Workings'!$C$5:$AJ$202,10,FALSE))","v":""},{"$f":"IF(A187=\"\",\"\",VLOOKUP(A187,'Hide this - Workings'!$C$5:$AJ$202,11,FALSE))","v":""}]
[null,{"$f":"IF(A188=\"\",\"\",VLOOKUP(A188,'Hide this - Workings'!$C$5:$AJ$202,10,FALSE))","v":""},{"$f":"IF(A188=\"\",\"\",VLOOKUP(A188,'Hide this - Workings'!$C$5:$AJ$202,11,FALSE))","v":""}]
[null,{"$f":"IF(A189=\"\",\"\",VLOOKUP(A189,'Hide this - Workings'!$C$5:$AJ$202,10,FALSE))","v":""},{"$f":"IF(A189=\"\",\"\",VLOOKUP(A189,'Hide this - Workings'!$C$5:$AJ$202,11,FALSE))","v":""}]
[null,{"$f":"IF(A190=\"\",\"\",VLOOKUP(A190,'Hide this - Workings'!$C$5:$AJ$202,10,FALSE))","v":""},{"$f":"IF(A190=\"\",\"\",VLOOKUP(A190,'Hide this - Workings'!$C$5:$AJ$202,11,FALSE))","v":""}]
[null,{"$f":"IF(A191=\"\",\"\",VLOOKUP(A191,'Hide this - Workings'!$C$5:$AJ$202,10,FALSE))","v":""},{"$f":"IF(A191=\"\",\"\",VLOOKUP(A191,'Hide this - Workings'!$C$5:$AJ$202,11,FALSE))","v":""}]
[null,{"$f":"IF(A192=\"\",\"\",VLOOKUP(A192,'Hide this - Workings'!$C$5:$AJ$202,10,FALSE))","v":""},{"$f":"IF(A192=\"\",\"\",VLOOKUP(A192,'Hide this - Workings'!$C$5:$AJ$202,11,FALSE))","v":""}]
[null,{"$f":"IF(A193=\"\",\"\",VLOOKUP(A193,'Hide this - Workings'!$C$5:$AJ$202,10,FALSE))","v":""},{"$f":"IF(A193=\"\",\"\",VLOOKUP(A193,'Hide this - Workings'!$C$5:$AJ$202,11,FALSE))","v":""}]
[null,{"$f":"IF(A194=\"\",\"\",VLOOKUP(A194,'Hide this - Workings'!$C$5:$AJ$202,10,FALSE))","v":""},{"$f":"IF(A194=\"\",\"\",VLOOKUP(A194,'Hide this - Workings'!$C$5:$AJ$202,11,FALSE))","v":""}]
[null,{"$f":"IF(A195=\"\",\"\",VLOOKUP(A195,'Hide this - Workings'!$C$5:$AJ$202,10,FALSE))","v":""},{"$f":"IF(A195=\"\",\"\",VLOOKUP(A195,'Hide this - Workings'!$C$5:$AJ$202,11,FALSE))","v":""}]
[null,{"$f":"IF(A196=\"\",\"\",VLOOKUP(A196,'Hide this - Workings'!$C$5:$AJ$202,10,FALSE))","v":""},{"$f":"IF(A196=\"\",\"\",VLOOKUP(A196,'Hide this - Workings'!$C$5:$AJ$202,11,FALSE))","v":""}]
[null,{"$f":"IF(A197=\"\",\"\",VLOOKUP(A197,'Hide this - Workings'!$C$5:$AJ$202,10,FALSE))","v":""},{"$f":"IF(A197=\"\",\"\",VLOOKUP(A197,'Hide this - Workings'!$C$5:$AJ$202,11,FALSE))","v":""}]
[null,{"$f":"IF(A198=\"\",\"\",VLOOKUP(A198,'Hide this - Workings'!$C$5:$AJ$202,10,FALSE))","v":""},{"$f":"IF(A198=\"\",\"\",VLOOKUP(A198,'Hide this - Workings'!$C$5:$AJ$202,11,FALSE))","v":""}]
[null,{"$f":"IF(A199=\"\",\"\",VLOOKUP(A199,'Hide this - Workings'!$C$5:$AJ$202,10,FALSE))","v":""},{"$f":"IF(A199=\"\",\"\",VLOOKUP(A199,'Hide this - Workings'!$C$5:$AJ$202,11,FALSE))","v":""}]
[null,{"$f":"IF(A200=\"\",\"\",VLOOKUP(A200,'Hide this - Workings'!$C$5:$AJ$202,10,FALSE))","v":""},{"$f":"IF(A200=\"\",\"\",VLOOKUP(A200,'Hide this - Workings'!$C$5:$AJ$202,11,FALSE))","v":""}]
[null,{"$f":"IF(A201=\"\",\"\",VLOOKUP(A201,'Hide this - Workings'!$C$5:$AJ$202,10,FALSE))","v":""},{"$f":"IF(A201=\"\",\"\",VLOOKUP(A201,'Hide this - Workings'!$C$5:$AJ$202,11,FALSE))","v":""}]
[null,{"$f":"IF(A202=\"\",\"\",VLOOKUP(A202,'Hide this - Workings'!$C$5:$AJ$202,10,FALSE))","v":""},{"$f":"IF(A202=\"\",\"\",VLOOKUP(A202,'Hide this - Workings'!$C$5:$AJ$202,11,FALSE))","v":""}]
[null,{"$f":"IF(A203=\"\",\"\",VLOOKUP(A203,'Hide this - Workings'!$C$5:$AJ$202,10,FALSE))","v":""},{"$f":"IF(A203=\"\",\"\",VLOOKUP(A203,'Hide this - Workings'!$C$5:$AJ$202,11,FALSE))","v":""}]
[null,{"$f":"IF(A204=\"\",\"\",VLOOKUP(A204,'Hide this - Workings'!$C$5:$AJ$202,10,FALSE))","v":""},{"$f":"IF(A204=\"\",\"\",VLOOKUP(A204,'Hide this - Workings'!$C$5:$AJ$202,11,FALSE))","v":""}]
[null,{"$f":"IF(A205=\"\",\"\",VLOOKUP(A205,'Hide this - Workings'!$C$5:$AJ$202,10,FALSE))","v":""},{"$f":"IF(A205=\"\",\"\",VLOOKUP(A205,'Hide this - Workings'!$C$5:$AJ$202,11,FALSE))","v":""}]
[null,{"$f":"IF(A206=\"\",\"\",VLOOKUP(A206,'Hide this - Workings'!$C$5:$AJ$202,10,FALSE))","v":""},{"$f":"IF(A206=\"\",\"\",VLOOKUP(A206,'Hide this - Workings'!$C$5:$AJ$202,11,FALSE))","v":""}]
[null,{"$f":"IF(A207=\"\",\"\",VLOOKUP(A207,'Hide this - Workings'!$C$5:$AJ$202,10,FALSE))","v":""},{"$f":"IF(A207=\"\",\"\",VLOOKUP(A207,'Hide this - Workings'!$C$5:$AJ$202,11,FALSE))","v":""}]
[null,{"$f":"IF(A208=\"\",\"\",VLOOKUP(A208,'Hide this - Workings'!$C$5:$AJ$202,10,FALSE))","v":""},{"$f":"IF(A208=\"\",\"\",VLOOKUP(A208,'Hide this - Workings'!$C$5:$AJ$202,11,FALSE))","v":""}]
[null,{"$f":"IF(A209=\"\",\"\",VLOOKUP(A209,'Hide this - Workings'!$C$5:$AJ$202,10,FALSE))","v":""},{"$f":"IF(A209=\"\",\"\",VLOOKUP(A209,'Hide this - Workings'!$C$5:$AJ$202,11,FALSE))","v":""}]
[null,{"$f":"IF(A210=\"\",\"\",VLOOKUP(A210,'Hide this - Workings'!$C$5:$AJ$202,10,FALSE))","v":""},{"$f":"IF(A210=\"\",\"\",VLOOKUP(A210,'Hide this - Workings'!$C$5:$AJ$202,11,FALSE))","v":""}]
[null,{"$f":"IF(A211=\"\",\"\",VLOOKUP(A211,'Hide this - Workings'!$C$5:$AJ$202,10,FALSE))","v":""},{"$f":"IF(A211=\"\",\"\",VLOOKUP(A211,'Hide this - Workings'!$C$5:$AJ$202,11,FALSE))","v":""}]
[null,{"$f":"IF(A212=\"\",\"\",VLOOKUP(A212,'Hide this - Workings'!$C$5:$AJ$202,10,FALSE))","v":""},{"$f":"IF(A212=\"\",\"\",VLOOKUP(A212,'Hide this - Workings'!$C$5:$AJ$202,11,FALSE))","v":""}]
[null,{"$f":"IF(A213=\"\",\"\",VLOOKUP(A213,'Hide this - Workings'!$C$5:$AJ$202,10,FALSE))","v":""},{"$f":"IF(A213=\"\",\"\",VLOOKUP(A213,'Hide this - Workings'!$C$5:$AJ$202,11,FALSE))","v":""}]
[null,{"$f":"IF(A214=\"\",\"\",VLOOKUP(A214,'Hide this - Workings'!$C$5:$AJ$202,10,FALSE))","v":""},{"$f":"IF(A214=\"\",\"\",VLOOKUP(A214,'Hide this - Workings'!$C$5:$AJ$202,11,FALSE))","v":""}]
[null,{"$f":"IF(A215=\"\",\"\",VLOOKUP(A215,'Hide this - Workings'!$C$5:$AJ$202,10,FALSE))","v":""},{"$f":"IF(A215=\"\",\"\",VLOOKUP(A215,'Hide this - Workings'!$C$5:$AJ$202,11,FALSE))","v":""}]

{"sheet":"Hide this - Workings","index":2,"n_rows":435,"n_cols":39,"rows_kept":435,"cut":false,"hidden":true,"merged":[[2,13,2,29]]}
[null,null,"Ref number (this will need expanding as the number of FAQs increases)"]
[null,null,{"$f":"_xlfn.CONCAT(C5:C198)","v":""},{"$f":"(LEN(C2))","v":0},{"$f":"+D2/4","v":0},"if we get beyond 200 FAQs, formulas and sheet will need to be expanded - there is a limit about 250 that this formula can count"]
[null,null,null,null,null,null,null,null,null,null,null,null,null,"Check if in FAQ"]
["Number of search terms entered","Number of matches required to display FAQ","Relevant Ref #s here","List of questions and answers - for search",null,null,null,null,null,null,null,"List of Questions to display","List of Answers to display",null,null,null,null,null,null,null,null,null,null,null,null,null,null,null,null,null,"Number of search terms found"]
[{"$f":"AL435","v":0},{"$f":"A5*0.5","v":0},{"$f":"IF((IFERROR(AE5,0))>$B$5,AF5,\"\")","v":""},{"$f":"L5&\" \"&M5","v":"Why isn’t ‘short term support to maximise independence’ just called ‘reablement’? There is no nationally agreed definition for what constitutes ‘reablement’. Local authorities will be offering a range of services that are of short duration (typically being provided for a few weeks) and have the explicit aim of trying to minimise the person’s use of ongoing social care services, i.e., maximise independence and the improved level of independence should continue even after the service is removed (some ongoing support may still be required of course). This is why equipment or telecare should not be seen as a ‘Short term support to maximise independence’ in SALT – it remains with the client and provides low level support on an ongoing basis, but without it, the client would lose whatever benefits the service provides\n"},null,null,null,null,null,null,null,"Why isn’t ‘short term support to maximise independence’ just called ‘reablement’?","There is no nationally agreed definition for what constitutes ‘reablement’. Local authorities will be offering a range of services that are of short duration (typically being provided for a few weeks) and have the explicit aim of trying to minimise the person’s use of ongoing social care services, i.e., maximise independence and the improved level of independence should continue even after the service is removed (some ongoing support may still be required of course). This is why equipment or telecare should not be seen as a ‘Short term support to maximise independence’ in SALT – it remains with the client and provides low level support on an ongoing basis, but without it, the client would lose whatever benefits the service provides\n",{"$f":"IF($AL$417=1,IF(ISNUMBER(SEARCH($AK$417,'Hide this - Workings'!D5)),1,0),\"\")","v":""},{"$f":"IF($AL$418=1,IF(ISNUMBER(SEARCH($AK$418,'Hide this - Workings'!D5)),1,0),\"\")","v":""},{"$f":"IF($AL$419=1,IF(ISNUMBER(SEARCH($AK$419,'Hide this - Workings'!D5)),1,0),\"\")","v":""},{"$f":"IF($AL$420=1,IF(ISNUMBER(SEARCH($AK$420,'Hide this - Workings'!D5)),1,0),\"\")","v":""},{"$f":"IF($AL$421=1,IF(ISNUMBER(SEARCH($AK$421,'Hide this - Workings'!D5)),1,0),\"\")","v":""},{"$f":"IF($AL$422=1,IF(ISNUMBER(SEARCH($AK$422,'Hide this - Workings'!D5)),1,0),\"\")","v":""},{"$f":"IF($AL$423=1,IF(ISNUMBER(SEARCH($AK$423,'Hide this - Workings'!D5)),1,0),\"\")","v":""},{"$f":"IF($AL$424=1,IF(ISNUMBER(SEARCH($AK$424,'Hide this - Workings'!D5)),1,0),\"\")","v":""},{"$f":"IF($AL$425=1,IF(ISNUMBER(SEARCH($AK$425,'Hide this - Workings'!D5)),1,0),\"\")","v":""},{"$f":"IF($AL$426=1,IF(ISNUMBER(SEARCH($AK$426,'Hide this - Workings'!D5)),1,0),\"\")","v":""},{"$f":"IF($AL$427=1,IF(ISNUMBER(SEARCH($AK$427,'Hide this - Workings'!D5)),1,0),\"\")","v":""},{"$f":"IF($AL$428=1,IF(ISNUMBER(SEARCH($AK$428,'Hide this - Workings'!D5)),1,0),\"\")","v":""},{"$f":"IF($AL$429=1,IF(ISNUMBER(SEARCH($AK$429,'Hide this - Workings'!D5)),1,0),\"\")","v":""},{"$f":"IF($AL$430=1,IF(ISNUMBER(SEARCH($AK$430,'Hide this - Workings'!D5)),1,0),\"\")","v":""},{"$f":"IF($AL$431=1,IF(ISNUMBER(SEARCH($AK$431,'Hide this - Workings'!D5)),1,0),\"\")","v":""},{"$f":"IF($AL$432=1,IF(ISNUMBER(SEARCH($AK$432,'Hide this - Workings'!D5)),1,0),\"\")","v":""},{"$f":"IF($AL$433=1,IF(ISNUMBER(SEARCH($AK$433,'Hide this - Workings'!D5)),1,0),\"\")","v":""},{"$f":"SUM(N5:AD5)","v":0},"A001",{"$f":"AE5","v":0},{"$f":"IF((IFERROR(N5,0))>1,D5,\"\")","v":"Why isn’t ‘short term support to maximise independence’ just called ‘reablement’? There is no nationally agreed definition for what constitutes ‘reablement’. Local authorities will be offering a range of services that are of short duration (typically being provided for a few weeks) and have the explicit aim of trying to minimise the person’s use of ongoing social care services, i.e., maximise independence and the improved level of independence should continue even after the service is removed (some ongoing support may still be required of course). This is why equipment or telecare should not be seen as a ‘Short term support to maximise independence’ in SALT – it remains with the client and provides low level support on an ongoing basis, but without it, the client would lose whatever benefits the service provides\n"},{"$f":"IF((IFERROR(N5,0))>1,L5,\"\")","v":"Why isn’t ‘short term support to maximise independence’ just called ‘reablement’?"},{"$f":"IF((IFERROR(N5,0))>1,M5,\"\")","v":"There is no nationally agreed definition for what constitutes ‘reablement’. Local authorities will be offering a range of services that are of short duration (typically being provided for a few weeks) and have the explicit aim of trying to minimise the person’s use of ongoing social care services, i.e., maximise independence and the improved level of independence should continue even after the service is removed (some ongoing support may still be required of course). This is why equipment or telecare should not be seen as a ‘Short term support to maximise independence’ in SALT – it remains with the client and provides low level support on an ongoing basis, but without it, the client would lose whatever benefits the service provides\n"}]
[null,null,{"$f":"IF((IFERROR(AE6,0))>$B$5,AF6,\"\")","v":""},"How long should I wait to determine the outcome of a 'request for support' before recording on STS001? Each client’s case is different and before recording on STS001, the sequel needs to be clear. This may mean waiting several weeks for the outcome of a full assessment. If the sequel is not known before the year end (31st March) then that request for support should be counted in the following year.\n",null,null,null,null,null,null,null,"How long should I wait to determine the outcome of a 'request for support' before recording on STS001?","Each client’s case is different and before recording on STS001, the sequel needs to be clear. This may mean waiting several weeks for the outcome of a full assessment. If the sequel is not known before the year end (31st March) then that request for support should be counted in the following year.\n",{"$f":"IF($AL$417=1,IF(ISNUMBER(SEARCH($AK$417,'Hide this - Workings'!D6)),1,0),\"\")","v":""},{"$f":"IF($AL$418=1,IF(ISNUMBER(SEARCH($AK$418,'Hide this - Workings'!D6)),1,0),\"\")","v":""},{"$f":"IF($AL$419=1,IF(ISNUMBER(SEARCH($AK$419,'Hide this - Workings'!D6)),1,0),\"\")","v":""},{"$f":"IF($AL$420=1,IF(ISNUMBER(SEARCH($AK$420,'Hide this - Workings'!D6)),1,0),\"\")","v":""},{"$f":"IF($AL$421=1,IF(ISNUMBER(SEARCH($AK$421,'Hide this - Workings'!D6)),1,0),\"\")","v":""},{"$f":"IF($AL$422=1,IF(ISNUMBER(SEARCH($AK$422,'Hide this - Workings'!D6)),1,0),\"\")","v":""},{"$f":"IF($AL$423=1,IF(ISNUMBER(SEARCH($AK$423,'Hide this - Workings'!D6)),1,0),\"\")","v":""},{"$f":"IF($AL$424=1,IF(ISNUMBER(SEARCH($AK$424,'Hide this - Workings'!D6)),1,0),\"\")","v":""},{"$f":"IF($AL$425=1,IF(ISNUMBER(SEARCH($AK$425,'Hide this - Workings'!D6)),1,0),\"\")","v":""},{"$f":"IF($AL$426=1,IF(ISNUMBER(SEARCH($AK$426,'Hide this - Workings'!D6)),1,0),\"\")","v":""},{"$f":"IF($AL$427=1,IF(ISNUMBER(SEARCH($AK$427,'Hide this - Workings'!D6)),1,0),\"\")","v":""},{"$f":"IF($AL$428=1,IF(ISNUMBER(SEARCH($AK$428,'Hide this - Workings'!D6)),1,0),\"\")","v":""},{"$f":"IF($AL$429=1,IF(ISNUMBER(SEARCH($AK$429,'Hide this - Workings'!D6)),1,0),\"\")","v":""},{"$f":"IF($AL$430=1,IF(ISNUMBER(SEARCH($AK$430,'Hide this - Workings'!D6)),1,0),\"\")","v":""},{"$f":"IF($AL$431=1,IF(ISNUMBER(SEARCH($AK$431,'Hide this - Workings'!D6)),1,0),\"\")","v":""},{"$f":"IF($AL$432=1,IF(ISNUMBER(SEARCH($AK$432,'Hide this - Workings'!D6)),1,0),\"\")","v":""},{"$f":"IF($AL$433=1,IF(ISNUMBER(SEARCH($AK$433,'Hide this - Workings'!D6)),1,0),\"\")","v":""},{"$f":"SUM(N6:AD6)","v":0},"A002",{"$f":"AE6","v":0},{"$f":"IF((IFERROR(N6,0))>1,D6,\"\")","v":"How long should I wait to determine the outcome of a 'request for support' before recording on STS001? Each client’s case is different and before recording on STS001, the sequel needs to be clear. This may mean waiting several weeks for the outcome of a full assessment. If the sequel is not known before the year end (31st March) then that request for support should be counted in the following year.\n"},"How long should I wait to determine the outcome of a 'request for support' before recording on STS001?","Each client’s case is different and before recording on STS001, the sequel needs to be clear. This may mean waiting several weeks for the outcome of a full assessment. If the sequel is not known before the year end (31st March) then that request for support should be counted in the following year.\n"]
[null,null,"","Where do we include the provision of blue badges? Blue badges are ‘universal services’ and this sequel should therefore be recorded for STS001. Remember though that only one sequel can be recorded. If several sequels apply to any particular request for support, there is a hierarchy for determining which sequel to count for STS001. The hierarchy is the same as the ordering of columns (from left to right) within the STS001 tables (refer to the section on Hierarchy of Sequels for STS001 in the guidance). [STS001]\n",null,null,null,null,null,null,null,"Where do we include the provision of blue badges?","Blue badges are ‘universal services’ and this sequel should therefore be recorded for STS001. Remember though that only one sequel can be recorded. If several sequels apply to any particular request for support, there is a hierarchy for determining which sequel to count for STS001. The hierarchy is the same as the ordering of columns (from left to right) within the STS001 tables (refer to the section on Hierarchy of Sequels for STS001 in the guidance). [STS001]\n",{"$f":"IF($AL$417=1,IF(ISNUMBER(SEARCH($AK$417,'Hide this - Workings'!D7)),1,0),\"\")","v":""},{"$f":"IF($AL$418=1,IF(ISNUMBER(SEARCH($AK$418,'Hide this - Workings'!D7)),1,0),\"\")","v":""},{"$f":"IF($AL$419=1,IF(ISNUMBER(SEARCH($AK$419,'Hide this - Workings'!D7)),1,0),\"\")","v":""},{"$f":"IF($AL$420=1,IF(ISNUMBER(SEARCH($AK$420,'Hide this - Workings'!D7)),1,0),\"\")","v":""},{"$f":"IF($AL$421=1,IF(ISNUMBER(SEARCH($AK$421,'Hide this - Workings'!D7)),1,0),\"\")","v":""},{"$f":"IF($AL$422=1,IF(ISNUMBER(SEARCH($AK$422,'Hide this - Workings'!D7)),1,0),\"\")","v":""},{"$f":"IF($AL$423=1,IF(ISNUMBER(SEARCH($AK$423,'Hide this - Workings'!D7)),1,0),\"\")","v":""},{"$f":"IF($AL$424=1,IF(ISNUMBER(SEARCH($AK$424,'Hide this - Workings'!D7)),1,0),\"\")","v":""},{"$f":"IF($AL$425=1,IF(ISNUMBER(SEARCH($AK$425,'Hide this - Workings'!D7)),1,0),\"\")","v":""},{"$f":"IF($AL$426=1,IF(ISNUMBER(SEARCH($AK$426,'Hide this - Workings'!D7)),1,0),\"\")","v":""},{"$f":"IF($AL$427=1,IF(ISNUMBER(SEARCH($AK$427,'Hide this - Workings'!D7)),1,0),\"\")","v":""},{"$f":"IF($AL$428=1,IF(ISNUMBER(SEARCH($AK$428,'Hide this - Workings'!D7)),1,0),\"\")","v":""},{"$f":"IF($AL$429=1,IF(ISNUMBER(SEARCH($AK$429,'Hide this - Workings'!D7)),1,0),\"\")","v":""},{"$f":"IF($AL$430=1,IF(ISNUMBER(SEARCH($AK$430,'Hide this - Workings'!D7)),1,0),\"\")","v":""},{"$f":"IF($AL$431=1,IF(ISNUMBER(SEARCH($AK$431,'Hide this - Workings'!D7)),1,0),\"\")","v":""},{"$f":"IF($AL$432=1,IF(ISNUMBER(SEARCH($AK$432,'Hide this - Workings'!D7)),1,0),\"\")","v":""},{"$f":"IF($AL$433=1,IF(ISNUMBER(SEARCH($AK$433,'Hide this - Workings'!D7)),1,0),\"\")","v":""},0,"A003",0,"Where do we include the provision of blue badges? Blue badges are ‘universal services’ and this sequel should therefore be recorded for STS001. Remember though that only one sequel can be recorded. If several sequels apply to any particular request for support, there is a hierarchy for determining which sequel to count for STS001. The hierarchy is the same as the ordering of columns (from left to right) within the STS001 tables (refer to the section on Hierarchy of Sequels for STS001 in the guidance). [STS001]\n","Where do we include the provision of blue badges?","Blue badges are ‘universal services’ and this sequel should therefore be recorded for STS001. Remember though that only one sequel can be recorded. If several sequels apply to any particular request for support, there is a hierarchy for determining which sequel to count for STS001. The hierarchy is the same as the ordering of columns (from left to right) within the STS001 tables (refer to the section on Hierarchy of Sequels for STS001 in the guidance). [STS001]\n"]
[null,null,"","Where do we include the provision of National Bus and / or Freedom Passes? National Bus and Freedom passes are not seen as social care support which matches the way they were considered within the previous RAP collection. For SALT the sequel of ‘no service provided’ would apply – i.e., the request for support is captured, but the sequel does not suggest any social care support has been given.\n",null,null,null,null,null,null,null,"Where do we include the provision of National Bus and / or Freedom Passes?","National Bus and Freedom passes are not seen as social care support which matches the way they were considered within the previous RAP collection. For SALT the sequel of ‘no service provided’ would apply – i.e., the request for support is captured, but the sequel does not suggest any social care support has been given.\n",{"$f":"IF($AL$417=1,IF(ISNUMBER(SEARCH($AK$417,'Hide this - Workings'!D8)),1,0),\"\")","v":""},{"$f":"IF($AL$418=1,IF(ISNUMBER(SEARCH($AK$418,'Hide this - Workings'!D8)),1,0),\"\")","v":""},{"$f":"IF($AL$419=1,IF(ISNUMBER(SEARCH($AK$419,'Hide this - Workings'!D8)),1,0),\"\")","v":""},{"$f":"IF($AL$420=1,IF(ISNUMBER(SEARCH($AK$420,'Hide this - Workings'!D8)),1,0),\"\")","v":""},{"$f":"IF($AL$421=1,IF(ISNUMBER(SEARCH($AK$421,'Hide this - Workings'!D8)),1,0),\"\")","v":""},{"$f":"IF($AL$422=1,IF(ISNUMBER(SEARCH($AK$422,'Hide this - Workings'!D8)),1,0),\"\")","v":""},{"$f":"IF($AL$423=1,IF(ISNUMBER(SEARCH($AK$423,'Hide this - Workings'!D8)),1,0),\"\")","v":""},{"$f":"IF($AL$424=1,IF(ISNUMBER(SEARCH($AK$424,'Hide this - Workings'!D8)),1,0),\"\")","v":""},{"$f":"IF($AL$425=1,IF(ISNUMBER(SEARCH($AK$425,'Hide this - Workings'!D8)),1,0),\"\")","v":""},{"$f":"IF($AL$426=1,IF(ISNUMBER(SEARCH($AK$426,'Hide this - Workings'!D8)),1,0),\"\")","v":""},{"$f":"IF($AL$427=1,IF(ISNUMBER(SEARCH($AK$427,'Hide this - Workings'!D8)),1,0),\"\")","v":""},{"$f":"IF($AL$428=1,IF(ISNUMBER(SEARCH($AK$428,'Hide this - Workings'!D8)),1,0),\"\")","v":""},{"$f":"IF($AL$429=1,IF(ISNUMBER(SEARCH($AK$429,'Hide this - Workings'!D8)),1,0),\"\")","v":""},{"$f":"IF($AL$430=1,IF(ISNUMBER(SEARCH($AK$430,'Hide this - Workings'!D8)),1,0),\"\")","v":""},{"$f":"IF($AL$431=1,IF(ISNUMBER(SEARCH($AK$431,'Hide this - Workings'!D8)),1,0),\"\")","v":""},{"$f":"IF($AL$432=1,IF(ISNUMBER(SEARCH($AK$432,'Hide this - Workings'!D8)),1,0),\"\")","v":""},{"$f":"IF($AL$433=1,IF(ISNUMBER(SEARCH($AK$433,'Hide this - Workings'!D8)),1,0),\"\")","v":""},0,"A004",0,"Where do we include the provision of National Bus and / or Freedom Passes? National Bus and Freedom passes are not seen as social care support which matches the way they were considered within the previous RAP collection. For SALT the sequel of ‘no service provided’ would apply – i.e., the request for support is captured, but the sequel does not suggest any social care support has been given.\n","Where do we include the provision of National Bus and / or Freedom Passes?","National Bus and Freedom passes are not seen as social care support which matches the way they were considered within the previous RAP collection. For SALT the sequel of ‘no service provided’ would apply – i.e., the request for support is captured, but the sequel does not suggest any social care support has been given.\n"]
[null,null,"","For some basic services such as the issue of a blue badge, or registration as disabled, we often have a waiting list. When do we record their ‘sequel’ in STS001? When the sequel is known (i.e. at the point of placing them on a waiting list) it can be recorded for STS001 purposes.\n",null,null,null,null,null,null,null,"For some basic services such as the issue of a blue badge, or registration as disabled, we often have a waiting list. When do we record their ‘sequel’ in STS001?","When the sequel is known (i.e. at the point of placing them on a waiting list) it can be recorded for STS001 purposes.\n",{"$f":"IF($AL$417=1,IF(ISNUMBER(SEARCH($AK$417,'Hide this - Workings'!D9)),1,0),\"\")","v":""},{"$f":"IF($AL$418=1,IF(ISNUMBER(SEARCH($AK$418,'Hide this - Workings'!D9)),1,0),\"\")","v":""},{"$f":"IF($AL$419=1,IF(ISNUMBER(SEARCH($AK$419,'Hide this - Workings'!D9)),1,0),\"\")","v":""},{"$f":"IF($AL$420=1,IF(ISNUMBER(SEARCH($AK$420,'Hide this - Workings'!D9)),1,0),\"\")","v":""},{"$f":"IF($AL$421=1,IF(ISNUMBER(SEARCH($AK$421,'Hide this - Workings'!D9)),1,0),\"\")","v":""},{"$f":"IF($AL$422=1,IF(ISNUMBER(SEARCH($AK$422,'Hide this - Workings'!D9)),1,0),\"\")","v":""},{"$f":"IF($AL$423=1,IF(ISNUMBER(SEARCH($AK$423,'Hide this - Workings'!D9)),1,0),\"\")","v":""},{"$f":"IF($AL$424=1,IF(ISNUMBER(SEARCH($AK$424,'Hide this - Workings'!D9)),1,0),\"\")","v":""},{"$f":"IF($AL$425=1,IF(ISNUMBER(SEARCH($AK$425,'Hide this - Workings'!D9)),1,0),\"\")","v":""},{"$f":"IF($AL$426=1,IF(ISNUMBER(SEARCH($AK$426,'Hide this - Workings'!D9)),1,0),\"\")","v":""},{"$f":"IF($AL$427=1,IF(ISNUMBER(SEARCH($AK$427,'Hide this - Workings'!D9)),1,0),\"\")","v":""},{"$f":"IF($AL$428=1,IF(ISNUMBER(SEARCH($AK$428,'Hide this - Workings'!D9)),1,0),\"\")","v":""},{"$f":"IF($AL$429=1,IF(ISNUMBER(SEARCH($AK$429,'Hide this - Workings'!D9)),1,0),\"\")","v":""},{"$f":"IF($AL$430=1,IF(ISNUMBER(SEARCH($AK$430,'Hide this - Workings'!D9)),1,0),\"\")","v":""},{"$f":"IF($AL$431=1,IF(ISNUMBER(SEARCH($AK$431,'Hide this - Workings'!D9)),1,0),\"\")","v":""},{"$f":"IF($AL$432=1,IF(ISNUMBER(SEARCH($AK$432,'Hide this - Workings'!D9)),1,0),\"\")","v":""},{"$f":"IF($AL$433=1,IF(ISNUMBER(SEARCH($AK$433,'Hide this - Workings'!D9)),1,0),\"\")","v":""},0,"A005",0,"For some basic services such as the issue of a blue badge, or registration as disabled, we often have a waiting list. When do we record their ‘sequel’ in STS001? When the sequel is known (i.e. at the point of placing them on a waiting list) it can be recorded for STS001 purposes.\n","For some basic services such as the issue of a blue badge, or registration as disabled, we often have a waiting list. When do we record their ‘sequel’ in STS001?","When the sequel is known (i.e. at the point of placing them on a waiting list) it can be recorded for STS001 purposes.\n"]
[null,null,"","Where do we record contacts and referrals with the outcome of “No Further Action”? [STS001] If a client is NOT given information, advice or any sort of social care service following the request for support (whether an assessment is needed or not), they would be recorded in STS001 as ‘no service provided’ if their details had been recorded on the social care database. It is accepted that many ‘casual contacts’ (for example, people dropping in to pick up a leaflet) will not be captured and do not need to be captured for SALT purposes.\nIn some CASSRs the defining difference will be whether the reception staff consider it worth taking some personal details from the individual or not (a casual contact). In others the difference will be whether or not reception staff take the individual through some form of screening process. The key is whether or not a request for support leads to information and / or advice or other action such as signposting. Taking some personal details from a new contact and giving them information on the range of services that might be relevant should be recorded in STS001. Simply responding to a request for the phone number of an area office would be a casual contact.\n",null,null,null,null,null,null,null,"Where do we record contacts and referrals with the outcome of “No Further Action”? [STS001]","If a client is NOT given information, advice or any sort of social care service following the request for support (whether an assessment is needed or not), they would be recorded in STS001 as ‘no service provided’ if their details had been recorded on the social care database. It is accepted that many ‘casual contacts’ (for example, people dropping in to pick up a leaflet) will not be captured and do not need to be captured for SALT purposes.\nIn some CASSRs the defining difference will be whether the reception staff consider it worth taking some personal details from the individual or not (a casual contact). In others the difference will be whether or not reception staff take the individual through some form of screening process. The key is whether or not a request for support leads to information and / or advice or other action such as signposting. Taking some personal details from a new contact and giving them information on the range of services that might be relevant should be recorded in STS001. Simply responding to a request for the phone number of an area office would be a casual contact.\n",{"$f":"IF($AL$417=1,IF(ISNUMBER(SEARCH($AK$417,'Hide this - Workings'!D10)),1,0),\"\")","v":""},{"$f":"IF($AL$418=1,IF(ISNUMBER(SEARCH($AK$418,'Hide this - Workings'!D10)),1,0),\"\")","v":""},{"$f":"IF($AL$419=1,IF(ISNUMBER(SEARCH($AK$419,'Hide this - Workings'!D10)),1,0),\"\")","v":""},{"$f":"IF($AL$420=1,IF(ISNUMBER(SEARCH($AK$420,'Hide this - Workings'!D10)),1,0),\"\")","v":""},{"$f":"IF($AL$421=1,IF(ISNUMBER(SEARCH($AK$421,'Hide this - Workings'!D10)),1,0),\"\")","v":""},{"$f":"IF($AL$422=1,IF(ISNUMBER(SEARCH($AK$422,'Hide this - Workings'!D10)),1,0),\"\")","v":""},{"$f":"IF($AL$423=1,IF(ISNUMBER(SEARCH($AK$423,'Hide this - Workings'!D10)),1,0),\"\")","v":""},{"$f":"IF($AL$424=1,IF(ISNUMBER(SEARCH($AK$424,'Hide this - Workings'!D10)),1,0),\"\")","v":""},{"$f":"IF($AL$425=1,IF(ISNUMBER(SEARCH($AK$425,'Hide this - Workings'!D10)),1,0),\"\")","v":""},{"$f":"IF($AL$426=1,IF(ISNUMBER(SEARCH($AK$426,'Hide this - Workings'!D10)),1,0),\"\")","v":""},{"$f":"IF($AL$427=1,IF(ISNUMBER(SEARCH($AK$427,'Hide this - Workings'!D10)),1,0),\"\")","v":""},{"$f":"IF($AL$428=1,IF(ISNUMBER(SEARCH($AK$428,'Hide this - Workings'!D10)),1,0),\"\")","v":""},{"$f":"IF($AL$429=1,IF(ISNUMBER(SEARCH($AK$429,'Hide this - Workings'!D10)),1,0),\"\")","v":""},{"$f":"IF($AL$430=1,IF(ISNUMBER(SEARCH($AK$430,'Hide this - Workings'!D10)),1,0),\"\")","v":""},{"$f":"IF($AL$431=1,IF(ISNUMBER(SEARCH($AK$431,'Hide this - Workings'!D10)),1,0),\"\")","v":""},{"$f":"IF($AL$432=1,IF(ISNUMBER(SEARCH($AK$432,'Hide this - Workings'!D10)),1,0),\"\")","v":""},{"$f":"IF($AL$433=1,IF(ISNUMBER(SEARCH($AK$433,'Hide this - Workings'!D10)),1,0),\"\")","v":""},0,"A006",0,"Where do we record contacts and referrals with the outcome of “No Further Action”? [STS001] If a client is NOT given information, advice or any sort of social care service following the request for support (whether an assessment is needed or not), they would be recorded in STS001 as ‘no service provided’ if their details had been recorded on the social care database. It is accepted that many ‘casual contacts’ (for example, people dropping in to pick up a leaflet) will not be captured and do not need to be captured for SALT purposes.\nIn some CASSRs the defining difference will be whether the reception staff consider it worth taking some personal details from the individual or not (a casual contact). In others the difference will be whether or not reception staff take the individual through some form of screening process. The key is whether or not a request for support leads to information and / or advice or other action such as signposting. Taking some personal details from a new contact and giving them information on the range of services that might be relevant should be recorded in STS001. Simply responding to a request for the phone number of an area office would be a casual contact.\n","Where do we record contacts and referrals with the outcome of “No Further Action”? [STS001]","If a client is NOT given information, advice or any sort of social care service following the request for support (whether an assessment is needed or not), they would be recorded in STS001 as ‘no service provided’ if their details had been recorded on the social care database. It is accepted that many ‘casual contacts’ (for example, people dropping in to pick up a leaflet) will not be captured and do not need to be captured for SALT purposes.\nIn some CASSRs the defining difference will be whether the reception staff consider it worth taking some personal details from the individual or not (a casual contact). In others the difference will be whether or not reception staff take the individual through some form of screening process. The key is whether or not a request for support leads to information and / or advice or other action such as signposting. Taking some personal details from a new contact and giving them information on the range of services that might be relevant should be recorded in STS001. Simply responding to a request for the phone number of an area office would be a casual contact.\n"]
[null,null,"","Where do we record ‘professional support’ now? In most cases it is expected that professional support would be time-limited and fit under the sequel ‘short term support (other)’. If for some reason it is expected to continue for more than a few weeks, ‘Ongoing Low Level Support’ could be chosen instead. In most cases anyone going on to receive an assessment and receive services on the basis of eligibility criteria will be receiving more than just professional support, but if this was the ONLY service in the care / support plan then ‘long term support (eligible services)’ could be selected. This may be most relevant to clients receiving mental health support.\n",null,null,null,null,null,null,null,"Where do we record ‘professional support’ now?","In most cases it is expected that professional support would be time-limited and fit under the sequel ‘short term support (other)’. If for some reason it is expected to continue for more than a few weeks, ‘Ongoing Low Level Support’ could be chosen instead. In most cases anyone going on to receive an assessment and receive services on the basis of eligibility criteria will be receiving more than just professional support, but if this was the ONLY service in the care / support plan then ‘long term support (eligible services)’ could be selected. This may be most relevant to clients receiving mental health support.\n",{"$f":"IF($AL$417=1,IF(ISNUMBER(SEARCH($AK$417,'Hide this - Workings'!D11)),1,0),\"\")","v":""},{"$f":"IF($AL$418=1,IF(ISNUMBER(SEARCH($AK$418,'Hide this - Workings'!D11)),1,0),\"\")","v":""},{"$f":"IF($AL$419=1,IF(ISNUMBER(SEARCH($AK$419,'Hide this - Workings'!D11)),1,0),\"\")","v":""},{"$f":"IF($AL$420=1,IF(ISNUMBER(SEARCH($AK$420,'Hide this - Workings'!D11)),1,0),\"\")","v":""},{"$f":"IF($AL$421=1,IF(ISNUMBER(SEARCH($AK$421,'Hide this - Workings'!D11)),1,0),\"\")","v":""},{"$f":"IF($AL$422=1,IF(ISNUMBER(SEARCH($AK$422,'Hide this - Workings'!D11)),1,0),\"\")","v":""},{"$f":"IF($AL$423=1,IF(ISNUMBER(SEARCH($AK$423,'Hide this - Workings'!D11)),1,0),\"\")","v":""},{"$f":"IF($AL$424=1,IF(ISNUMBER(SEARCH($AK$424,'Hide this - Workings'!D11)),1,0),\"\")","v":""},{"$f":"IF($AL$425=1,IF(ISNUMBER(SEARCH($AK$425,'Hide this - Workings'!D11)),1,0),\"\")","v":""},{"$f":"IF($AL$426=1,IF(ISNUMBER(SEARCH($AK$426,'Hide this - Workings'!D11)),1,0),\"\")","v":""},{"$f":"IF($AL$427=1,IF(ISNUMBER(SEARCH($AK$427,'Hide this - Workings'!D11)),1,0),\"\")","v":""},{"$f":"IF($AL$428=1,IF(ISNUMBER(SEARCH($AK$428,'Hide this - Workings'!D11)),1,0),\"\")","v":""},{"$f":"IF($AL$429=1,IF(ISNUMBER(SEARCH($AK$429,'Hide this - Workings'!D11)),1,0),\"\")","v":""},{"$f":"IF($AL$430=1,IF(ISNUMBER(SEARCH($AK$430,'Hide this - Workings'!D11)),1,0),\"\")","v":""},{"$f":"IF($AL$431=1,IF(ISNUMBER(SEARCH($AK$431,'Hide this - Workings'!D11)),1,0),\"\")","v":""},{"$f":"IF($AL$432=1,IF(ISNUMBER(SEARCH($AK$432,'Hide this - Workings'!D11)),1,0),\"\")","v":""},{"$f":"IF($AL$433=1,IF(ISNUMBER(SEARCH($AK$433,'Hide this - Workings'!D11)),1,0),\"\")","v":""},0,"A007",0,"Where do we record ‘professional support’ now? In most cases it is expected that professional support would be time-limited and fit under the sequel ‘short term support (other)’. If for some reason it is expected to continue for more than a few weeks, ‘Ongoing Low Level Support’ could be chosen instead. In most cases anyone going on to receive an assessment and receive services on the basis of eligibility criteria will be receiving more than just professional support, but if this was the ONLY service in the care / support plan then ‘long term support (eligible services)’ could be selected. This may be most relevant to clients receiving mental health support.\n","Where do we record ‘professional support’ now?","In most cases it is expected that professional support would be time-limited and fit under the sequel ‘short term support (other)’. If for some reason it is expected to continue for more than a few weeks, ‘Ongoing Low Level Support’ could be chosen instead. In most cases anyone going on to receive an assessment and receive services on the basis of eligibility criteria will be receiving more than just professional support, but if this was the ONLY service in the care / support plan then ‘long term support (eligible services)’ could be selected. This may be most relevant to clients receiving mental health support.\n"]
[null,null,"","Where do we include support services provided to clients receiving welfare benefits, for example tribunal representation? These clients are not necessarily assessed and are not given care / support plans. Again, remember that only one sequel can be counted for each request for support. Providing information and advice on welfare benefits at a general level, or providing a one off piece of assistance in assessing possible individual eligibility will be counted in STS001 with the sequel ‘universal services’. If the case is passed on for further assessment leading to ongoing social care support provided by the CASSR, such as assistance in gaining due benefits (e.g., providing help at a tribunal) or handling financial matters then this should be treated as either ‘short term support (other)’ if the support will be given for no more than a few weeks, or ‘Ongoing Low Level Support’ if it is expected to continue beyond that.\nBecause no support plan is provided, this type of intervention would not be counted as ‘long term support (eligible services)’. \n",null,null,null,null,null,null,null,"Where do we include support services provided to clients receiving welfare benefits, for example tribunal representation? These clients are not necessarily assessed and are not given care / support plans.","Again, remember that only one sequel can be counted for each request for support. Providing information and advice on welfare benefits at a general level, or providing a one off piece of assistance in assessing possible individual eligibility will be counted in STS001 with the sequel ‘universal services’. If the case is passed on for further assessment leading to ongoing social care support provided by the CASSR, such as assistance in gaining due benefits (e.g., providing help at a tribunal) or handling financial matters then this should be treated as either ‘short term support (other)’ if the support will be given for no more than a few weeks, or ‘Ongoing Low Level Support’ if it is expected to continue beyond that.\nBecause no support plan is provided, this type of intervention would not be counted as ‘long term support (eligible services)’. \n",{"$f":"IF($AL$417=1,IF(ISNUMBER(SEARCH($AK$417,'Hide this - Workings'!D12)),1,0),\"\")","v":""},{"$f":"IF($AL$418=1,IF(ISNUMBER(SEARCH($AK$418,'Hide this - Workings'!D12)),1,0),\"\")","v":""},{"$f":"IF($AL$419=1,IF(ISNUMBER(SEARCH($AK$419,'Hide this - Workings'!D12)),1,0),\"\")","v":""},{"$f":"IF($AL$420=1,IF(ISNUMBER(SEARCH($AK$420,'Hide this - Workings'!D12)),1,0),\"\")","v":""},{"$f":"IF($AL$421=1,IF(ISNUMBER(SEARCH($AK$421,'Hide this - Workings'!D12)),1,0),\"\")","v":""},{"$f":"IF($AL$422=1,IF(ISNUMBER(SEARCH($AK$422,'Hide this - Workings'!D12)),1,0),\"\")","v":""},{"$f":"IF($AL$423=1,IF(ISNUMBER(SEARCH($AK$423,'Hide this - Workings'!D12)),1,0),\"\")","v":""},{"$f":"IF($AL$424=1,IF(ISNUMBER(SEARCH($AK$424,'Hide this - Workings'!D12)),1,0),\"\")","v":""},{"$f":"IF($AL$425=1,IF(ISNUMBER(SEARCH($AK$425,'Hide this - Workings'!D12)),1,0),\"\")","v":""},{"$f":"IF($AL$426=1,IF(ISNUMBER(SEARCH($AK$426,'Hide this - Workings'!D12)),1,0),\"\")","v":""},{"$f":"IF($AL$427=1,IF(ISNUMBER(SEARCH($AK$427,'Hide this - Workings'!D12)),1,0),\"\")","v":""},{"$f":"IF($AL$428=1,IF(ISNUMBER(SEARCH($AK$428,'Hide this - Workings'!D12)),1,0),\"\")","v":""},{"$f":"IF($AL$429=1,IF(ISNUMBER(SEARCH($AK$429,'Hide this - Workings'!D12)),1,0),\"\")","v":""},{"$f":"IF($AL$430=1,IF(ISNUMBER(SEARCH($AK$430,'Hide this - Workings'!D12)),1,0),\"\")","v":""},{"$f":"IF($AL$431=1,IF(ISNUMBER(SEARCH($AK$431,'Hide this - Workings'!D12)),1,0),\"\")","v":""},{"$f":"IF($AL$432=1,IF(ISNUMBER(SEARCH($AK$432,'Hide this - Workings'!D12)),1,0),\"\")","v":""},{"$f":"IF($AL$433=1,IF(ISNUMBER(SEARCH($AK$433,'Hide this - Workings'!D12)),1,0),\"\")","v":""},0,"A008",0,"Where do we include support services provided to clients receiving welfare benefits, for example tribunal representation? These clients are not necessarily assessed and are not given care / support plans. Again, remember that only one sequel can be counted for each request for support. Providing information and advice on welfare benefits at a general level, or providing a one off piece of assistance in assessing possible individual eligibility will be counted in STS001 with the sequel ‘universal services’. If the case is passed on for further assessment leading to ongoing social care support provided by the CASSR, such as assistance in gaining due benefits (e.g., providing help at a tribunal) or handling financial matters then this should be treated as either ‘short term support (other)’ if the support will be given for no more than a few weeks, or ‘Ongoing Low Level Support’ if it is expected to continue beyond that.\nBecause no support plan is provided, this type of intervention would not be counted as ‘long term support (eligible services)’. \n","Where do we include support services provided to clients receiving welfare benefits, for example tribunal representation? These clients are not necessarily assessed and are not given care / support plans.","Again, remember that only one sequel can be counted for each request for support. Providing information and advice on welfare benefits at a general level, or providing a one off piece of assistance in assessing possible individual eligibility will be counted in STS001 with the sequel ‘universal services’. If the case is passed on for further assessment leading to ongoing social care support provided by the CASSR, such as assistance in gaining due benefits (e.g., providing help at a tribunal) or handling financial matters then this should be treated as either ‘short term support (other)’ if the support will be given for no more than a few weeks, or ‘Ongoing Low Level Support’ if it is expected to continue beyond that.\nBecause no support plan is provided, this type of intervention would not be counted as ‘long term support (eligible services)’. \n"]
[null,null,"","If a child becomes 18 during the reporting year and transfers from Children’s Services to Adults’ Services, are they regarded as a “new client” for SALT and therefore recorded as a ‘request for support’ to the adult team, or are they considered to already be “on the books” of the CASSR and therefore not a “new client”? We recognise that authorities will have a variety of arrangements in place for dealing with transition between children’s and adults teams. In many instances this process will be underway well before the client’s 18th birthday; equally some individuals may not transfer until after their 18th birthday. Transition from children’s to adult’s services should be treated as a request for support from a new client and dealt with within SALT as follows:\nIf the formal transfer of services occurred in advance of (or on) their 18th birthday then the client should start to be reported in SALT once they have turned 18. Their 18th birthday should be treated as a ‘request for support’ and be reported in SALT measure STS001 (Route of access = Planned entry (transition)), with any eligible services or review captured at that point in the LTS measures. Their 18th birthday should be recorded for use within SALT LTS001c when considering clients who have accessed long term support for more than 12 months.\nIf the formal transfer of services occurs after the client’s 18th birthday then this should be treated as the ‘request for support’ and reported within SALT measure STS001, with any eligible services or review also captured at that point in the LTS measures. Again this date should be recorded for us within SALT LTS001c. In some cases this formal transfer may occur months or even years after the clients 18th birthday. Authorities will need to consider locally how they track transition of such cases.\n",null,null,null,null,null,null,null,"If a child becomes 18 during the reporting year and transfers from Children’s Services to Adults’ Services, are they regarded as a “new client” for SALT and therefore recorded as a ‘request for support’ to the adult team, or are they considered to already be “on the books” of the CASSR and therefore not a “new client”?","We recognise that authorities will have a variety of arrangements in place for dealing with transition between children’s and adults teams. In many instances this process will be underway well before the client’s 18th birthday; equally some individuals may not transfer until after their 18th birthday. Transition from children’s to adult’s services should be treated as a request for support from a new client and dealt with within SALT as follows:\nIf the formal transfer of services occurred in advance of (or on) their 18th birthday then the client should start to be reported in SALT once they have turned 18. Their 18th birthday should be treated as a ‘request for support’ and be reported in SALT measure STS001 (Route of access = Planned entry (transition)), with any eligible services or review captured at that point in the LTS measures. Their 18th birthday should be recorded for use within SALT LTS001c when considering clients who have accessed long term support for more than 12 months.\nIf the formal transfer of services occurs after the client’s 18th birthday then this should be treated as the ‘request for support’ and reported within SALT measure STS001, with any eligible services or review also captured at that point in the LTS measures. Again this date should be recorded for us within SALT LTS001c. In some cases this formal transfer may occur months or even years after the clients 18th birthday. Authorities will need to consider locally how they track transition of such cases.\n",{"$f":"IF($AL$417=1,IF(ISNUMBER(SEARCH($AK$417,'Hide this - Workings'!D13)),1,0),\"\")","v":""},{"$f":"IF($AL$418=1,IF(ISNUMBER(SEARCH($AK$418,'Hide this - Workings'!D13)),1,0),\"\")","v":""},{"$f":"IF($AL$419=1,IF(ISNUMBER(SEARCH($AK$419,'Hide this - Workings'!D13)),1,0),\"\")","v":""},{"$f":"IF($AL$420=1,IF(ISNUMBER(SEARCH($AK$420,'Hide this - Workings'!D13)),1,0),\"\")","v":""},{"$f":"IF($AL$421=1,IF(ISNUMBER(SEARCH($AK$421,'Hide this - Workings'!D13)),1,0),\"\")","v":""},{"$f":"IF($AL$422=1,IF(ISNUMBER(SEARCH($AK$422,'Hide this - Workings'!D13)),1,0),\"\")","v":""},{"$f":"IF($AL$423=1,IF(ISNUMBER(SEARCH($AK$423,'Hide this - Workings'!D13)),1,0),\"\")","v":""},{"$f":"IF($AL$424=1,IF(ISNUMBER(SEARCH($AK$424,'Hide this - Workings'!D13)),1,0),\"\")","v":""},{"$f":"IF($AL$425=1,IF(ISNUMBER(SEARCH($AK$425,'Hide this - Workings'!D13)),1,0),\"\")","v":""},{"$f":"IF($AL$426=1,IF(ISNUMBER(SEARCH($AK$426,'Hide this - Workings'!D13)),1,0),\"\")","v":""},{"$f":"IF($AL$427=1,IF(ISNUMBER(SEARCH($AK$427,'Hide this - Workings'!D13)),1,0),\"\")","v":""},{"$f":"IF($AL$428=1,IF(ISNUMBER(SEARCH($AK$428,'Hide this - Workings'!D13)),1,0),\"\")","v":""},{"$f":"IF($AL$429=1,IF(ISNUMBER(SEARCH($AK$429,'Hide this - Workings'!D13)),1,0),\"\")","v":""},{"$f":"IF($AL$430=1,IF(ISNUMBER(SEARCH($AK$430,'Hide this - Workings'!D13)),1,0),\"\")","v":""},{"$f":"IF($AL$431=1,IF(ISNUMBER(SEARCH($AK$431,'Hide this - Workings'!D13)),1,0),\"\")","v":""},{"$f":"IF($AL$432=1,IF(ISNUMBER(SEARCH($AK$432,'Hide this - Workings'!D13)),1,0),\"\")","v":""},{"$f":"IF($AL$433=1,IF(ISNUMBER(SEARCH($AK$433,'Hide this - Workings'!D13)),1,0),\"\")","v":""},0,"A009",0,"If a child becomes 18 during the reporting year and transfers from Children’s Services to Adults’ Services, are they regarded as a “new client” for SALT and therefore recorded as a ‘request for support’ to the adult team, or are they considered to already be “on the books” of the CASSR and therefore not a “new client”? We recognise that authorities will have a variety of arrangements in place for dealing with transition between children’s and adults teams. In many instances this process will be underway well before the client’s 18th birthday; equally some individuals may not transfer until after their 18th birthday. Transition from children’s to adult’s services should be treated as a request for support from a new client and dealt with within SALT as follows:\nIf the formal transfer of services occurred in advance of (or on) their 18th birthday then the client should start to be reported in SALT once they have turned 18. Their 18th birthday should be treated as a ‘request for support’ and be reported in SALT measure STS001 (Route of access = Planned entry (transition)), with any eligible services or review captured at that point in the LTS measures. Their 18th birthday should be recorded for use within SALT LTS001c when considering clients who have accessed long term support for more than 12 months.\nIf the formal transfer of services occurs after the client’s 18th birthday then this should be treated as the ‘request for support’ and reported within SALT measure STS001, with any eligible services or review also captured at that point in the LTS measures. Again this date should be recorded for us within SALT LTS001c. In some cases this formal transfer may occur months or even years after the clients 18th birthday. Authorities will need to consider locally how they track transition of such cases.\n","If a child becomes 18 during the reporting year and transfers from Children’s Services to Adults’ Services, are they regarded as a “new client” for SALT and therefore recorded as a ‘request for support’ to the adult team, or are they considered to already be “on the books” of the CASSR and therefore not a “new client”?","We recognise that authorities will have a variety of arrangements in place for dealing with transition between children’s and adults teams. In many instances this process will be underway well before the client’s 18th birthday; equally some individuals may not transfer until after their 18th birthday. Transition from children’s to adult’s services should be treated as a request for support from a new client and dealt with within SALT as follows:\nIf the formal transfer of services occurred in advance of (or on) their 18th birthday then the client should start to be reported in SALT once they have turned 18. Their 18th birthday should be treated as a ‘request for support’ and be reported in SALT measure STS001 (Route of access = Planned entry (transition)), with any eligible services or review captured at that point in the LTS measures. Their 18th birthday should be recorded for use within SALT LTS001c when considering clients who have accessed long term support for more than 12 months.\nIf the formal transfer of services occurs after the client’s 18th birthday then this should be treated as the ‘request for support’ and reported within SALT measure STS001, with any eligible services or review also captured at that point in the LTS measures. Again this date should be recorded for us within SALT LTS001c. In some cases this formal transfer may occur months or even years after the clients 18th birthday. Authorities will need to consider locally how they track transition of such cases.\n"]
[null,null,"","What if two contacts are made by the same client (regarding the same problem)? What matters is whether any additional contacts are being dealt with as part of the same screening/assessment process. If they are, then there would still be just one request for support with one sequel recorded. After the assessment processes are completed and a sequel has occurred a new contact is received which necessitates a new screening/assessment process to be started then this should be recorded as a separate request for support in SALT, with its own sequel recorded (even if the sequel turns out to be the same as for the earlier contact).\nThe following examples may assist with understanding how presenting issues are dealt with in SALT:\nClient A is referred to social services by their GP after their carer is admitted to hospital. A day later a further request for support is made by a relative. Only one of these requests for services is recorded in STS001.\nClient B is referred to social services by A&E after a fall. They go on to receive short term care to maximise independence. Two months later they suffer a further fall and are again referred to social services after a fall and go on to receive short term care to maximise independence. Whilst there is some similarity between the requests for support both requests necessitate an assessment of needs, and are therefore reported in STS001.\nInevitably some ‘rules of thumb’ will be drawn up by CASSRs for the purposes of automating the count for STS001. Note of these rules should be made in the Supplementary Information at the bottom of STS001 which feeds into the End Sheet of the data return workbook.\n",null,null,null,null,null,null,null,"What if two contacts are made by the same client (regarding the same problem)?","What matters is whether any additional contacts are being dealt with as part of the same screening/assessment process. If they are, then there would still be just one request for support with one sequel recorded. After the assessment processes are completed and a sequel has occurred a new contact is received which necessitates a new screening/assessment process to be started then this should be recorded as a separate request for support in SALT, with its own sequel recorded (even if the sequel turns out to be the same as for the earlier contact).\nThe following examples may assist with understanding how presenting issues are dealt with in SALT:\nClient A is referred to social services by their GP after their carer is admitted to hospital. A day later a further request for support is made by a relative. Only one of these requests for services is recorded in STS001.\nClient B is referred to social services by A&E after a fall. They go on to receive short term care to maximise independence. Two months later they suffer a further fall and are again referred to social services after a fall and go on to receive short term care to maximise independence. Whilst there is some similarity between the requests for support both requests necessitate an assessment of needs, and are therefore reported in STS001.\nInevitably some ‘rules of thumb’ will be drawn up by CASSRs for the purposes of automating the count for STS001. Note of these rules should be made in the Supplementary Information at the bottom of STS001 which feeds into the End Sheet of the data return workbook.\n",{"$f":"IF($AL$417=1,IF(ISNUMBER(SEARCH($AK$417,'Hide this - Workings'!D14)),1,0),\"\")","v":""},{"$f":"IF($AL$418=1,IF(ISNUMBER(SEARCH($AK$418,'Hide this - Workings'!D14)),1,0),\"\")","v":""},{"$f":"IF($AL$419=1,IF(ISNUMBER(SEARCH($AK$419,'Hide this - Workings'!D14)),1,0),\"\")","v":""},{"$f":"IF($AL$420=1,IF(ISNUMBER(SEARCH($AK$420,'Hide this - Workings'!D14)),1,0),\"\")","v":""},{"$f":"IF($AL$421=1,IF(ISNUMBER(SEARCH($AK$421,'Hide this - Workings'!D14)),1,0),\"\")","v":""},{"$f":"IF($AL$422=1,IF(ISNUMBER(SEARCH($AK$422,'Hide this - Workings'!D14)),1,0),\"\")","v":""},{"$f":"IF($AL$423=1,IF(ISNUMBER(SEARCH($AK$423,'Hide this - Workings'!D14)),1,0),\"\")","v":""},{"$f":"IF($AL$424=1,IF(ISNUMBER(SEARCH($AK$424,'Hide this - Workings'!D14)),1,0),\"\")","v":""},{"$f":"IF($AL$425=1,IF(ISNUMBER(SEARCH($AK$425,'Hide this - Workings'!D14)),1,0),\"\")","v":""},{"$f":"IF($AL$426=1,IF(ISNUMBER(SEARCH($AK$426,'Hide this - Workings'!D14)),1,0),\"\")","v":""},{"$f":"IF($AL$427=1,IF(ISNUMBER(SEARCH($AK$427,'Hide this - Workings'!D14)),1,0),\"\")","v":""},{"$f":"IF($AL$428=1,IF(ISNUMBER(SEARCH($AK$428,'Hide this - Workings'!D14)),1,0),\"\")","v":""},{"$f":"IF($AL$429=1,IF(ISNUMBER(SEARCH($AK$429,'Hide this - Workings'!D14)),1,0),\"\")","v":""},{"$f":"IF($AL$430=1,IF(ISNUMBER(SEARCH($AK$430,'Hide this - Workings'!D14)),1,0),\"\")","v":""},{"$f":"IF($AL$431=1,IF(ISNUMBER(SEARCH($AK$431,'Hide this - Workings'!D14)),1,0),\"\")","v":""},{"$f":"IF($AL$432=1,IF(ISNUMBER(SEARCH($AK$432,'Hide this - Workings'!D14)),1,0),\"\")","v":""},{"$f":"IF($AL$433=1,IF(ISNUMBER(SEARCH($AK$433,'Hide this - Workings'!D14)),1,0),\"\")","v":""},0,"A010",0,"What if two contacts are made by the same client (regarding the same problem)? What matters is whether any additional contacts are being dealt with as part of the same screening/assessment process. If they are, then there would still be just one request for support with one sequel recorded. After the assessment processes are completed and a sequel has occurred a new contact is received which necessitates a new screening/assessment process to be started then this should be recorded as a separate request for support in SALT, with its own sequel recorded (even if the sequel turns out to be the same as for the earlier contact).\nThe following examples may assist with understanding how presenting issues are dealt with in SALT:\nClient A is referred to social services by their GP after their carer is admitted to hospital. A day later a further request for support is made by a relative. Only one of these requests for services is recorded in STS001.\nClient B is referred to social services by A&E after a fall. They go on to receive short term care to maximise independence. Two months later they suffer a further fall and are again referred to social services after a fall and go on to receive short term care to maximise independence. Whilst there is some similarity between the requests for support both requests necessitate an assessment of needs, and are therefore reported in STS001.\nInevitably some ‘rules of thumb’ will be drawn up by CASSRs for the purposes of automating the count for STS001. Note of these rules should be made in the Supplementary Information at the bottom of STS001 which feeds into the End Sheet of the data return workbook.\n","What if two contacts are made by the same client (regarding the same problem)?","What matters is whether any additional contacts are being dealt with as part of the same screening/assessment process. If they are, then there would still be just one request for support with one sequel recorded. After the assessment processes are completed and a sequel has occurred a new contact is received which necessitates a new screening/assessment process to be started then this should be recorded as a separate request for support in SALT, with its own sequel recorded (even if the sequel turns out to be the same as for the earlier contact).\nThe following examples may assist with understanding how presenting issues are dealt with in SALT:\nClient A is referred to social services by their GP after their carer is admitted to hospital. A day later a further request for support is made by a relative. Only one of these requests for services is recorded in STS001.\nClient B is referred to social services by A&E after a fall. They go on to receive short term care to maximise independence. Two months later they suffer a further fall and are again referred to social services after a fall and go on to receive short term care to maximise independence. Whilst there is some similarity between the requests for support both requests necessitate an assessment of needs, and are therefore reported in STS001.\nInevitably some ‘rules of thumb’ will be drawn up by CASSRs for the purposes of automating the count for STS001. Note of these rules should be made in the Supplementary Information at the bottom of STS001 which feeds into the End Sheet of the data return workbook.\n"]
[null,null,"","How should I record referrals in STS001 if they are received via a council’s contact centre, not directly to social services? It does not matter who receives the initial contact.  ‘Referral Source’ is not collected in SALT. The ‘Route of Access’ for clients, or their representatives, calling a contact centre is the same as if they contacted the social care department directly and will reflect their circumstances at the time of contact (e.g., if they have just been discharged or are about to be discharged from hospital the route of access is ‘discharge from hospital’ regardless of who makes the call or where the call is handled).\n",null,null,null,null,null,null,null,"How should I record referrals in STS001 if they are received via a council’s contact centre, not directly to social services?","It does not matter who receives the initial contact.  ‘Referral Source’ is not collected in SALT. The ‘Route of Access’ for clients, or their representatives, calling a contact centre is the same as if they contacted the social care department directly and will reflect their circumstances at the time of contact (e.g., if they have just been discharged or are about to be discharged from hospital the route of access is ‘discharge from hospital’ regardless of who makes the call or where the call is handled).\n",{"$f":"IF($AL$417=1,IF(ISNUMBER(SEARCH($AK$417,'Hide this - Workings'!D15)),1,0),\"\")","v":""},{"$f":"IF($AL$418=1,IF(ISNUMBER(SEARCH($AK$418,'Hide this - Workings'!D15)),1,0),\"\")","v":""},{"$f":"IF($AL$419=1,IF(ISNUMBER(SEARCH($AK$419,'Hide this - Workings'!D15)),1,0),\"\")","v":""},{"$f":"IF($AL$420=1,IF(ISNUMBER(SEARCH($AK$420,'Hide this - Workings'!D15)),1,0),\"\")","v":""},{"$f":"IF($AL$421=1,IF(ISNUMBER(SEARCH($AK$421,'Hide this - Workings'!D15)),1,0),\"\")","v":""},{"$f":"IF($AL$422=1,IF(ISNUMBER(SEARCH($AK$422,'Hide this - Workings'!D15)),1,0),\"\")","v":""},{"$f":"IF($AL$423=1,IF(ISNUMBER(SEARCH($AK$423,'Hide this - Workings'!D15)),1,0),\"\")","v":""},{"$f":"IF($AL$424=1,IF(ISNUMBER(SEARCH($AK$424,'Hide this - Workings'!D15)),1,0),\"\")","v":""},{"$f":"IF($AL$425=1,IF(ISNUMBER(SEARCH($AK$425,'Hide this - Workings'!D15)),1,0),\"\")","v":""},{"$f":"IF($AL$426=1,IF(ISNUMBER(SEARCH($AK$426,'Hide this - Workings'!D15)),1,0),\"\")","v":""},{"$f":"IF($AL$427=1,IF(ISNUMBER(SEARCH($AK$427,'Hide this - Workings'!D15)),1,0),\"\")","v":""},{"$f":"IF($AL$428=1,IF(ISNUMBER(SEARCH($AK$428,'Hide this - Workings'!D15)),1,0),\"\")","v":""},{"$f":"IF($AL$429=1,IF(ISNUMBER(SEARCH($AK$429,'Hide this - Workings'!D15)),1,0),\"\")","v":""},{"$f":"IF($AL$430=1,IF(ISNUMBER(SEARCH($AK$430,'Hide this - Workings'!D15)),1,0),\"\")","v":""},{"$f":"IF($AL$431=1,IF(ISNUMBER(SEARCH($AK$431,'Hide this - Workings'!D15)),1,0),\"\")","v":""},{"$f":"IF($AL$432=1,IF(ISNUMBER(SEARCH($AK$432,'Hide this - Workings'!D15)),1,0),\"\")","v":""},{"$f":"IF($AL$433=1,IF(ISNUMBER(SEARCH($AK$433,'Hide this - Workings'!D15)),1,0),\"\")","v":""},0,"A011",0,"How should I record referrals in STS001 if they are received via a council’s contact centre, not directly to social services? It does not matter who receives the initial contact.  ‘Referral Source’ is not collected in SALT. The ‘Route of Access’ for clients, or their representatives, calling a contact centre is the same as if they contacted the social care department directly and will reflect their circumstances at the time of contact (e.g., if they have just been discharged or are about to be discharged from hospital the route of access is ‘discharge from hospital’ regardless of who makes the call or where the call is handled).\n","How should I record referrals in STS001 if they are received via a council’s contact centre, not directly to social services?","It does not matter who receives the initial contact.  ‘Referral Source’ is not collected in SALT. The ‘Route of Access’ for clients, or their representatives, calling a contact centre is the same as if they contacted the social care department directly and will reflect their circumstances at the time of contact (e.g., if they have just been discharged or are about to be discharged from hospital the route of access is ‘discharge from hospital’ regardless of who makes the call or where the call is handled).\n"]
[null,null,"","Could you clarify if referrals related to carers should be recorded? [STS001] STS001 does not include carers unless those carers are requesting (or someone is requesting for them) support for their own social care needs (rather than their caring needs).\n",null,null,null,null,null,null,null,"Could you clarify if referrals related to carers should be recorded? [STS001]","STS001 does not include carers unless those carers are requesting (or someone is requesting for them) support for their own social care needs (rather than their caring needs).\n",{"$f":"IF($AL$417=1,IF(ISNUMBER(SEARCH($AK$417,'Hide this - Workings'!D16)),1,0),\"\")","v":""},{"$f":"IF($AL$418=1,IF(ISNUMBER(SEARCH($AK$418,'Hide this - Workings'!D16)),1,0),\"\")","v":""},{"$f":"IF($AL$419=1,IF(ISNUMBER(SEARCH($AK$419,'Hide this - Workings'!D16)),1,0),\"\")","v":""},{"$f":"IF($AL$420=1,IF(ISNUMBER(SEARCH($AK$420,'Hide this - Workings'!D16)),1,0),\"\")","v":""},{"$f":"IF($AL$421=1,IF(ISNUMBER(SEARCH($AK$421,'Hide this - Workings'!D16)),1,0),\"\")","v":""},{"$f":"IF($AL$422=1,IF(ISNUMBER(SEARCH($AK$422,'Hide this - Workings'!D16)),1,0),\"\")","v":""},{"$f":"IF($AL$423=1,IF(ISNUMBER(SEARCH($AK$423,'Hide this - Workings'!D16)),1,0),\"\")","v":""},{"$f":"IF($AL$424=1,IF(ISNUMBER(SEARCH($AK$424,'Hide this - Workings'!D16)),1,0),\"\")","v":""},{"$f":"IF($AL$425=1,IF(ISNUMBER(SEARCH($AK$425,'Hide this - Workings'!D16)),1,0),\"\")","v":""},{"$f":"IF($AL$426=1,IF(ISNUMBER(SEARCH($AK$426,'Hide this - Workings'!D16)),1,0),\"\")","v":""},{"$f":"IF($AL$427=1,IF(ISNUMBER(SEARCH($AK$427,'Hide this - Workings'!D16)),1,0),\"\")","v":""},{"$f":"IF($AL$428=1,IF(ISNUMBER(SEARCH($AK$428,'Hide this - Workings'!D16)),1,0),\"\")","v":""},{"$f":"IF($AL$429=1,IF(ISNUMBER(SEARCH($AK$429,'Hide this - Workings'!D16)),1,0),\"\")","v":""},{"$f":"IF($AL$430=1,IF(ISNUMBER(SEARCH($AK$430,'Hide this - Workings'!D16)),1,0),\"\")","v":""},{"$f":"IF($AL$431=1,IF(ISNUMBER(SEARCH($AK$431,'Hide this - Workings'!D16)),1,0),\"\")","v":""},{"$f":"IF($AL$432=1,IF(ISNUMBER(SEARCH($AK$432,'Hide this - Workings'!D16)),1,0),\"\")","v":""},{"$f":"IF($AL$433=1,IF(ISNUMBER(SEARCH($AK$433,'Hide this - Workings'!D16)),1,0),\"\")","v":""},0,"A012",0,"Could you clarify if referrals related to carers should be recorded? [STS001] STS001 does not include carers unless those carers are requesting (or someone is requesting for them) support for their own social care needs (rather than their caring needs).\n","Could you clarify if referrals related to carers should be recorded? [STS001]","STS001 does not include carers unless those carers are requesting (or someone is requesting for them) support for their own social care needs (rather than their caring needs).\n"]
[null,null,"","Should work with out of area clients be recorded in STS001? If you receive requests for support relating to clients from another area and work with those clients at your expense, then count them in your figures. If the other area pays for the work, do not include them. Similarly, count requests for support relating to your local clients who were seen by another CASSR only if you pay for the work. This will probably require details for such clients to be recorded on your own client database in order to be accurately counted. With regard to the sequels recorded, if it is decided that support will be provided by another CASSR (or agency) but not funded by you, then you should record these clients under ‘no services provided – any reason’.\n",null,null,null,null,null,null,null,"Should work with out of area clients be recorded in STS001?","If you receive requests for support relating to clients from another area and work with those clients at your expense, then count them in your figures. If the other area pays for the work, do not include them. Similarly, count requests for support relating to your local clients who were seen by another CASSR only if you pay for the work. This will probably require details for such clients to be recorded on your own client database in order to be accurately counted. With regard to the sequels recorded, if it is decided that support will be provided by another CASSR (or agency) but not funded by you, then you should record these clients under ‘no services provided – any reason’.\n",{"$f":"IF($AL$417=1,IF(ISNUMBER(SEARCH($AK$417,'Hide this - Workings'!D17)),1,0),\"\")","v":""},{"$f":"IF($AL$418=1,IF(ISNUMBER(SEARCH($AK$418,'Hide this - Workings'!D17)),1,0),\"\")","v":""},{"$f":"IF($AL$419=1,IF(ISNUMBER(SEARCH($AK$419,'Hide this - Workings'!D17)),1,0),\"\")","v":""},{"$f":"IF($AL$420=1,IF(ISNUMBER(SEARCH($AK$420,'Hide this - Workings'!D17)),1,0),\"\")","v":""},{"$f":"IF($AL$421=1,IF(ISNUMBER(SEARCH($AK$421,'Hide this - Workings'!D17)),1,0),\"\")","v":""},{"$f":"IF($AL$422=1,IF(ISNUMBER(SEARCH($AK$422,'Hide this - Workings'!D17)),1,0),\"\")","v":""},{"$f":"IF($AL$423=1,IF(ISNUMBER(SEARCH($AK$423,'Hide this - Workings'!D17)),1,0),\"\")","v":""},{"$f":"IF($AL$424=1,IF(ISNUMBER(SEARCH($AK$424,'Hide this - Workings'!D17)),1,0),\"\")","v":""},{"$f":"IF($AL$425=1,IF(ISNUMBER(SEARCH($AK$425,'Hide this - Workings'!D17)),1,0),\"\")","v":""},{"$f":"IF($AL$426=1,IF(ISNUMBER(SEARCH($AK$426,'Hide this - Workings'!D17)),1,0),\"\")","v":""},{"$f":"IF($AL$427=1,IF(ISNUMBER(SEARCH($AK$427,'Hide this - Workings'!D17)),1,0),\"\")","v":""},{"$f":"IF($AL$428=1,IF(ISNUMBER(SEARCH($AK$428,'Hide this - Workings'!D17)),1,0),\"\")","v":""},{"$f":"IF($AL$429=1,IF(ISNUMBER(SEARCH($AK$429,'Hide this - Workings'!D17)),1,0),\"\")","v":""},{"$f":"IF($AL$430=1,IF(ISNUMBER(SEARCH($AK$430,'Hide this - Workings'!D17)),1,0),\"\")","v":""},{"$f":"IF($AL$431=1,IF(ISNUMBER(SEARCH($AK$431,'Hide this - Workings'!D17)),1,0),\"\")","v":""},{"$f":"IF($AL$432=1,IF(ISNUMBER(SEARCH($AK$432,'Hide this - Workings'!D17)),1,0),\"\")","v":""},{"$f":"IF($AL$433=1,IF(ISNUMBER(SEARCH($AK$433,'Hide this - Workings'!D17)),1,0),\"\")","v":""},0,"A013",0,"Should work with out of area clients be recorded in STS001? If you receive requests for support relating to clients from another area and work with those clients at your expense, then count them in your figures. If the other area pays for the work, do not include them. Similarly, count requests for support relating to your local clients who were seen by another CASSR only if you pay for the work. This will probably require details for such clients to be recorded on your own client database in order to be accurately counted. With regard to the sequels recorded, if it is decided that support will be provided by another CASSR (or agency) but not funded by you, then you should record these clients under ‘no services provided – any reason’.\n","Should work with out of area clients be recorded in STS001?","If you receive requests for support relating to clients from another area and work with those clients at your expense, then count them in your figures. If the other area pays for the work, do not include them. Similarly, count requests for support relating to your local clients who were seen by another CASSR only if you pay for the work. This will probably require details for such clients to be recorded on your own client database in order to be accurately counted. With regard to the sequels recorded, if it is decided that support will be provided by another CASSR (or agency) but not funded by you, then you should record these clients under ‘no services provided – any reason’.\n"]
[null,null,"","Please could you provide some additional detail regarding the provision of Blue Badges? In our authority the provision of Blue Badges is no longer dealt with by the Adult Social Care department in our structure; requests and provision are handled by our Customer Contact Centre. I'm in the process of confirming where the funding comes from. [STS001] Blue Badge provision should be included within the SALT return, irrespective of funding source if the provision is still arranged by the local authority.\nRenewals are not new requests for support (as the request has already been addressed, the renewal is purely an administrative process) so in common with the way this was treated in the RAP return Blue Badge renewals would not appear in STS001.\n",null,null,null,null,null,null,null,"Please could you provide some additional detail regarding the provision of Blue Badges? In our authority the provision of Blue Badges is no longer dealt with by the Adult Social Care department in our structure; requests and provision are handled by our Customer Contact Centre. I'm in the process of confirming where the funding comes from. [STS001]","Blue Badge provision should be included within the SALT return, irrespective of funding source if the provision is still arranged by the local authority.\nRenewals are not new requests for support (as the request has already been addressed, the renewal is purely an administrative process) so in common with the way this was treated in the RAP return Blue Badge renewals would not appear in STS001.\n",{"$f":"IF($AL$417=1,IF(ISNUMBER(SEARCH($AK$417,'Hide this - Workings'!D18)),1,0),\"\")","v":""},{"$f":"IF($AL$418=1,IF(ISNUMBER(SEARCH($AK$418,'Hide this - Workings'!D18)),1,0),\"\")","v":""},{"$f":"IF($AL$419=1,IF(ISNUMBER(SEARCH($AK$419,'Hide this - Workings'!D18)),1,0),\"\")","v":""},{"$f":"IF($AL$420=1,IF(ISNUMBER(SEARCH($AK$420,'Hide this - Workings'!D18)),1,0),\"\")","v":""},{"$f":"IF($AL$421=1,IF(ISNUMBER(SEARCH($AK$421,'Hide this - Workings'!D18)),1,0),\"\")","v":""},{"$f":"IF($AL$422=1,IF(ISNUMBER(SEARCH($AK$422,'Hide this - Workings'!D18)),1,0),\"\")","v":""},{"$f":"IF($AL$423=1,IF(ISNUMBER(SEARCH($AK$423,'Hide this - Workings'!D18)),1,0),\"\")","v":""},{"$f":"IF($AL$424=1,IF(ISNUMBER(SEARCH($AK$424,'Hide this - Workings'!D18)),1,0),\"\")","v":""},{"$f":"IF($AL$425=1,IF(ISNUMBER(SEARCH($AK$425,'Hide this - Workings'!D18)),1,0),\"\")","v":""},{"$f":"IF($AL$426=1,IF(ISNUMBER(SEARCH($AK$426,'Hide this - Workings'!D18)),1,0),\"\")","v":""},{"$f":"IF($AL$427=1,IF(ISNUMBER(SEARCH($AK$427,'Hide this - Workings'!D18)),1,0),\"\")","v":""},{"$f":"IF($AL$428=1,IF(ISNUMBER(SEARCH($AK$428,'Hide this - Workings'!D18)),1,0),\"\")","v":""},{"$f":"IF($AL$429=1,IF(ISNUMBER(SEARCH($AK$429,'Hide this - Workings'!D18)),1,0),\"\")","v":""},{"$f":"IF($AL$430=1,IF(ISNUMBER(SEARCH($AK$430,'Hide this - Workings'!D18)),1,0),\"\")","v":""},{"$f":"IF($AL$431=1,IF(ISNUMBER(SEARCH($AK$431,'Hide this - Workings'!D18)),1,0),\"\")","v":""},{"$f":"IF($AL$432=1,IF(ISNUMBER(SEARCH($AK$432,'Hide this - Workings'!D18)),1,0),\"\")","v":""},{"$f":"IF($AL$433=1,IF(ISNUMBER(SEARCH($AK$433,'Hide this - Workings'!D18)),1,0),\"\")","v":""},0,"A014",0,"Please could you provide some additional detail regarding the provision of Blue Badges? In our authority the provision of Blue Badges is no longer dealt with by the Adult Social Care department in our structure; requests and provision are handled by our Customer Contact Centre. I'm in the process of confirming where the funding comes from. [STS001] Blue Badge provision should be included within the SALT return, irrespective of funding source if the provision is still arranged by the local authority.\nRenewals are not new requests for support (as the request has already been addressed, the renewal is purely an administrative process) so in common with the way this was treated in the RAP return Blue Badge renewals would not appear in STS001.\n","Please could you provide some additional detail regarding the provision of Blue Badges? In our authority the provision of Blue Badges is no longer dealt with by the Adult Social Care department in our structure; requests and provision are handled by our Customer Contact Centre. I'm in the process of confirming where the funding comes from. [STS001]","Blue Badge provision should be included within the SALT return, irrespective of funding source if the provision is still arranged by the local authority.\nRenewals are not new requests for support (as the request has already been addressed, the renewal is purely an administrative process) so in common with the way this was treated in the RAP return Blue Badge renewals would not appear in STS001.\n"]
[null,null,"","What category within STS001 would you expect registrations for the blind / partially sighted or deaf / hard of hearing to appear in? Please note that registrations such as these are not considered to be services for SALT purposes, so registrations for the blind / partially sighted or deaf / hard of hearing would not be recorded as ‘requests for support’ within SALT. We recognise that registrations may be accompanied by a request for social care assessment / support. In these cases it is the sequel to the request for support rather than the fact of the registration that would be captured for SALT, with the criteria for inclusion being the same as all other requests for support captured for STS001.",null,null,null,null,null,null,null,"What category within STS001 would you expect registrations for the blind / partially sighted or deaf / hard of hearing to appear in?","Please note that registrations such as these are not considered to be services for SALT purposes, so registrations for the blind / partially sighted or deaf / hard of hearing would not be recorded as ‘requests for support’ within SALT. We recognise that registrations may be accompanied by a request for social care assessment / support. In these cases it is the sequel to the request for support rather than the fact of the registration that would be captured for SALT, with the criteria for inclusion being the same as all other requests for support captured for STS001.",{"$f":"IF($AL$417=1,IF(ISNUMBER(SEARCH($AK$417,'Hide this - Workings'!D19)),1,0),\"\")","v":""},{"$f":"IF($AL$418=1,IF(ISNUMBER(SEARCH($AK$418,'Hide this - Workings'!D19)),1,0),\"\")","v":""},{"$f":"IF($AL$419=1,IF(ISNUMBER(SEARCH($AK$419,'Hide this - Workings'!D19)),1,0),\"\")","v":""},{"$f":"IF($AL$420=1,IF(ISNUMBER(SEARCH($AK$420,'Hide this - Workings'!D19)),1,0),\"\")","v":""},{"$f":"IF($AL$421=1,IF(ISNUMBER(SEARCH($AK$421,'Hide this - Workings'!D19)),1,0),\"\")","v":""},{"$f":"IF($AL$422=1,IF(ISNUMBER(SEARCH($AK$422,'Hide this - Workings'!D19)),1,0),\"\")","v":""},{"$f":"IF($AL$423=1,IF(ISNUMBER(SEARCH($AK$423,'Hide this - Workings'!D19)),1,0),\"\")","v":""},{"$f":"IF($AL$424=1,IF(ISNUMBER(SEARCH($AK$424,'Hide this - Workings'!D19)),1,0),\"\")","v":""},{"$f":"IF($AL$425=1,IF(ISNUMBER(SEARCH($AK$425,'Hide this - Workings'!D19)),1,0),\"\")","v":""},{"$f":"IF($AL$426=1,IF(ISNUMBER(SEARCH($AK$426,'Hide this - Workings'!D19)),1,0),\"\")","v":""},{"$f":"IF($AL$427=1,IF(ISNUMBER(SEARCH($AK$427,'Hide this - Workings'!D19)),1,0),\"\")","v":""},{"$f":"IF($AL$428=1,IF(ISNUMBER(SEARCH($AK$428,'Hide this - Workings'!D19)),1,0),\"\")","v":""},{"$f":"IF($AL$429=1,IF(ISNUMBER(SEARCH($AK$429,'Hide this - Workings'!D19)),1,0),\"\")","v":""},{"$f":"IF($AL$430=1,IF(ISNUMBER(SEARCH($AK$430,'Hide this - Workings'!D19)),1,0),\"\")","v":""},{"$f":"IF($AL$431=1,IF(ISNUMBER(SEARCH($AK$431,'Hide this - Workings'!D19)),1,0),\"\")","v":""},{"$f":"IF($AL$432=1,IF(ISNUMBER(SEARCH($AK$432,'Hide this - Workings'!D19)),1,0),\"\")","v":""},{"$f":"IF($AL$433=1,IF(ISNUMBER(SEARCH($AK$433,'Hide this - Workings'!D19)),1,0),\"\")","v":""},0,"A015",0,"What category within STS001 would you expect registrations for the blind / partially sighted or deaf / hard of hearing to appear in? Please note that registrations such as these are not considered to be services for SALT purposes, so registrations for the blind / partially sighted or deaf / hard of hearing would not be recorded as ‘requests for support’ within SALT. We recognise that registrations may be accompanied by a request for social care assessment / support. In these cases it is the sequel to the request for support rather than the fact of the registration that would be captured for SALT, with the criteria for inclusion being the same as all other requests for support captured for STS001.","What category within STS001 would you expect registrations for the blind / partially sighted or deaf / hard of hearing to appear in?","Please note that registrations such as these are not considered to be services for SALT purposes, so registrations for the blind / partially sighted or deaf / hard of hearing would not be recorded as ‘requests for support’ within SALT. We recognise that registrations may be accompanied by a request for social care assessment / support. In these cases it is the sequel to the request for support rather than the fact of the registration that would be captured for SALT, with the criteria for inclusion being the same as all other requests for support captured for STS001."]
[null,null,"","How do I treat placements at residential schools/colleges for transition clients? [STS001] They should be included as a response to request for support in STS001, bearing in mind that such requests and placements for transition clients made before their 18th birthday would only be captured once the person turned 18. The appropriate sequel is 'Short Term Support (other)'. Such placements would not appear in any of the other SALT measures and will not be counted as 'permanent admissions' to residential care.",null,null,null,null,null,null,null,"How do I treat placements at residential schools/colleges for transition clients? [STS001]","They should be included as a response to request for support in STS001, bearing in mind that such requests and placements for transition clients made before their 18th birthday would only be captured once the person turned 18. The appropriate sequel is 'Short Term Support (other)'. Such placements would not appear in any of the other SALT measures and will not be counted as 'permanent admissions' to residential care.",{"$f":"IF($AL$417=1,IF(ISNUMBER(SEARCH($AK$417,'Hide this - Workings'!D20)),1,0),\"\")","v":""},{"$f":"IF($AL$418=1,IF(ISNUMBER(SEARCH($AK$418,'Hide this - Workings'!D20)),1,0),\"\")","v":""},{"$f":"IF($AL$419=1,IF(ISNUMBER(SEARCH($AK$419,'Hide this - Workings'!D20)),1,0),\"\")","v":""},{"$f":"IF($AL$420=1,IF(ISNUMBER(SEARCH($AK$420,'Hide this - Workings'!D20)),1,0),\"\")","v":""},{"$f":"IF($AL$421=1,IF(ISNUMBER(SEARCH($AK$421,'Hide this - Workings'!D20)),1,0),\"\")","v":""},{"$f":"IF($AL$422=1,IF(ISNUMBER(SEARCH($AK$422,'Hide this - Workings'!D20)),1,0),\"\")","v":""},{"$f":"IF($AL$423=1,IF(ISNUMBER(SEARCH($AK$423,'Hide this - Workings'!D20)),1,0),\"\")","v":""},{"$f":"IF($AL$424=1,IF(ISNUMBER(SEARCH($AK$424,'Hide this - Workings'!D20)),1,0),\"\")","v":""},{"$f":"IF($AL$425=1,IF(ISNUMBER(SEARCH($AK$425,'Hide this - Workings'!D20)),1,0),\"\")","v":""},{"$f":"IF($AL$426=1,IF(ISNUMBER(SEARCH($AK$426,'Hide this - Workings'!D20)),1,0),\"\")","v":""},{"$f":"IF($AL$427=1,IF(ISNUMBER(SEARCH($AK$427,'Hide this - Workings'!D20)),1,0),\"\")","v":""},{"$f":"IF($AL$428=1,IF(ISNUMBER(SEARCH($AK$428,'Hide this - Workings'!D20)),1,0),\"\")","v":""},{"$f":"IF($AL$429=1,IF(ISNUMBER(SEARCH($AK$429,'Hide this - Workings'!D20)),1,0),\"\")","v":""},{"$f":"IF($AL$430=1,IF(ISNUMBER(SEARCH($AK$430,'Hide this - Workings'!D20)),1,0),\"\")","v":""},{"$f":"IF($AL$431=1,IF(ISNUMBER(SEARCH($AK$431,'Hide this - Workings'!D20)),1,0),\"\")","v":""},{"$f":"IF($AL$432=1,IF(ISNUMBER(SEARCH($AK$432,'Hide this - Workings'!D20)),1,0),\"\")","v":""},{"$f":"IF($AL$433=1,IF(ISNUMBER(SEARCH($AK$433,'Hide this - Workings'!D20)),1,0),\"\")","v":""},0,"A016",0,"How do I treat placements at residential schools/colleges for transition clients? [STS001] They should be included as a response to request for support in STS001, bearing in mind that such requests and placements for transition clients made before their 18th birthday would only be captured once the person turned 18. The appropriate sequel is 'Short Term Support (other)'. Such placements would not appear in any of the other SALT measures and will not be counted as 'permanent admissions' to residential care.","How do I treat placements at residential schools/colleges for transition clients? [STS001]","They should be included as a response to request for support in STS001, bearing in mind that such requests and placements for transition clients made before their 18th birthday would only be captured once the person turned 18. The appropriate sequel is 'Short Term Support (other)'. Such placements would not appear in any of the other SALT measures and will not be counted as 'permanent admissions' to residential care."]
[null,null,"","Is Occupational Therapy and Mental Health work included in SALT? Yes, if it includes a social care component. Work completed by Occupational Therapists (OT) and Occupational Therapy Assistants (OTA) and paid for by social services should be included in terms of the requests for support and sequels associated with this.\nIf you have joint health and social services teams (operating a partnership under Section 75 Agreements) then work completed by mental health teams should be included, providing this includes a social care element and the work could lead to social care services.\nAs well as applying to SALT measure STS001 this advice covers all other measures within SALT which have the potential to include the work of such teams.",null,null,null,null,null,null,null,"Is Occupational Therapy and Mental Health work included in SALT?","Yes, if it includes a social care component. Work completed by Occupational Therapists (OT) and Occupational Therapy Assistants (OTA) and paid for by social services should be included in terms of the requests for support and sequels associated with this.\nIf you have joint health and social services teams (operating a partnership under Section 75 Agreements) then work completed by mental health teams should be included, providing this includes a social care element and the work could lead to social care services.\nAs well as applying to SALT measure STS001 this advice covers all other measures within SALT which have the potential to include the work of such teams.",{"$f":"IF($AL$417=1,IF(ISNUMBER(SEARCH($AK$417,'Hide this - Workings'!D21)),1,0),\"\")","v":""},{"$f":"IF($AL$418=1,IF(ISNUMBER(SEARCH($AK$418,'Hide this - Workings'!D21)),1,0),\"\")","v":""},{"$f":"IF($AL$419=1,IF(ISNUMBER(SEARCH($AK$419,'Hide this - Workings'!D21)),1,0),\"\")","v":""},{"$f":"IF($AL$420=1,IF(ISNUMBER(SEARCH($AK$420,'Hide this - Workings'!D21)),1,0),\"\")","v":""},{"$f":"IF($AL$421=1,IF(ISNUMBER(SEARCH($AK$421,'Hide this - Workings'!D21)),1,0),\"\")","v":""},{"$f":"IF($AL$422=1,IF(ISNUMBER(SEARCH($AK$422,'Hide this - Workings'!D21)),1,0),\"\")","v":""},{"$f":"IF($AL$423=1,IF(ISNUMBER(SEARCH($AK$423,'Hide this - Workings'!D21)),1,0),\"\")","v":""},{"$f":"IF($AL$424=1,IF(ISNUMBER(SEARCH($AK$424,'Hide this - Workings'!D21)),1,0),\"\")","v":""},{"$f":"IF($AL$425=1,IF(ISNUMBER(SEARCH($AK$425,'Hide this - Workings'!D21)),1,0),\"\")","v":""},{"$f":"IF($AL$426=1,IF(ISNUMBER(SEARCH($AK$426,'Hide this - Workings'!D21)),1,0),\"\")","v":""},{"$f":"IF($AL$427=1,IF(ISNUMBER(SEARCH($AK$427,'Hide this - Workings'!D21)),1,0),\"\")","v":""},{"$f":"IF($AL$428=1,IF(ISNUMBER(SEARCH($AK$428,'Hide this - Workings'!D21)),1,0),\"\")","v":""},{"$f":"IF($AL$429=1,IF(ISNUMBER(SEARCH($AK$429,'Hide this - Workings'!D21)),1,0),\"\")","v":""},{"$f":"IF($AL$430=1,IF(ISNUMBER(SEARCH($AK$430,'Hide this - Workings'!D21)),1,0),\"\")","v":""},{"$f":"IF($AL$431=1,IF(ISNUMBER(SEARCH($AK$431,'Hide this - Workings'!D21)),1,0),\"\")","v":""},{"$f":"IF($AL$432=1,IF(ISNUMBER(SEARCH($AK$432,'Hide this - Workings'!D21)),1,0),\"\")","v":""},{"$f":"IF($AL$433=1,IF(ISNUMBER(SEARCH($AK$433,'Hide this - Workings'!D21)),1,0),\"\")","v":""},0,"A017",0,"Is Occupational Therapy and Mental Health work included in SALT? Yes, if it includes a social care component. Work completed by Occupational Therapists (OT) and Occupational Therapy Assistants (OTA) and paid for by social services should be included in terms of the requests for support and sequels associated with this.\nIf you have joint health and social services teams (operating a partnership under Section 75 Agreements) then work completed by mental health teams should be included, providing this includes a social care element and the work could lead to social care services.\nAs well as applying to SALT measure STS001 this advice covers all other measures within SALT which have the potential to include the work of such teams.","Is Occupational Therapy and Mental Health work included in SALT?","Yes, if it includes a social care component. Work completed by Occupational Therapists (OT) and Occupational Therapy Assistants (OTA) and paid for by social services should be included in terms of the requests for support and sequels associated with this.\nIf you have joint health and social services teams (operating a partnership under Section 75 Agreements) then work completed by mental health teams should be included, providing this includes a social care element and the work could lead to social care services.\nAs well as applying to SALT measure STS001 this advice covers all other measures within SALT which have the potential to include the work of such teams."]
[null,null,"","Approved Social Workers from our MH partner Trust carry out a range of assessments. Some of these are solely connected with the clinical needs of the client; others are connected with MH Guardianship. Should these assessments be considered within SALT measure STS001? No, only activity and sequels involving Approved Social Workers which are concerned with the social care needs of the client should be included in SALT.",null,null,null,null,null,null,null,"Approved Social Workers from our MH partner Trust carry out a range of assessments. Some of these are solely connected with the clinical needs of the client; others are connected with MH Guardianship. Should these assessments be considered within SALT measure STS001?","No, only activity and sequels involving Approved Social Workers which are concerned with the social care needs of the client should be included in SALT.",{"$f":"IF($AL$417=1,IF(ISNUMBER(SEARCH($AK$417,'Hide this - Workings'!D22)),1,0),\"\")","v":""},{"$f":"IF($AL$418=1,IF(ISNUMBER(SEARCH($AK$418,'Hide this - Workings'!D22)),1,0),\"\")","v":""},{"$f":"IF($AL$419=1,IF(ISNUMBER(SEARCH($AK$419,'Hide this - Workings'!D22)),1,0),\"\")","v":""},{"$f":"IF($AL$420=1,IF(ISNUMBER(SEARCH($AK$420,'Hide this - Workings'!D22)),1,0),\"\")","v":""},{"$f":"IF($AL$421=1,IF(ISNUMBER(SEARCH($AK$421,'Hide this - Workings'!D22)),1,0),\"\")","v":""},{"$f":"IF($AL$422=1,IF(ISNUMBER(SEARCH($AK$422,'Hide this - Workings'!D22)),1,0),\"\")","v":""},{"$f":"IF($AL$423=1,IF(ISNUMBER(SEARCH($AK$423,'Hide this - Workings'!D22)),1,0),\"\")","v":""},{"$f":"IF($AL$424=1,IF(ISNUMBER(SEARCH($AK$424,'Hide this - Workings'!D22)),1,0),\"\")","v":""},{"$f":"IF($AL$425=1,IF(ISNUMBER(SEARCH($AK$425,'Hide this - Workings'!D22)),1,0),\"\")","v":""},{"$f":"IF($AL$426=1,IF(ISNUMBER(SEARCH($AK$426,'Hide this - Workings'!D22)),1,0),\"\")","v":""},{"$f":"IF($AL$427=1,IF(ISNUMBER(SEARCH($AK$427,'Hide this - Workings'!D22)),1,0),\"\")","v":""},{"$f":"IF($AL$428=1,IF(ISNUMBER(SEARCH($AK$428,'Hide this - Workings'!D22)),1,0),\"\")","v":""},{"$f":"IF($AL$429=1,IF(ISNUMBER(SEARCH($AK$429,'Hide this - Workings'!D22)),1,0),\"\")","v":""},{"$f":"IF($AL$430=1,IF(ISNUMBER(SEARCH($AK$430,'Hide this - Workings'!D22)),1,0),\"\")","v":""},{"$f":"IF($AL$431=1,IF(ISNUMBER(SEARCH($AK$431,'Hide this - Workings'!D22)),1,0),\"\")","v":""},{"$f":"IF($AL$432=1,IF(ISNUMBER(SEARCH($AK$432,'Hide this - Workings'!D22)),1,0),\"\")","v":""},{"$f":"IF($AL$433=1,IF(ISNUMBER(SEARCH($AK$433,'Hide this - Workings'!D22)),1,0),\"\")","v":""},0,"A018",0,"Approved Social Workers from our MH partner Trust carry out a range of assessments. Some of these are solely connected with the clinical needs of the client; others are connected with MH Guardianship. Should these assessments be considered within SALT measure STS001? No, only activity and sequels involving Approved Social Workers which are concerned with the social care needs of the client should be included in SALT.","Approved Social Workers from our MH partner Trust carry out a range of assessments. Some of these are solely connected with the clinical needs of the client; others are connected with MH Guardianship. Should these assessments be considered within SALT measure STS001?","No, only activity and sequels involving Approved Social Workers which are concerned with the social care needs of the client should be included in SALT."]
[null,null,"","Should Adult safeguarding referrals be included? No, all activity relating to safeguarding procedures should be captured in the SAC collections. However, if as a result of safeguarding work one of the recommendations/further actions is for the vulnerable adult to be referred on for further social care support then this WOULD be included in SALT. Examples could be where a request for support is made to the social care team following safeguarding procedures, which might then lead to further short or long term support (this activity would be captured in the same way as for any other current or new client). ",null,null,null,null,null,null,null,"Should Adult safeguarding referrals be included?","No, all activity relating to safeguarding procedures should be captured in the SAC collections. However, if as a result of safeguarding work one of the recommendations/further actions is for the vulnerable adult to be referred on for further social care support then this WOULD be included in SALT. Examples could be where a request for support is made to the social care team following safeguarding procedures, which might then lead to further short or long term support (this activity would be captured in the same way as for any other current or new client). ",{"$f":"IF($AL$417=1,IF(ISNUMBER(SEARCH($AK$417,'Hide this - Workings'!D23)),1,0),\"\")","v":""},{"$f":"IF($AL$418=1,IF(ISNUMBER(SEARCH($AK$418,'Hide this - Workings'!D23)),1,0),\"\")","v":""},{"$f":"IF($AL$419=1,IF(ISNUMBER(SEARCH($AK$419,'Hide this - Workings'!D23)),1,0),\"\")","v":""},{"$f":"IF($AL$420=1,IF(ISNUMBER(SEARCH($AK$420,'Hide this - Workings'!D23)),1,0),\"\")","v":""},{"$f":"IF($AL$421=1,IF(ISNUMBER(SEARCH($AK$421,'Hide this - Workings'!D23)),1,0),\"\")","v":""},{"$f":"IF($AL$422=1,IF(ISNUMBER(SEARCH($AK$422,'Hide this - Workings'!D23)),1,0),\"\")","v":""},{"$f":"IF($AL$423=1,IF(ISNUMBER(SEARCH($AK$423,'Hide this - Workings'!D23)),1,0),\"\")","v":""},{"$f":"IF($AL$424=1,IF(ISNUMBER(SEARCH($AK$424,'Hide this - Workings'!D23)),1,0),\"\")","v":""},{"$f":"IF($AL$425=1,IF(ISNUMBER(SEARCH($AK$425,'Hide this - Workings'!D23)),1,0),\"\")","v":""},{"$f":"IF($AL$426=1,IF(ISNUMBER(SEARCH($AK$426,'Hide this - Workings'!D23)),1,0),\"\")","v":""},{"$f":"IF($AL$427=1,IF(ISNUMBER(SEARCH($AK$427,'Hide this - Workings'!D23)),1,0),\"\")","v":""},{"$f":"IF($AL$428=1,IF(ISNUMBER(SEARCH($AK$428,'Hide this - Workings'!D23)),1,0),\"\")","v":""},{"$f":"IF($AL$429=1,IF(ISNUMBER(SEARCH($AK$429,'Hide this - Workings'!D23)),1,0),\"\")","v":""},{"$f":"IF($AL$430=1,IF(ISNUMBER(SEARCH($AK$430,'Hide this - Workings'!D23)),1,0),\"\")","v":""},{"$f":"IF($AL$431=1,IF(ISNUMBER(SEARCH($AK$431,'Hide this - Workings'!D23)),1,0),\"\")","v":""},{"$f":"IF($AL$432=1,IF(ISNUMBER(SEARCH($AK$432,'Hide this - Workings'!D23)),1,0),\"\")","v":""},{"$f":"IF($AL$433=1,IF(ISNUMBER(SEARCH($AK$433,'Hide this - Workings'!D23)),1,0),\"\")","v":""},0,"A019",0,"Should Adult safeguarding referrals be included? No, all activity relating to safeguarding procedures should be captured in the SAC collections. However, if as a result of safeguarding work one of the recommendations/further actions is for the vulnerable adult to be referred on for further social care support then this WOULD be included in SALT. Examples could be where a request for support is made to the social care team following safeguarding procedures, which might then lead to further short or long term support (this activity would be captured in the same way as for any other current or new client). ","Should Adult safeguarding referrals be included?","No, all activity relating to safeguarding procedures should be captured in the SAC collections. However, if as a result of safeguarding work one of the recommendations/further actions is for the vulnerable adult to be referred on for further social care support then this WOULD be included in SALT. Examples could be where a request for support is made to the social care team following safeguarding procedures, which might then lead to further short or long term support (this activity would be captured in the same way as for any other current or new client). "]
[null,null,"","Please could you advise me how Supporting People funded care is to be included in the SALT Return? Two considerations need to be taken into account - firstly does the support contain a social care element? Secondly is the expenditure defined by your authority as social care expenditure? If both these criteria are met then the care can be considered for inclusion in SALT. However, it must also meet the criteria for inclusion in the various measures of the collection.",null,null,null,null,null,null,null,"Please could you advise me how Supporting People funded care is to be included in the SALT Return?","Two considerations need to be taken into account - firstly does the support contain a social care element? Secondly is the expenditure defined by your authority as social care expenditure? If both these criteria are met then the care can be considered for inclusion in SALT. However, it must also meet the criteria for inclusion in the various measures of the collection.",{"$f":"IF($AL$417=1,IF(ISNUMBER(SEARCH($AK$417,'Hide this - Workings'!D24)),1,0),\"\")","v":""},{"$f":"IF($AL$418=1,IF(ISNUMBER(SEARCH($AK$418,'Hide this - Workings'!D24)),1,0),\"\")","v":""},{"$f":"IF($AL$419=1,IF(ISNUMBER(SEARCH($AK$419,'Hide this - Workings'!D24)),1,0),\"\")","v":""},{"$f":"IF($AL$420=1,IF(ISNUMBER(SEARCH($AK$420,'Hide this - Workings'!D24)),1,0),\"\")","v":""},{"$f":"IF($AL$421=1,IF(ISNUMBER(SEARCH($AK$421,'Hide this - Workings'!D24)),1,0),\"\")","v":""},{"$f":"IF($AL$422=1,IF(ISNUMBER(SEARCH($AK$422,'Hide this - Workings'!D24)),1,0),\"\")","v":""},{"$f":"IF($AL$423=1,IF(ISNUMBER(SEARCH($AK$423,'Hide this - Workings'!D24)),1,0),\"\")","v":""},{"$f":"IF($AL$424=1,IF(ISNUMBER(SEARCH($AK$424,'Hide this - Workings'!D24)),1,0),\"\")","v":""},{"$f":"IF($AL$425=1,IF(ISNUMBER(SEARCH($AK$425,'Hide this - Workings'!D24)),1,0),\"\")","v":""},{"$f":"IF($AL$426=1,IF(ISNUMBER(SEARCH($AK$426,'Hide this - Workings'!D24)),1,0),\"\")","v":""},{"$f":"IF($AL$427=1,IF(ISNUMBER(SEARCH($AK$427,'Hide this - Workings'!D24)),1,0),\"\")","v":""},{"$f":"IF($AL$428=1,IF(ISNUMBER(SEARCH($AK$428,'Hide this - Workings'!D24)),1,0),\"\")","v":""},{"$f":"IF($AL$429=1,IF(ISNUMBER(SEARCH($AK$429,'Hide this - Workings'!D24)),1,0),\"\")","v":""},{"$f":"IF($AL$430=1,IF(ISNUMBER(SEARCH($AK$430,'Hide this - Workings'!D24)),1,0),\"\")","v":""},{"$f":"IF($AL$431=1,IF(ISNUMBER(SEARCH($AK$431,'Hide this - Workings'!D24)),1,0),\"\")","v":""},{"$f":"IF($AL$432=1,IF(ISNUMBER(SEARCH($AK$432,'Hide this - Workings'!D24)),1,0),\"\")","v":""},{"$f":"IF($AL$433=1,IF(ISNUMBER(SEARCH($AK$433,'Hide this - Workings'!D24)),1,0),\"\")","v":""},0,"A020",0,"Please could you advise me how Supporting People funded care is to be included in the SALT Return? Two considerations need to be taken into account - firstly does the support contain a social care element? Secondly is the expenditure defined by your authority as social care expenditure? If both these criteria are met then the care can be considered for inclusion in SALT. However, it must also meet the criteria for inclusion in the various measures of the collection.","Please could you advise me how Supporting People funded care is to be included in the SALT Return?","Two considerations need to be taken into account - firstly does the support contain a social care element? Secondly is the expenditure defined by your authority as social care expenditure? If both these criteria are met then the care can be considered for inclusion in SALT. However, it must also meet the criteria for inclusion in the various measures of the collection."]
[null,null,"","How should we treat '12-week disregard' clients in STS001/STS002a/b and LTS002a/b? SALT captures data on sequels to events in the customer journey, even if the eventual funding arrangements are not yet confirmed. Admissions to residential or nursing care captured at the time of the sequel to request for support, ST MAX or review should be included as \"Long Term Support\" - Nursing Care (or Residential Care) if funding for the placement will be initially made using a 12-week disregard arrangement.  Long term admissions include clients whose admission is subject to a 12 week disregard as well as deferred payment arrangements.",null,null,null,null,null,null,null,"How should we treat '12-week disregard' clients in STS001/STS002a/b and LTS002a/b?","SALT captures data on sequels to events in the customer journey, even if the eventual funding arrangements are not yet confirmed. Admissions to residential or nursing care captured at the time of the sequel to request for support, ST MAX or review should be included as \"Long Term Support\" - Nursing Care (or Residential Care) if funding for the placement will be initially made using a 12-week disregard arrangement.  Long term admissions include clients whose admission is subject to a 12 week disregard as well as deferred payment arrangements.",{"$f":"IF($AL$417=1,IF(ISNUMBER(SEARCH($AK$417,'Hide this - Workings'!D25)),1,0),\"\")","v":""},{"$f":"IF($AL$418=1,IF(ISNUMBER(SEARCH($AK$418,'Hide this - Workings'!D25)),1,0),\"\")","v":""},{"$f":"IF($AL$419=1,IF(ISNUMBER(SEARCH($AK$419,'Hide this - Workings'!D25)),1,0),\"\")","v":""},{"$f":"IF($AL$420=1,IF(ISNUMBER(SEARCH($AK$420,'Hide this - Workings'!D25)),1,0),\"\")","v":""},{"$f":"IF($AL$421=1,IF(ISNUMBER(SEARCH($AK$421,'Hide this - Workings'!D25)),1,0),\"\")","v":""},{"$f":"IF($AL$422=1,IF(ISNUMBER(SEARCH($AK$422,'Hide this - Workings'!D25)),1,0),\"\")","v":""},{"$f":"IF($AL$423=1,IF(ISNUMBER(SEARCH($AK$423,'Hide this - Workings'!D25)),1,0),\"\")","v":""},{"$f":"IF($AL$424=1,IF(ISNUMBER(SEARCH($AK$424,'Hide this - Workings'!D25)),1,0),\"\")","v":""},{"$f":"IF($AL$425=1,IF(ISNUMBER(SEARCH($AK$425,'Hide this - Workings'!D25)),1,0),\"\")","v":""},{"$f":"IF($AL$426=1,IF(ISNUMBER(SEARCH($AK$426,'Hide this - Workings'!D25)),1,0),\"\")","v":""},{"$f":"IF($AL$427=1,IF(ISNUMBER(SEARCH($AK$427,'Hide this - Workings'!D25)),1,0),\"\")","v":""},{"$f":"IF($AL$428=1,IF(ISNUMBER(SEARCH($AK$428,'Hide this - Workings'!D25)),1,0),\"\")","v":""},{"$f":"IF($AL$429=1,IF(ISNUMBER(SEARCH($AK$429,'Hide this - Workings'!D25)),1,0),\"\")","v":""},{"$f":"IF($AL$430=1,IF(ISNUMBER(SEARCH($AK$430,'Hide this - Workings'!D25)),1,0),\"\")","v":""},{"$f":"IF($AL$431=1,IF(ISNUMBER(SEARCH($AK$431,'Hide this - Workings'!D25)),1,0),\"\")","v":""},{"$f":"IF($AL$432=1,IF(ISNUMBER(SEARCH($AK$432,'Hide this - Workings'!D25)),1,0),\"\")","v":""},{"$f":"IF($AL$433=1,IF(ISNUMBER(SEARCH($AK$433,'Hide this - Workings'!D25)),1,0),\"\")","v":""},0,"A021",0,"How should we treat '12-week disregard' clients in STS001/STS002a/b and LTS002a/b? SALT captures data on sequels to events in the customer journey, even if the eventual funding arrangements are not yet confirmed. Admissions to residential or nursing care captured at the time of the sequel to request for support, ST MAX or review should be included as \"Long Term Support\" - Nursing Care (or Residential Care) if funding for the placement will be initially made using a 12-week disregard arrangement.  Long term admissions include clients whose admission is subject to a 12 week disregard as well as deferred payment arrangements.","How should we treat '12-week disregard' clients in STS001/STS002a/b and LTS002a/b?","SALT captures data on sequels to events in the customer journey, even if the eventual funding arrangements are not yet confirmed. Admissions to residential or nursing care captured at the time of the sequel to request for support, ST MAX or review should be included as \"Long Term Support\" - Nursing Care (or Residential Care) if funding for the placement will be initially made using a 12-week disregard arrangement.  Long term admissions include clients whose admission is subject to a 12 week disregard as well as deferred payment arrangements."]
[null,null,"","The SALT guidance describes professional support as time-limited and suggests reporting it in STS001 as ‘short term support (other)’. Could you advise as to what the time limit is? Support that is time limited in SALT (such as ST-Max, short term support -other) does not have a specific time limit but in all cases there will be an expectation of roughly when the support will end. Rules over length of provision will differ between authorities and so it is for local authorities to determine whether there is a specific end point in mind for the intervention. In the case of professional support, which used to be captured in RAP, most will be time limited. That might be three months or two weeks, depending on the individual circumstances of the client. But if there is a clear end-point in mind (to help the client into employment, to provide short term counselling etc.) then it would be classed as 'short term support' (other). In other cases where support is minimal but continues for a long period of time and is open ended in scope (e.g., a weekly phone call to the client to check that they have no issues requiring further intervention) then this would go under 'ongoing low level support'.",null,null,null,null,null,null,null,"The SALT guidance describes professional support as time-limited and suggests reporting it in STS001 as ‘short term support (other)’. Could you advise as to what the time limit is?","Support that is time limited in SALT (such as ST-Max, short term support -other) does not have a specific time limit but in all cases there will be an expectation of roughly when the support will end. Rules over length of provision will differ between authorities and so it is for local authorities to determine whether there is a specific end point in mind for the intervention. In the case of professional support, which used to be captured in RAP, most will be time limited. That might be three months or two weeks, depending on the individual circumstances of the client. But if there is a clear end-point in mind (to help the client into employment, to provide short term counselling etc.) then it would be classed as 'short term support' (other). In other cases where support is minimal but continues for a long period of time and is open ended in scope (e.g., a weekly phone call to the client to check that they have no issues requiring further intervention) then this would go under 'ongoing low level support'.",{"$f":"IF($AL$417=1,IF(ISNUMBER(SEARCH($AK$417,'Hide this - Workings'!D26)),1,0),\"\")","v":""},{"$f":"IF($AL$418=1,IF(ISNUMBER(SEARCH($AK$418,'Hide this - Workings'!D26)),1,0),\"\")","v":""},{"$f":"IF($AL$419=1,IF(ISNUMBER(SEARCH($AK$419,'Hide this - Workings'!D26)),1,0),\"\")","v":""},{"$f":"IF($AL$420=1,IF(ISNUMBER(SEARCH($AK$420,'Hide this - Workings'!D26)),1,0),\"\")","v":""},{"$f":"IF($AL$421=1,IF(ISNUMBER(SEARCH($AK$421,'Hide this - Workings'!D26)),1,0),\"\")","v":""},{"$f":"IF($AL$422=1,IF(ISNUMBER(SEARCH($AK$422,'Hide this - Workings'!D26)),1,0),\"\")","v":""},{"$f":"IF($AL$423=1,IF(ISNUMBER(SEARCH($AK$423,'Hide this - Workings'!D26)),1,0),\"\")","v":""},{"$f":"IF($AL$424=1,IF(ISNUMBER(SEARCH($AK$424,'Hide this - Workings'!D26)),1,0),\"\")","v":""},{"$f":"IF($AL$425=1,IF(ISNUMBER(SEARCH($AK$425,'Hide this - Workings'!D26)),1,0),\"\")","v":""},{"$f":"IF($AL$426=1,IF(ISNUMBER(SEARCH($AK$426,'Hide this - Workings'!D26)),1,0),\"\")","v":""},{"$f":"IF($AL$427=1,IF(ISNUMBER(SEARCH($AK$427,'Hide this - Workings'!D26)),1,0),\"\")","v":""},{"$f":"IF($AL$428=1,IF(ISNUMBER(SEARCH($AK$428,'Hide this - Workings'!D26)),1,0),\"\")","v":""},{"$f":"IF($AL$429=1,IF(ISNUMBER(SEARCH($AK$429,'Hide this - Workings'!D26)),1,0),\"\")","v":""},{"$f":"IF($AL$430=1,IF(ISNUMBER(SEARCH($AK$430,'Hide this - Workings'!D26)),1,0),\"\")","v":""},{"$f":"IF($AL$431=1,IF(ISNUMBER(SEARCH($AK$431,'Hide this - Workings'!D26)),1,0),\"\")","v":""},{"$f":"IF($AL$432=1,IF(ISNUMBER(SEARCH($AK$432,'Hide this - Workings'!D26)),1,0),\"\")","v":""},{"$f":"IF($AL$433=1,IF(ISNUMBER(SEARCH($AK$433,'Hide this - Workings'!D26)),1,0),\"\")","v":""},0,"A022",0,"The SALT guidance describes professional support as time-limited and suggests reporting it in STS001 as ‘short term support (other)’. Could you advise as to what the time limit is? Support that is time limited in SALT (such as ST-Max, short term support -other) does not have a specific time limit but in all cases there will be an expectation of roughly when the support will end. Rules over length of provision will differ between authorities and so it is for local authorities to determine whether there is a specific end point in mind for the intervention. In the case of professional support, which used to be captured in RAP, most will be time limited. That might be three months or two weeks, depending on the individual circumstances of the client. But if there is a clear end-point in mind (to help the client into employment, to provide short term counselling etc.) then it would be classed as 'short term support' (other). In other cases where support is minimal but continues for a long period of time and is open ended in scope (e.g., a weekly phone call to the client to check that they have no issues requiring further intervention) then this would go under 'ongoing low level support'.","The SALT guidance describes professional support as time-limited and suggests reporting it in STS001 as ‘short term support (other)’. Could you advise as to what the time limit is?","Support that is time limited in SALT (such as ST-Max, short term support -other) does not have a specific time limit but in all cases there will be an expectation of roughly when the support will end. Rules over length of provision will differ between authorities and so it is for local authorities to determine whether there is a specific end point in mind for the intervention. In the case of professional support, which used to be captured in RAP, most will be time limited. That might be three months or two weeks, depending on the individual circumstances of the client. But if there is a clear end-point in mind (to help the client into employment, to provide short term counselling etc.) then it would be classed as 'short term support' (other). In other cases where support is minimal but continues for a long period of time and is open ended in scope (e.g., a weekly phone call to the client to check that they have no issues requiring further intervention) then this would go under 'ongoing low level support'."]
[null,null,"","How do I treat cases where the funding arrangements are not clear, even when care provision has been set up? An example would be for clients where we provide interim support while decisions around Continuing Health Care (CHC) funding are made. These can go on for many weeks, and in the meantime the client is kept safe through provision of a care package. In circumstances where the care required is clear (e.g., admission to residential or nursing care) but it is not clear for some time how this will be paid for in the longer term, it is necessary to consider who is paying in the interim. So requests for support followed by interim care whilst CHC funding is assessed would be treated as long term support for as long as the interim funding continues. This assumes that the outcome of, for example, an application for CHC funding is not known until well after decisions are made about the care package required. Any interim funding should be predominately for social care needs - SALT does not capture data about health care needs.\nBelow some examples around different funding scenarios which should assist in the identification of the correct sequel.\n\nScenario 1: a new client with no current council support requests support. They subsequently receive an assessment which identifies that they need nursing care and they are placed in such provision until the outcome of the Continuing Health Care assessment is completed. In the interim, the council meets the cost of the care, until the CHC funding is approved (and the client is then no longer supported by the council). Council funding was therefore in place for a number of weeks prior to the end of March. By 31st March local authority support had ended as CHC funding had taken over.\nSALT requires: that the Request for Support is counted in STS001 with a sequel of ‘Long Term Support (eligible services) - nursing care setting’. The nursing service is captured in LTS001a under the ‘Support Setting’ of ‘Nursing Care’. Any review on the client during the period of council funding would be also be included in LTS002a. Because council funding for the support ended prior to the year end, there would be no data for this client in LTS001b (or c) or LTS002b. If the client had a PSR of ‘Learning Disability Support’ then they would also be included in the LTS004 measure on employment and accommodation.\n\nScenario 2: a new request for physical support needs is received for a client not known to the council. They are judged as appropriate to receive short term support to maximise their independence (ST-Max) but this does not work as expected, is ended early and the client placed in residential care. On financial assessment, after placement, it is found that they have the means to pay the full costs of their care, but they ask that the council remain involved in reviewing their care needs on a regular basis. The council agrees to carry out a planned review once a year, unless circumstances change. No review is made before the year end, but the client continues to be in placement on 31st March.\nSALT requires: that this client be captured in STS001, STS002a and LTS001a/b. The initial request for support (STS001) will have a sequel of ‘Short Term Support to Maximise Independence’. The period of ST-Max was cut short due to the needs of the client, so the sequel for STS002a will be ‘Early Cessation of Service (leading to long term support)’ for Tables 1-3, with Support Setting ‘Residential’ in Table 4. For LTS001a the client is recorded under Support Setting ‘Residential’ and also in LTS001b. This client is ‘full cost’ (see the guidance for a full description) and the admission to residential care is counted in the ASCOF 2A measure.\n\n\n\n\n\n\n\n\n\n\n\n\n\n\n\n\n\n\n\n\n\nScenario 3: An existing long term supported client with home care services was placed in residential care after a fall at home and unscheduled review which determined their needs could no longer be met in the community. The client was paying the full costs of their care but was under the care management of the council (i.e., their care needs were regularly reviewed as a 'full cost' client). They now need to sell their house and the council provides ‘12-week disregard’ funding and a period of additional interim funding before the client funds their own placement. The client decides that they do not wish to remain in contact with the local authority for social care needs as their family will be able to deal with the home directly.\nInterim funding ends on 15th January in the reporting year.\nSALT requires: that this client be captured in SALT, under measures LTS001a (NOT b or c) and in LTS002a (NOT b). Their status as a full-cost client means that the care provision at home will need to be captured in LTS001a this year. The unplanned review is captured in LTS002a, with a sequel of ‘Change in Setting – Move to Residential Care’ even though they will become a self-funder after interim funding ends. The council’s provision of 12-week disregard or interim funding means they are included in SALT in the same way as other clients who are funded by the council in the longer term. Thus the move to residential care is captured as a new admission. Because interim funding ended within the reporting year (i.e., on or before 31st March) then this client will NOT appear in SALT next year, as they will by that time be self- funding. Self-funders are classed as people who, although their care arrangements may have been set up by the council, do not wish to remain in contact, are not reviewed by the council on an on-going basis and do not continue to be monitored or have details of their support arrangements recorded.\n\nScenario 4: A client with Primary Support Reason of ‘Mental Health Support’ find that they unable to cope and is placed by the local authority in residential care after a period of long term support in the community, exceeding 12 months. The expectation is that after a 6-18 month period, they will be well enough to move back into the community and live independently. Funding is agreed for six months initially, to be reviewed towards the end of that time. The placement is made prior to the end of the year. There is a possibility that funding will be extended if the client is not ready to move back into the community. Such placements usually end within 18 months but occasionally this is not possible and the client will remain in residential care, long term.\nSALT requires: that this client will be recorded in SALT LTS001a, b and c, as well as LTS002a and b. Their status as a long term supported client for more than a year means their provision will appear in all the LTS001 measures. For LTS002a, the sequel is NOT ‘Short Term Support to Maximise Independence’ because the minimum expected period of placement is six months. This is also not a placement made on the basis of a short term stay that would fit under ‘Short Term Support (other)’. There is no pre-determined end date. For the foreseeable future, the client’s long term support needs will be met through residential care provision and the sequel (for the unplanned review) in measure LTS002a would be ‘Change in Setting – Move to Residential Care’. For LTS002b, reflecting the client’s period of long term support exceeding 12 months, the same sequel would apply. Note that the admission to residential care is only counted once for the purposes of ASCOF 2A, as only data from LTS002a (and not LTS002b) is used.\n",null,null,null,null,null,null,null,"How do I treat cases where the funding arrangements are not clear, even when care provision has been set up? An example would be for clients where we provide interim support while decisions around Continuing Health Care (CHC) funding are made. These can go on for many weeks, and in the meantime the client is kept safe through provision of a care package.","In circumstances where the care required is clear (e.g., admission to residential or nursing care) but it is not clear for some time how this will be paid for in the longer term, it is necessary to consider who is paying in the interim. So requests for support followed by interim care whilst CHC funding is assessed would be treated as long term support for as long as the interim funding continues. This assumes that the outcome of, for example, an application for CHC funding is not known until well after decisions are made about the care package required. Any interim funding should be predominately for social care needs - SALT does not capture data about health care needs.\nBelow some examples around different funding scenarios which should assist in the identification of the correct sequel.\n\nScenario 1: a new client with no current council support requests support. They subsequently receive an assessment which identifies that they need nursing care and they are placed in such provision until the outcome of the Continuing Health Care assessment is completed. In the interim, the council meets the cost of the care, until the CHC funding is approved (and the client is then no longer supported by the council). Council funding was therefore in place for a number of weeks prior to the end of March. By 31st March local authority support had ended as CHC funding had taken over.\nSALT requires: that the Request for Support is counted in STS001 with a sequel of ‘Long Term Support (eligible services) - nursing care setting’. The nursing service is captured in LTS001a under the ‘Support Setting’ of ‘Nursing Care’. Any review on the client during the period of council funding would be also be included in LTS002a. Because council funding for the support ended prior to the year end, there would be no data for this client in LTS001b (or c) or LTS002b. If the client had a PSR of ‘Learning Disability Support’ then they would also be included in the LTS004 measure on employment and accommodation.\n\nScenario 2: a new request for physical support needs is received for a client not known to the council. They are judged as appropriate to receive short term support to maximise their independence (ST-Max) but this does not work as expected, is ended early and the client placed in residential care. On financial assessment, after placement, it is found that they have the means to pay the full costs of their care, but they ask that the council remain involved in reviewing their care needs on a regular basis. The council agrees to carry out a planned review once a year, unless circumstances change. No review is made before the year end, but the client continues to be in placement on 31st March.\nSALT requires: that this client be captured in STS001, STS002a and LTS001a/b. The initial request for support (STS001) will have a sequel of ‘Short Term Support to Maximise Independence’. The period of ST-Max was cut short due to the needs of the client, so the sequel for STS002a will be ‘Early Cessation of Service (leading to long term support)’ for Tables 1-3, with Support Setting ‘Residential’ in Table 4. For LTS001a the client is recorded under Support Setting ‘Residential’ and also in LTS001b. This client is ‘full cost’ (see the guidance for a full description) and the admission to residential care is counted in the ASCOF 2A measure.\n\n\n\n\n\n\n\n\n\n\n\n\n\n\n\n\n\n\n\n\n\nScenario 3: An existing long term supported client with home care services was placed in residential care after a fall at home and unscheduled review which determined their needs could no longer be met in the community. The client was paying the full costs of their care but was under the care management of the council (i.e., their care needs were regularly reviewed as a 'full cost' client). They now need to sell their house and the council provides ‘12-week disregard’ funding and a period of additional interim funding before the client funds their own placement. The client decides that they do not wish to remain in contact with the local authority for social care needs as their family will be able to deal with the home directly.\nInterim funding ends on 15th January in the reporting year.\nSALT requires: that this client be captured in SALT, under measures LTS001a (NOT b or c) and in LTS002a (NOT b). Their status as a full-cost client means that the care provision at home will need to be captured in LTS001a this year. The unplanned review is captured in LTS002a, with a sequel of ‘Change in Setting – Move to Residential Care’ even though they will become a self-funder after interim funding ends. The council’s provision of 12-week disregard or interim funding means they are included in SALT in the same way as other clients who are funded by the council in the longer term. Thus the move to residential care is captured as a new admission. Because interim funding ended within the reporting year (i.e., on or before 31st March) then this client will NOT appear in SALT next year, as they will by that time be self- funding. Self-funders are classed as people who, although their care arrangements may have been set up by the council, do not wish to remain in contact, are not reviewed by the council on an on-going basis and do not continue to be monitored or have details of their support arrangements recorded.\n\nScenario 4: A client with Primary Support Reason of ‘Mental Health Support’ find that they unable to cope and is placed by the local authority in residential care after a period of long term support in the community, exceeding 12 months. The expectation is that after a 6-18 month period, they will be well enough to move back into the community and live independently. Funding is agreed for six months initially, to be reviewed towards the end of that time. The placement is made prior to the end of the year. There is a possibility that funding will be extended if the client is not ready to move back into the community. Such placements usually end within 18 months but occasionally this is not possible and the client will remain in residential care, long term.\nSALT requires: that this client will be recorded in SALT LTS001a, b and c, as well as LTS002a and b. Their status as a long term supported client for more than a year means their provision will appear in all the LTS001 measures. For LTS002a, the sequel is NOT ‘Short Term Support to Maximise Independence’ because the minimum expected period of placement is six months. This is also not a placement made on the basis of a short term stay that would fit under ‘Short Term Support (other)’. There is no pre-determined end date. For the foreseeable future, the client’s long term support needs will be met through residential care provision and the sequel (for the unplanned review) in measure LTS002a would be ‘Change in Setting – Move to Residential Care’. For LTS002b, reflecting the client’s period of long term support exceeding 12 months, the same sequel would apply. Note that the admission to residential care is only counted once for the purposes of ASCOF 2A, as only data from LTS002a (and not LTS002b) is used.\n",{"$f":"IF($AL$417=1,IF(ISNUMBER(SEARCH($AK$417,'Hide this - Workings'!D27)),1,0),\"\")","v":""},{"$f":"IF($AL$418=1,IF(ISNUMBER(SEARCH($AK$418,'Hide this - Workings'!D27)),1,0),\"\")","v":""},{"$f":"IF($AL$419=1,IF(ISNUMBER(SEARCH($AK$419,'Hide this - Workings'!D27)),1,0),\"\")","v":""},{"$f":"IF($AL$420=1,IF(ISNUMBER(SEARCH($AK$420,'Hide this - Workings'!D27)),1,0),\"\")","v":""},{"$f":"IF($AL$421=1,IF(ISNUMBER(SEARCH($AK$421,'Hide this - Workings'!D27)),1,0),\"\")","v":""},{"$f":"IF($AL$422=1,IF(ISNUMBER(SEARCH($AK$422,'Hide this - Workings'!D27)),1,0),\"\")","v":""},{"$f":"IF($AL$423=1,IF(ISNUMBER(SEARCH($AK$423,'Hide this - Workings'!D27)),1,0),\"\")","v":""},{"$f":"IF($AL$424=1,IF(ISNUMBER(SEARCH($AK$424,'Hide this - Workings'!D27)),1,0),\"\")","v":""},{"$f":"IF($AL$425=1,IF(ISNUMBER(SEARCH($AK$425,'Hide this - Workings'!D27)),1,0),\"\")","v":""},{"$f":"IF($AL$426=1,IF(ISNUMBER(SEARCH($AK$426,'Hide this - Workings'!D27)),1,0),\"\")","v":""},{"$f":"IF($AL$427=1,IF(ISNUMBER(SEARCH($AK$427,'Hide this - Workings'!D27)),1,0),\"\")","v":""},{"$f":"IF($AL$428=1,IF(ISNUMBER(SEARCH($AK$428,'Hide this - Workings'!D27)),1,0),\"\")","v":""},{"$f":"IF($AL$429=1,IF(ISNUMBER(SEARCH($AK$429,'Hide this - Workings'!D27)),1,0),\"\")","v":""},{"$f":"IF($AL$430=1,IF(ISNUMBER(SEARCH($AK$430,'Hide this - Workings'!D27)),1,0),\"\")","v":""},{"$f":"IF($AL$431=1,IF(ISNUMBER(SEARCH($AK$431,'Hide this - Workings'!D27)),1,0),\"\")","v":""},{"$f":"IF($AL$432=1,IF(ISNUMBER(SEARCH($AK$432,'Hide this - Workings'!D27)),1,0),\"\")","v":""},{"$f":"IF($AL$433=1,IF(ISNUMBER(SEARCH($AK$433,'Hide this - Workings'!D27)),1,0),\"\")","v":""},0,"A023",0,"How do I treat cases where the funding arrangements are not clear, even when care provision has been set up? An example would be for clients where we provide interim support while decisions around Continuing Health Care (CHC) funding are made. These can go on for many weeks, and in the meantime the client is kept safe through provision of a care package. In circumstances where the care required is clear (e.g., admission to residential or nursing care) but it is not clear for some time how this will be paid for in the longer term, it is necessary to consider who is paying in the interim. So requests for support followed by interim care whilst CHC funding is assessed would be treated as long term support for as long as the interim funding continues. This assumes that the outcome of, for example, an application for CHC funding is not known until well after decisions are made about the care package required. Any interim funding should be predominately for social care needs - SALT does not capture data about health care needs.\nBelow some examples around different funding scenarios which should assist in the identification of the correct sequel.\n\nScenario 1: a new client with no current council support requests support. They subsequently receive an assessment which identifies that they need nursing care and they are placed in such provision until the outcome of the Continuing Health Care assessment is completed. In the interim, the council meets the cost of the care, until the CHC funding is approved (and the client is then no longer supported by the council). Council funding was therefore in place for a number of weeks prior to the end of March. By 31st March local authority support had ended as CHC funding had taken over.\nSALT requires: that the Request for Support is counted in STS001 with a sequel of ‘Long Term Support (eligible services) - nursing care setting’. The nursing service is captured in LTS001a under the ‘Support Setting’ of ‘Nursing Care’. Any review on the client during the period of council funding would be also be included in LTS002a. Because council funding for the support ended prior to the year end, there would be no data for this client in LTS001b (or c) or LTS002b. If the client had a PSR of ‘Learning Disability Support’ then they would also be included in the LTS004 measure on employment and accommodation.\n\nScenario 2: a new request for physical support needs is received for a client not known to the council. They are judged as appropriate to receive short term support to maximise their independence (ST-Max) but this does not work as expected, is ended early and the client placed in residential care. On financial assessment, after placement, it is found that they have the means to pay the full costs of their care, but they ask that the council remain involved in reviewing their care needs on a regular basis. The council agrees to carry out a planned review once a year, unless circumstances change. No review is made before the year end, but the client continues to be in placement on 31st March.\nSALT requires: that this client be captured in STS001, STS002a and LTS001a/b. The initial request for support (STS001) will have a sequel of ‘Short Term Support to Maximise Independence’. The period of ST-Max was cut short due to the needs of the client, so the sequel for STS002a will be ‘Early Cessation of Service (leading to long term support)’ for Tables 1-3, with Support Setting ‘Residential’ in Table 4. For LTS001a the client is recorded under Support Setting ‘Residential’ and also in LTS001b. This client is ‘full cost’ (see the guidance for a full description) and the admission to residential care is counted in the ASCOF 2A measure.\n\n\n\n\n\n\n\n\n\n\n\n\n\n\n\n\n\n\n\n\n\nScenario 3: An existing long term supported client with home care services was placed in residential care after a fall at home and unscheduled review which determined their needs could no longer be met in the community. The client was paying the full costs of their care but was under the care management of the council (i.e., their care needs were regularly reviewed as a 'full cost' client). They now need to sell their house and the council provides ‘12-week disregard’ funding and a period of additional interim funding before the client funds their own placement. The client decides that they do not wish to remain in contact with the local authority for social care needs as their family will be able to deal with the home directly.\nInterim funding ends on 15th January in the reporting year.\nSALT requires: that this client be captured in SALT, under measures LTS001a (NOT b or c) and in LTS002a (NOT b). Their status as a full-cost client means that the care provision at home will need to be captured in LTS001a this year. The unplanned review is captured in LTS002a, with a sequel of ‘Change in Setting – Move to Residential Care’ even though they will become a self-funder after interim funding ends. The council’s provision of 12-week disregard or interim funding means they are included in SALT in the same way as other clients who are funded by the council in the longer term. Thus the move to residential care is captured as a new admission. Because interim funding ended within the reporting year (i.e., on or before 31st March) then this client will NOT appear in SALT next year, as they will by that time be self- funding. Self-funders are classed as people who, although their care arrangements may have been set up by the council, do not wish to remain in contact, are not reviewed by the council on an on-going basis and do not continue to be monitored or have details of their support arrangements recorded.\n\nScenario 4: A client with Primary Support Reason of ‘Mental Health Support’ find that they unable to cope and is placed by the local authority in residential care after a period of long term support in the community, exceeding 12 months. The expectation is that after a 6-18 month period, they will be well enough to move back into the community and live independently. Funding is agreed for six months initially, to be reviewed towards the end of that time. The placement is made prior to the end of the year. There is a possibility that funding will be extended if the client is not ready to move back into the community. Such placements usually end within 18 months but occasionally this is not possible and the client will remain in residential care, long term.\nSALT requires: that this client will be recorded in SALT LTS001a, b and c, as well as LTS002a and b. Their status as a long term supported client for more than a year means their provision will appear in all the LTS001 measures. For LTS002a, the sequel is NOT ‘Short Term Support to Maximise Independence’ because the minimum expected period of placement is six months. This is also not a placement made on the basis of a short term stay that would fit under ‘Short Term Support (other)’. There is no pre-determined end date. For the foreseeable future, the client’s long term support needs will be met through residential care provision and the sequel (for the unplanned review) in measure LTS002a would be ‘Change in Setting – Move to Residential Care’. For LTS002b, reflecting the client’s period of long term support exceeding 12 months, the same sequel would apply. Note that the admission to residential care is only counted once for the purposes of ASCOF 2A, as only data from LTS002a (and not LTS002b) is used.\n","How do I treat cases where the funding arrangements are not clear, even when care provision has been set up? An example would be for clients where we provide interim support while decisions around Continuing Health Care (CHC) funding are made. These can go on for many weeks, and in the meantime the client is kept safe through provision of a care package.","In circumstances where the care required is clear (e.g., admission to residential or nursing care) but it is not clear for some time how this will be paid for in the longer term, it is necessary to consider who is paying in the interim. So requests for support followed by interim care whilst CHC funding is assessed would be treated as long term support for as long as the interim funding continues. This assumes that the outcome of, for example, an application for CHC funding is not known until well after decisions are made about the care package required. Any interim funding should be predominately for social care needs - SALT does not capture data about health care needs.\nBelow some examples around different funding scenarios which should assist in the identification of the correct sequel.\n\nScenario 1: a new client with no current council support requests support. They subsequently receive an assessment which identifies that they need nursing care and they are placed in such provision until the outcome of the Continuing Health Care assessment is completed. In the interim, the council meets the cost of the care, until the CHC funding is approved (and the client is then no longer supported by the council). Council funding was therefore in place for a number of weeks prior to the end of March. By 31st March local authority support had ended as CHC funding had taken over.\nSALT requires: that the Request for Support is counted in STS001 with a sequel of ‘Long Term Support (eligible services) - nursing care setting’. The nursing service is captured in LTS001a under the ‘Support Setting’ of ‘Nursing Care’. Any review on the client during the period of council funding would be also be included in LTS002a. Because council funding for the support ended prior to the year end, there would be no data for this client in LTS001b (or c) or LTS002b. If the client had a PSR of ‘Learning Disability Support’ then they would also be included in the LTS004 measure on employment and accommodation.\n\nScenario 2: a new request for physical support needs is received for a client not known to the council. They are judged as appropriate to receive short term support to maximise their independence (ST-Max) but this does not work as expected, is ended early and the client placed in residential care. On financial assessment, after placement, it is found that they have the means to pay the full costs of their care, but they ask that the council remain involved in reviewing their care needs on a regular basis. The council agrees to carry out a planned review once a year, unless circumstances change. No review is made before the year end, but the client continues to be in placement on 31st March.\nSALT requires: that this client be captured in STS001, STS002a and LTS001a/b. The initial request for support (STS001) will have a sequel of ‘Short Term Support to Maximise Independence’. The period of ST-Max was cut short due to the needs of the client, so the sequel for STS002a will be ‘Early Cessation of Service (leading to long term support)’ for Tables 1-3, with Support Setting ‘Residential’ in Table 4. For LTS001a the client is recorded under Support Setting ‘Residential’ and also in LTS001b. This client is ‘full cost’ (see the guidance for a full description) and the admission to residential care is counted in the ASCOF 2A measure.\n\n\n\n\n\n\n\n\n\n\n\n\n\n\n\n\n\n\n\n\n\nScenario 3: An existing long term supported client with home care services was placed in residential care after a fall at home and unscheduled review which determined their needs could no longer be met in the community. The client was paying the full costs of their care but was under the care management of the council (i.e., their care needs were regularly reviewed as a 'full cost' client). They now need to sell their house and the council provides ‘12-week disregard’ funding and a period of additional interim funding before the client funds their own placement. The client decides that they do not wish to remain in contact with the local authority for social care needs as their family will be able to deal with the home directly.\nInterim funding ends on 15th January in the reporting year.\nSALT requires: that this client be captured in SALT, under measures LTS001a (NOT b or c) and in LTS002a (NOT b). Their status as a full-cost client means that the care provision at home will need to be captured in LTS001a this year. The unplanned review is captured in LTS002a, with a sequel of ‘Change in Setting – Move to Residential Care’ even though they will become a self-funder after interim funding ends. The council’s provision of 12-week disregard or interim funding means they are included in SALT in the same way as other clients who are funded by the council in the longer term. Thus the move to residential care is captured as a new admission. Because interim funding ended within the reporting year (i.e., on or before 31st March) then this client will NOT appear in SALT next year, as they will by that time be self- funding. Self-funders are classed as people who, although their care arrangements may have been set up by the council, do not wish to remain in contact, are not reviewed by the council on an on-going basis and do not continue to be monitored or have details of their support arrangements recorded.\n\nScenario 4: A client with Primary Support Reason of ‘Mental Health Support’ find that they unable to cope and is placed by the local authority in residential care after a period of long term support in the community, exceeding 12 months. The expectation is that after a 6-18 month period, they will be well enough to move back into the community and live independently. Funding is agreed for six months initially, to be reviewed towards the end of that time. The placement is made prior to the end of the year. There is a possibility that funding will be extended if the client is not ready to move back into the community. Such placements usually end within 18 months but occasionally this is not possible and the client will remain in residential care, long term.\nSALT requires: that this client will be recorded in SALT LTS001a, b and c, as well as LTS002a and b. Their status as a long term supported client for more than a year means their provision will appear in all the LTS001 measures. For LTS002a, the sequel is NOT ‘Short Term Support to Maximise Independence’ because the minimum expected period of placement is six months. This is also not a placement made on the basis of a short term stay that would fit under ‘Short Term Support (other)’. There is no pre-determined end date. For the foreseeable future, the client’s long term support needs will be met through residential care provision and the sequel (for the unplanned review) in measure LTS002a would be ‘Change in Setting – Move to Residential Care’. For LTS002b, reflecting the client’s period of long term support exceeding 12 months, the same sequel would apply. Note that the admission to residential care is only counted once for the purposes of ASCOF 2A, as only data from LTS002a (and not LTS002b) is used.\n"]
[null,null,"","How do I treat cases where the funding arrangements are not clear, even when care provision has been set up? An example would be for clients where we provide interim support while decisions around Continuing Health Care (CHC) funding are made. These can go on for many weeks, and in the meantime the client is kept safe through provision of a care package. \nScenario 3: An existing long term supported client with home care services was placed in residential care after a fall at home and unscheduled review which determined their needs could no longer be met in the community. The client was paying the full costs of their care but was under the care management of the council (i.e., their care needs were regularly reviewed as a 'full cost' client). They now need to sell their house and the council provides ‘12-week disregard’ funding and a period of additional interim funding before the client funds their own placement. The client decides that they do not wish to remain in contact with the local authority for social care needs as their family will be able to deal with the home directly.\nInterim funding ends on 15th January in the reporting year.\nSALT requires: that this client be captured in SALT, under measures LTS001a (NOT b or c) and in LTS002a (NOT b). Their status as a full-cost client means that the care provision at home will need to be captured in LTS001a this year. The unplanned review is captured in LTS002a, with a sequel of ‘Change in Setting – Move to Residential Care’ even though they will become a self-funder after interim funding ends. The council’s provision of 12-week disregard or interim funding means they are included in SALT in the same way as other clients who are funded by the council in the longer term. Thus the move to residential care is captured as a new admission. Because interim funding ended within the reporting year (i.e., on or before 31st March) then this client will NOT appear in SALT next year, as they will by that time be self- funding. Self-funders are classed as people who, although their care arrangements may have been set up by the council, do not wish to remain in contact, are not reviewed by the council on an on-going basis and do not continue to be monitored or have details of their support arrangements recorded.\n\nScenario 4: A client with Primary Support Reason of ‘Mental Health Support’ find that they unable to cope and is placed by the local authority in residential care after a period of long term support in the community, exceeding 12 months. The expectation is that after a 6-18 month period, they will be well enough to move back into the community and live independently. Funding is agreed for six months initially, to be reviewed towards the end of that time. The placement is made prior to the end of the year. There is a possibility that funding will be extended if the client is not ready to move back into the community. Such placements usually end within 18 months but occasionally this is not possible and the client will remain in residential care, long term.\nSALT requires: that this client will be recorded in SALT LTS001a, b and c, as well as LTS002a and b. Their status as a long term supported client for more than a year means their provision will appear in all the LTS001 measures. For LTS002a, the sequel is NOT ‘Short Term Support to Maximise Independence’ because the minimum expected period of placement is six months. This is also not a placement made on the basis of a short term stay that would fit under ‘Short Term Support (other)’. There is no pre-determined end date. For the foreseeable future, the client’s long term support needs will be met through residential care provision and the sequel (for the unplanned review) in measure LTS002a would be ‘Change in Setting – Move to Residential Care’. For LTS002b, reflecting the client’s period of long term support exceeding 12 months, the same sequel would apply. Note that the admission to residential care is only counted once for the purposes of ASCOF 2A, as only data from LTS002a (and not LTS002b) is used.\n\n\n\n\n\n\n\n\n\n\n\n\n\n\n\n\n\n\n\n\n\n\nIn circumstances where the care required is clear (e.g., admission to residential or nursing care) but it is not clear for some time how this will be paid for in the longer term, it is necessary to consider who is paying in the interim. So requests for support followed by interim care whilst CHC funding is assessed would be treated as long term support for as long as the interim funding continues. This assumes that the outcome of, for example, an application for CHC funding is not known until well after decisions are made about the care package required. Any interim funding should be predominately for social care needs - SALT does not capture data about health care needs.\nBelow some examples around different funding scenarios which should assist in the identification of the correct sequel.\n\n\n\n\n\n\nScenario 1: a new client with no current council support requests support. They subsequently receive an assessment which identifies that they need nursing care and they are placed in such provision until the outcome of the Continuing Health Care assessment is completed. In the interim, the council meets the cost of the care, until the CHC funding is approved (and the client is then no longer supported by the council). Council funding was therefore in place for a number of weeks prior to the end of March. By 31st March local authority support had ended as CHC funding had taken over.\nSALT requires: that the Request for Support is counted in STS001 with a sequel of ‘Long Term Support (eligible services) - nursing care setting’. The nursing service is captured in LTS001a under the ‘Support Setting’ of ‘Nursing Care’. Any review on the client during the period of council funding would be also be included in LTS002a. Because council funding for the support ended prior to the year end, there would be no data for this client in LTS001b (or c) or LTS002b. If the client had a PSR of ‘Learning Disability Support’ then they would also be included in the LTS004 measure on employment and accommodation.\n\nScenario 2: a new request for physical support needs is received for a client not known to the council. They are judged as appropriate to receive short term support to maximise their independence (ST-Max) but this does not work as expected, is ended early and the client placed in residential care. On financial assessment, after placement, it is found that they have the means to pay the full costs of their care, but they ask that the council remain involved in reviewing their care needs on a regular basis. The council agrees to carry out a planned review once a year, unless circumstances change. No review is made before the year end, but the client continues to be in placement on 31st March.\nSALT requires: that this client be captured in STS001, STS002a and LTS001a/b. The initial request for support (STS001) will have a sequel of ‘Short Term Support to Maximise Independence’. The period of ST-Max was cut short due to the needs of the client, so the sequel for STS002a will be ‘Early Cessation of Service (leading to long term support)’ for Tables 1-3, with Support Setting ‘Residential’ in Table 4. For LTS001a the client is recorded under Support Setting ‘Residential’ and also in LTS001b. This client is ‘full cost’ (see the guidance for a full description) and the admission to residential care is counted in the ASCOF 2A measure.\n\nScenario 3: An existing long term supported client with home care services was placed in residential care after a fall at home and unscheduled review which determined their needs could no longer be met in the community. The client was paying the full costs of their care but was under the care management of the council (i.e., their care needs were regularly reviewed as a 'full cost' client). They now need to sell their house and the council provides ‘12-week disregard’ funding and a period of additional interim funding before the client funds their own placement. The client decides that they do not wish to remain in contact with the local authority for social care needs as their family will be able to deal with the home directly.\nInterim funding ends on 15th January in the reporting year.\nSALT requires: that this client be captured in SALT, under measures LTS001a (NOT b or c) and in LTS002a (NOT b). Their status as a full-cost client means that the care provision at home will need to be captured in LTS001a this year. The unplanned review is captured in LTS002a, with a sequel of ‘Change in Setting – Move to Residential Care’ even though they will become a self-funder after interim funding ends. The council’s provision of 12-week disregard or interim funding means they are included in SALT in the same way as other clients who are funded by the council in the longer term. Thus the move to residential care is captured as a new admission. Because interim funding ended within the reporting year (i.e., on or before 31st March) then this client will NOT appear in SALT next year, as they will by that time be self- funding. Self-funders are classed as people who, although their care arrangements may have been set up by the council, do not wish to remain in contact, are not reviewed by the council on an on-going basis and do not continue to be monitored or have details of their support arrangements recorded.\n\nScenario 4: A client with Primary Support Reason of ‘Mental Health Support’ find that they unable to cope and is placed by the local authority in residential care after a period of long term support in the community, exceeding 12 months. The expectation is that after a 6-18 month period, they will be well enough to move back into the community and live independently. Funding is agreed for six months initially, to be reviewed towards the end of that time. The placement is made prior to the end of the year. There is a possibility that funding will be extended if the client is not ready to move back into the community. Such placements usually end within 18 months but occasionally this is not possible and the client will remain in residential care, long term.\nSALT requires: that this client will be recorded in SALT LTS001a, b and c, as well as LTS002a and b. Their status as a long term supported client for more than a year means their provision will appear in all the LTS001 measures. For LTS002a, the sequel is NOT ‘Short Term Support to Maximise Independence’ because the minimum expected period of placement is six months. This is also not a placement made on the basis of a short term stay that would fit under ‘Short Term Support (other)’. There is no pre-determined end date. For the foreseeable future, the client’s long term support needs will be met through residential care provision and the sequel (for the unplanned review) in measure LTS002a would be ‘Change in Setting – Move to Residential Care’. For LTS002b, reflecting the client’s period of long term support exceeding 12 months, the same sequel would apply. Note that the admission to residential care is only counted once for the purposes of ASCOF 2A, as only data from LTS002a (and not LTS002b) is used.\n",null,null,null,null,null,null,null,"How do I treat cases where the funding arrangements are not clear, even when care provision has been set up? An example would be for clients where we provide interim support while decisions around Continuing Health Care (CHC) funding are made. These can go on for many weeks, and in the meantime the client is kept safe through provision of a care package.","\nScenario 3: An existing long term supported client with home care services was placed in residential care after a fall at home and unscheduled review which determined their needs could no longer be met in the community. The client was paying the full costs of their care but was under the care management of the council (i.e., their care needs were regularly reviewed as a 'full cost' client). They now need to sell their house and the council provides ‘12-week disregard’ funding and a period of additional interim funding before the client funds their own placement. The client decides that they do not wish to remain in contact with the local authority for social care needs as their family will be able to deal with the home directly.\nInterim funding ends on 15th January in the reporting year.\nSALT requires: that this client be captured in SALT, under measures LTS001a (NOT b or c) and in LTS002a (NOT b). Their status as a full-cost client means that the care provision at home will need to be captured in LTS001a this year. The unplanned review is captured in LTS002a, with a sequel of ‘Change in Setting – Move to Residential Care’ even though they will become a self-funder after interim funding ends. The council’s provision of 12-week disregard or interim funding means they are included in SALT in the same way as other clients who are funded by the council in the longer term. Thus the move to residential care is captured as a new admission. Because interim funding ended within the reporting year (i.e., on or before 31st March) then this client will NOT appear in SALT next year, as they will by that time be self- funding. Self-funders are classed as people who, although their care arrangements may have been set up by the council, do not wish to remain in contact, are not reviewed by the council on an on-going basis and do not continue to be monitored or have details of their support arrangements recorded.\n\nScenario 4: A client with Primary Support Reason of ‘Mental Health Support’ find that they unable to cope and is placed by the local authority in residential care after a period of long term support in the community, exceeding 12 months. The expectation is that after a 6-18 month period, they will be well enough to move back into the community and live independently. Funding is agreed for six months initially, to be reviewed towards the end of that time. The placement is made prior to the end of the year. There is a possibility that funding will be extended if the client is not ready to move back into the community. Such placements usually end within 18 months but occasionally this is not possible and the client will remain in residential care, long term.\nSALT requires: that this client will be recorded in SALT LTS001a, b and c, as well as LTS002a and b. Their status as a long term supported client for more than a year means their provision will appear in all the LTS001 measures. For LTS002a, the sequel is NOT ‘Short Term Support to Maximise Independence’ because the minimum expected period of placement is six months. This is also not a placement made on the basis of a short term stay that would fit under ‘Short Term Support (other)’. There is no pre-determined end date. For the foreseeable future, the client’s long term support needs will be met through residential care provision and the sequel (for the unplanned review) in measure LTS002a would be ‘Change in Setting – Move to Residential Care’. For LTS002b, reflecting the client’s period of long term support exceeding 12 months, the same sequel would apply. Note that the admission to residential care is only counted once for the purposes of ASCOF 2A, as only data from LTS002a (and not LTS002b) is used.\n\n\n\n\n\n\n\n\n\n\n\n\n\n\n\n\n\n\n\n\n\n\nIn circumstances where the care required is clear (e.g., admission to residential or nursing care) but it is not clear for some time how this will be paid for in the longer term, it is necessary to consider who is paying in the interim. So requests for support followed by interim care whilst CHC funding is assessed would be treated as long term support for as long as the interim funding continues. This assumes that the outcome of, for example, an application for CHC funding is not known until well after decisions are made about the care package required. Any interim funding should be predominately for social care needs - SALT does not capture data about health care needs.\nBelow some examples around different funding scenarios which should assist in the identification of the correct sequel.\n\n\n\n\n\n\nScenario 1: a new client with no current council support requests support. They subsequently receive an assessment which identifies that they need nursing care and they are placed in such provision until the outcome of the Continuing Health Care assessment is completed. In the interim, the council meets the cost of the care, until the CHC funding is approved (and the client is then no longer supported by the council). Council funding was therefore in place for a number of weeks prior to the end of March. By 31st March local authority support had ended as CHC funding had taken over.\nSALT requires: that the Request for Support is counted in STS001 with a sequel of ‘Long Term Support (eligible services) - nursing care setting’. The nursing service is captured in LTS001a under the ‘Support Setting’ of ‘Nursing Care’. Any review on the client during the period of council funding would be also be included in LTS002a. Because council funding for the support ended prior to the year end, there would be no data for this client in LTS001b (or c) or LTS002b. If the client had a PSR of ‘Learning Disability Support’ then they would also be included in the LTS004 measure on employment and accommodation.\n\nScenario 2: a new request for physical support needs is received for a client not known to the council. They are judged as appropriate to receive short term support to maximise their independence (ST-Max) but this does not work as expected, is ended early and the client placed in residential care. On financial assessment, after placement, it is found that they have the means to pay the full costs of their care, but they ask that the council remain involved in reviewing their care needs on a regular basis. The council agrees to carry out a planned review once a year, unless circumstances change. No review is made before the year end, but the client continues to be in placement on 31st March.\nSALT requires: that this client be captured in STS001, STS002a and LTS001a/b. The initial request for support (STS001) will have a sequel of ‘Short Term Support to Maximise Independence’. The period of ST-Max was cut short due to the needs of the client, so the sequel for STS002a will be ‘Early Cessation of Service (leading to long term support)’ for Tables 1-3, with Support Setting ‘Residential’ in Table 4. For LTS001a the client is recorded under Support Setting ‘Residential’ and also in LTS001b. This client is ‘full cost’ (see the guidance for a full description) and the admission to residential care is counted in the ASCOF 2A measure.\n\nScenario 3: An existing long term supported client with home care services was placed in residential care after a fall at home and unscheduled review which determined their needs could no longer be met in the community. The client was paying the full costs of their care but was under the care management of the council (i.e., their care needs were regularly reviewed as a 'full cost' client). They now need to sell their house and the council provides ‘12-week disregard’ funding and a period of additional interim funding before the client funds their own placement. The client decides that they do not wish to remain in contact with the local authority for social care needs as their family will be able to deal with the home directly.\nInterim funding ends on 15th January in the reporting year.\nSALT requires: that this client be captured in SALT, under measures LTS001a (NOT b or c) and in LTS002a (NOT b). Their status as a full-cost client means that the care provision at home will need to be captured in LTS001a this year. The unplanned review is captured in LTS002a, with a sequel of ‘Change in Setting – Move to Residential Care’ even though they will become a self-funder after interim funding ends. The council’s provision of 12-week disregard or interim funding means they are included in SALT in the same way as other clients who are funded by the council in the longer term. Thus the move to residential care is captured as a new admission. Because interim funding ended within the reporting year (i.e., on or before 31st March) then this client will NOT appear in SALT next year, as they will by that time be self- funding. Self-funders are classed as people who, although their care arrangements may have been set up by the council, do not wish to remain in contact, are not reviewed by the council on an on-going basis and do not continue to be monitored or have details of their support arrangements recorded.\n\nScenario 4: A client with Primary Support Reason of ‘Mental Health Support’ find that they unable to cope and is placed by the local authority in residential care after a period of long term support in the community, exceeding 12 months. The expectation is that after a 6-18 month period, they will be well enough to move back into the community and live independently. Funding is agreed for six months initially, to be reviewed towards the end of that time. The placement is made prior to the end of the year. There is a possibility that funding will be extended if the client is not ready to move back into the community. Such placements usually end within 18 months but occasionally this is not possible and the client will remain in residential care, long term.\nSALT requires: that this client will be recorded in SALT LTS001a, b and c, as well as LTS002a and b. Their status as a long term supported client for more than a year means their provision will appear in all the LTS001 measures. For LTS002a, the sequel is NOT ‘Short Term Support to Maximise Independence’ because the minimum expected period of placement is six months. This is also not a placement made on the basis of a short term stay that would fit under ‘Short Term Support (other)’. There is no pre-determined end date. For the foreseeable future, the client’s long term support needs will be met through residential care provision and the sequel (for the unplanned review) in measure LTS002a would be ‘Change in Setting – Move to Residential Care’. For LTS002b, reflecting the client’s period of long term support exceeding 12 months, the same sequel would apply. Note that the admission to residential care is only counted once for the purposes of ASCOF 2A, as only data from LTS002a (and not LTS002b) is used.\n",{"$f":"IF($AL$417=1,IF(ISNUMBER(SEARCH($AK$417,'Hide this - Workings'!D28)),1,0),\"\")","v":""},{"$f":"IF($AL$418=1,IF(ISNUMBER(SEARCH($AK$418,'Hide this - Workings'!D28)),1,0),\"\")","v":""},{"$f":"IF($AL$419=1,IF(ISNUMBER(SEARCH($AK$419,'Hide this - Workings'!D28)),1,0),\"\")","v":""},{"$f":"IF($AL$420=1,IF(ISNUMBER(SEARCH($AK$420,'Hide this - Workings'!D28)),1,0),\"\")","v":""},{"$f":"IF($AL$421=1,IF(ISNUMBER(SEARCH($AK$421,'Hide this - Workings'!D28)),1,0),\"\")","v":""},{"$f":"IF($AL$422=1,IF(ISNUMBER(SEARCH($AK$422,'Hide this - Workings'!D28)),1,0),\"\")","v":""},{"$f":"IF($AL$423=1,IF(ISNUMBER(SEARCH($AK$423,'Hide this - Workings'!D28)),1,0),\"\")","v":""},{"$f":"IF($AL$424=1,IF(ISNUMBER(SEARCH($AK$424,'Hide this - Workings'!D28)),1,0),\"\")","v":""},{"$f":"IF($AL$425=1,IF(ISNUMBER(SEARCH($AK$425,'Hide this - Workings'!D28)),1,0),\"\")","v":""},{"$f":"IF($AL$426=1,IF(ISNUMBER(SEARCH($AK$426,'Hide this - Workings'!D28)),1,0),\"\")","v":""},{"$f":"IF($AL$427=1,IF(ISNUMBER(SEARCH($AK$427,'Hide this - Workings'!D28)),1,0),\"\")","v":""},{"$f":"IF($AL$428=1,IF(ISNUMBER(SEARCH($AK$428,'Hide this - Workings'!D28)),1,0),\"\")","v":""},{"$f":"IF($AL$429=1,IF(ISNUMBER(SEARCH($AK$429,'Hide this - Workings'!D28)),1,0),\"\")","v":""},{"$f":"IF($AL$430=1,IF(ISNUMBER(SEARCH($AK$430,'Hide this - Workings'!D28)),1,0),\"\")","v":""},{"$f":"IF($AL$431=1,IF(ISNUMBER(SEARCH($AK$431,'Hide this - Workings'!D28)),1,0),\"\")","v":""},{"$f":"IF($AL$432=1,IF(ISNUMBER(SEARCH($AK$432,'Hide this - Workings'!D28)),1,0),\"\")","v":""},{"$f":"IF($AL$433=1,IF(ISNUMBER(SEARCH($AK$433,'Hide this - Workings'!D28)),1,0),\"\")","v":""},0,"A024",0,"How do I treat cases where the funding arrangements are not clear, even when care provision has been set up? An example would be for clients where we provide interim support while decisions around Continuing Health Care (CHC) funding are made. These can go on for many weeks, and in the meantime the client is kept safe through provision of a care package. \nScenario 3: An existing long term supported client with home care services was placed in residential care after a fall at home and unscheduled review which determined their needs could no longer be met in the community. The client was paying the full costs of their care but was under the care management of the council (i.e., their care needs were regularly reviewed as a 'full cost' client). They now need to sell their house and the council provides ‘12-week disregard’ funding and a period of additional interim funding before the client funds their own placement. The client decides that they do not wish to remain in contact with the local authority for social care needs as their family will be able to deal with the home directly.\nInterim funding ends on 15th January in the reporting year.\nSALT requires: that this client be captured in SALT, under measures LTS001a (NOT b or c) and in LTS002a (NOT b). Their status as a full-cost client means that the care provision at home will need to be captured in LTS001a this year. The unplanned review is captured in LTS002a, with a sequel of ‘Change in Setting – Move to Residential Care’ even though they will become a self-funder after interim funding ends. The council’s provision of 12-week disregard or interim funding means they are included in SALT in the same way as other clients who are funded by the council in the longer term. Thus the move to residential care is captured as a new admission. Because interim funding ended within the reporting year (i.e., on or before 31st March) then this client will NOT appear in SALT next year, as they will by that time be self- funding. Self-funders are classed as people who, although their care arrangements may have been set up by the council, do not wish to remain in contact, are not reviewed by the council on an on-going basis and do not continue to be monitored or have details of their support arrangements recorded.\n\nScenario 4: A client with Primary Support Reason of ‘Mental Health Support’ find that they unable to cope and is placed by the local authority in residential care after a period of long term support in the community, exceeding 12 months. The expectation is that after a 6-18 month period, they will be well enough to move back into the community and live independently. Funding is agreed for six months initially, to be reviewed towards the end of that time. The placement is made prior to the end of the year. There is a possibility that funding will be extended if the client is not ready to move back into the community. Such placements usually end within 18 months but occasionally this is not possible and the client will remain in residential care, long term.\nSALT requires: that this client will be recorded in SALT LTS001a, b and c, as well as LTS002a and b. Their status as a long term supported client for more than a year means their provision will appear in all the LTS001 measures. For LTS002a, the sequel is NOT ‘Short Term Support to Maximise Independence’ because the minimum expected period of placement is six months. This is also not a placement made on the basis of a short term stay that would fit under ‘Short Term Support (other)’. There is no pre-determined end date. For the foreseeable future, the client’s long term support needs will be met through residential care provision and the sequel (for the unplanned review) in measure LTS002a would be ‘Change in Setting – Move to Residential Care’. For LTS002b, reflecting the client’s period of long term support exceeding 12 months, the same sequel would apply. Note that the admission to residential care is only counted once for the purposes of ASCOF 2A, as only data from LTS002a (and not LTS002b) is used.\n\n\n\n\n\n\n\n\n\n\n\n\n\n\n\n\n\n\n\n\n\n\nIn circumstances where the care required is clear (e.g., admission to residential or nursing care) but it is not clear for some time how this will be paid for in the longer term, it is necessary to consider who is paying in the interim. So requests for support followed by interim care whilst CHC funding is assessed would be treated as long term support for as long as the interim funding continues. This assumes that the outcome of, for example, an application for CHC funding is not known until well after decisions are made about the care package required. Any interim funding should be predominately for social care needs - SALT does not capture data about health care needs.\nBelow some examples around different funding scenarios which should assist in the identification of the correct sequel.\n\n\n\n\n\n\nScenario 1: a new client with no current council support requests support. They subsequently receive an assessment which identifies that they need nursing care and they are placed in such provision until the outcome of the Continuing Health Care assessment is completed. In the interim, the council meets the cost of the care, until the CHC funding is approved (and the client is then no longer supported by the council). Council funding was therefore in place for a number of weeks prior to the end of March. By 31st March local authority support had ended as CHC funding had taken over.\nSALT requires: that the Request for Support is counted in STS001 with a sequel of ‘Long Term Support (eligible services) - nursing care setting’. The nursing service is captured in LTS001a under the ‘Support Setting’ of ‘Nursing Care’. Any review on the client during the period of council funding would be also be included in LTS002a. Because council funding for the support ended prior to the year end, there would be no data for this client in LTS001b (or c) or LTS002b. If the client had a PSR of ‘Learning Disability Support’ then they would also be included in the LTS004 measure on employment and accommodation.\n\nScenario 2: a new request for physical support needs is received for a client not known to the council. They are judged as appropriate to receive short term support to maximise their independence (ST-Max) but this does not work as expected, is ended early and the client placed in residential care. On financial assessment, after placement, it is found that they have the means to pay the full costs of their care, but they ask that the council remain involved in reviewing their care needs on a regular basis. The council agrees to carry out a planned review once a year, unless circumstances change. No review is made before the year end, but the client continues to be in placement on 31st March.\nSALT requires: that this client be captured in STS001, STS002a and LTS001a/b. The initial request for support (STS001) will have a sequel of ‘Short Term Support to Maximise Independence’. The period of ST-Max was cut short due to the needs of the client, so the sequel for STS002a will be ‘Early Cessation of Service (leading to long term support)’ for Tables 1-3, with Support Setting ‘Residential’ in Table 4. For LTS001a the client is recorded under Support Setting ‘Residential’ and also in LTS001b. This client is ‘full cost’ (see the guidance for a full description) and the admission to residential care is counted in the ASCOF 2A measure.\n\nScenario 3: An existing long term supported client with home care services was placed in residential care after a fall at home and unscheduled review which determined their needs could no longer be met in the community. The client was paying the full costs of their care but was under the care management of the council (i.e., their care needs were regularly reviewed as a 'full cost' client). They now need to sell their house and the council provides ‘12-week disregard’ funding and a period of additional interim funding before the client funds their own placement. The client decides that they do not wish to remain in contact with the local authority for social care needs as their family will be able to deal with the home directly.\nInterim funding ends on 15th January in the reporting year.\nSALT requires: that this client be captured in SALT, under measures LTS001a (NOT b or c) and in LTS002a (NOT b). Their status as a full-cost client means that the care provision at home will need to be captured in LTS001a this year. The unplanned review is captured in LTS002a, with a sequel of ‘Change in Setting – Move to Residential Care’ even though they will become a self-funder after interim funding ends. The council’s provision of 12-week disregard or interim funding means they are included in SALT in the same way as other clients who are funded by the council in the longer term. Thus the move to residential care is captured as a new admission. Because interim funding ended within the reporting year (i.e., on or before 31st March) then this client will NOT appear in SALT next year, as they will by that time be self- funding. Self-funders are classed as people who, although their care arrangements may have been set up by the council, do not wish to remain in contact, are not reviewed by the council on an on-going basis and do not continue to be monitored or have details of their support arrangements recorded.\n\nScenario 4: A client with Primary Support Reason of ‘Mental Health Support’ find that they unable to cope and is placed by the local authority in residential care after a period of long term support in the community, exceeding 12 months. The expectation is that after a 6-18 month period, they will be well enough to move back into the community and live independently. Funding is agreed for six months initially, to be reviewed towards the end of that time. The placement is made prior to the end of the year. There is a possibility that funding will be extended if the client is not ready to move back into the community. Such placements usually end within 18 months but occasionally this is not possible and the client will remain in residential care, long term.\nSALT requires: that this client will be recorded in SALT LTS001a, b and c, as well as LTS002a and b. Their status as a long term supported client for more than a year means their provision will appear in all the LTS001 measures. For LTS002a, the sequel is NOT ‘Short Term Support to Maximise Independence’ because the minimum expected period of placement is six months. This is also not a placement made on the basis of a short term stay that would fit under ‘Short Term Support (other)’. There is no pre-determined end date. For the foreseeable future, the client’s long term support needs will be met through residential care provision and the sequel (for the unplanned review) in measure LTS002a would be ‘Change in Setting – Move to Residential Care’. For LTS002b, reflecting the client’s period of long term support exceeding 12 months, the same sequel would apply. Note that the admission to residential care is only counted once for the purposes of ASCOF 2A, as only data from LTS002a (and not LTS002b) is used.\n","How do I treat cases where the funding arrangements are not clear, even when care provision has been set up? An example would be for clients where we provide interim support while decisions around Continuing Health Care (CHC) funding are made. These can go on for many weeks, and in the meantime the client is kept safe through provision of a care package.","\nScenario 3: An existing long term supported client with home care services was placed in residential care after a fall at home and unscheduled review which determined their needs could no longer be met in the community. The client was paying the full costs of their care but was under the care management of the council (i.e., their care needs were regularly reviewed as a 'full cost' client). They now need to sell their house and the council provides ‘12-week disregard’ funding and a period of additional interim funding before the client funds their own placement. The client decides that they do not wish to remain in contact with the local authority for social care needs as their family will be able to deal with the home directly.\nInterim funding ends on 15th January in the reporting year.\nSALT requires: that this client be captured in SALT, under measures LTS001a (NOT b or c) and in LTS002a (NOT b). Their status as a full-cost client means that the care provision at home will need to be captured in LTS001a this year. The unplanned review is captured in LTS002a, with a sequel of ‘Change in Setting – Move to Residential Care’ even though they will become a self-funder after interim funding ends. The council’s provision of 12-week disregard or interim funding means they are included in SALT in the same way as other clients who are funded by the council in the longer term. Thus the move to residential care is captured as a new admission. Because interim funding ended within the reporting year (i.e., on or before 31st March) then this client will NOT appear in SALT next year, as they will by that time be self- funding. Self-funders are classed as people who, although their care arrangements may have been set up by the council, do not wish to remain in contact, are not reviewed by the council on an on-going basis and do not continue to be monitored or have details of their support arrangements recorded.\n\nScenario 4: A client with Primary Support Reason of ‘Mental Health Support’ find that they unable to cope and is placed by the local authority in residential care after a period of long term support in the community, exceeding 12 months. The expectation is that after a 6-18 month period, they will be well enough to move back into the community and live independently. Funding is agreed for six months initially, to be reviewed towards the end of that time. The placement is made prior to the end of the year. There is a possibility that funding will be extended if the client is not ready to move back into the community. Such placements usually end within 18 months but occasionally this is not possible and the client will remain in residential care, long term.\nSALT requires: that this client will be recorded in SALT LTS001a, b and c, as well as LTS002a and b. Their status as a long term supported client for more than a year means their provision will appear in all the LTS001 measures. For LTS002a, the sequel is NOT ‘Short Term Support to Maximise Independence’ because the minimum expected period of placement is six months. This is also not a placement made on the basis of a short term stay that would fit under ‘Short Term Support (other)’. There is no pre-determined end date. For the foreseeable future, the client’s long term support needs will be met through residential care provision and the sequel (for the unplanned review) in measure LTS002a would be ‘Change in Setting – Move to Residential Care’. For LTS002b, reflecting the client’s period of long term support exceeding 12 months, the same sequel would apply. Note that the admission to residential care is only counted once for the purposes of ASCOF 2A, as only data from LTS002a (and not LTS002b) is used.\n\n\n\n\n\n\n\n\n\n\n\n\n\n\n\n\n\n\n\n\n\n\nIn circumstances where the care required is clear (e.g., admission to residential or nursing care) but it is not clear for some time how this will be paid for in the longer term, it is necessary to consider who is paying in the interim. So requests for support followed by interim care whilst CHC funding is assessed would be treated as long term support for as long as the interim funding continues. This assumes that the outcome of, for example, an application for CHC funding is not known until well after decisions are made about the care package required. Any interim funding should be predominately for social care needs - SALT does not capture data about health care needs.\nBelow some examples around different funding scenarios which should assist in the identification of the correct sequel.\n\n\n\n\n\n\nScenario 1: a new client with no current council support requests support. They subsequently receive an assessment which identifies that they need nursing care and they are placed in such provision until the outcome of the Continuing Health Care assessment is completed. In the interim, the council meets the cost of the care, until the CHC funding is approved (and the client is then no longer supported by the council). Council funding was therefore in place for a number of weeks prior to the end of March. By 31st March local authority support had ended as CHC funding had taken over.\nSALT requires: that the Request for Support is counted in STS001 with a sequel of ‘Long Term Support (eligible services) - nursing care setting’. The nursing service is captured in LTS001a under the ‘Support Setting’ of ‘Nursing Care’. Any review on the client during the period of council funding would be also be included in LTS002a. Because council funding for the support ended prior to the year end, there would be no data for this client in LTS001b (or c) or LTS002b. If the client had a PSR of ‘Learning Disability Support’ then they would also be included in the LTS004 measure on employment and accommodation.\n\nScenario 2: a new request for physical support needs is received for a client not known to the council. They are judged as appropriate to receive short term support to maximise their independence (ST-Max) but this does not work as expected, is ended early and the client placed in residential care. On financial assessment, after placement, it is found that they have the means to pay the full costs of their care, but they ask that the council remain involved in reviewing their care needs on a regular basis. The council agrees to carry out a planned review once a year, unless circumstances change. No review is made before the year end, but the client continues to be in placement on 31st March.\nSALT requires: that this client be captured in STS001, STS002a and LTS001a/b. The initial request for support (STS001) will have a sequel of ‘Short Term Support to Maximise Independence’. The period of ST-Max was cut short due to the needs of the client, so the sequel for STS002a will be ‘Early Cessation of Service (leading to long term support)’ for Tables 1-3, with Support Setting ‘Residential’ in Table 4. For LTS001a the client is recorded under Support Setting ‘Residential’ and also in LTS001b. This client is ‘full cost’ (see the guidance for a full description) and the admission to residential care is counted in the ASCOF 2A measure.\n\nScenario 3: An existing long term supported client with home care services was placed in residential care after a fall at home and unscheduled review which determined their needs could no longer be met in the community. The client was paying the full costs of their care but was under the care management of the council (i.e., their care needs were regularly reviewed as a 'full cost' client). They now need to sell their house and the council provides ‘12-week disregard’ funding and a period of additional interim funding before the client funds their own placement. The client decides that they do not wish to remain in contact with the local authority for social care needs as their family will be able to deal with the home directly.\nInterim funding ends on 15th January in the reporting year.\nSALT requires: that this client be captured in SALT, under measures LTS001a (NOT b or c) and in LTS002a (NOT b). Their status as a full-cost client means that the care provision at home will need to be captured in LTS001a this year. The unplanned review is captured in LTS002a, with a sequel of ‘Change in Setting – Move to Residential Care’ even though they will become a self-funder after interim funding ends. The council’s provision of 12-week disregard or interim funding means they are included in SALT in the same way as other clients who are funded by the council in the longer term. Thus the move to residential care is captured as a new admission. Because interim funding ended within the reporting year (i.e., on or before 31st March) then this client will NOT appear in SALT next year, as they will by that time be self- funding. Self-funders are classed as people who, although their care arrangements may have been set up by the council, do not wish to remain in contact, are not reviewed by the council on an on-going basis and do not continue to be monitored or have details of their support arrangements recorded.\n\nScenario 4: A client with Primary Support Reason of ‘Mental Health Support’ find that they unable to cope and is placed by the local authority in residential care after a period of long term support in the community, exceeding 12 months. The expectation is that after a 6-18 month period, they will be well enough to move back into the community and live independently. Funding is agreed for six months initially, to be reviewed towards the end of that time. The placement is made prior to the end of the year. There is a possibility that funding will be extended if the client is not ready to move back into the community. Such placements usually end within 18 months but occasionally this is not possible and the client will remain in residential care, long term.\nSALT requires: that this client will be recorded in SALT LTS001a, b and c, as well as LTS002a and b. Their status as a long term supported client for more than a year means their provision will appear in all the LTS001 measures. For LTS002a, the sequel is NOT ‘Short Term Support to Maximise Independence’ because the minimum expected period of placement is six months. This is also not a placement made on the basis of a short term stay that would fit under ‘Short Term Support (other)’. There is no pre-determined end date. For the foreseeable future, the client’s long term support needs will be met through residential care provision and the sequel (for the unplanned review) in measure LTS002a would be ‘Change in Setting – Move to Residential Care’. For LTS002b, reflecting the client’s period of long term support exceeding 12 months, the same sequel would apply. Note that the admission to residential care is only counted once for the purposes of ASCOF 2A, as only data from LTS002a (and not LTS002b) is used.\n"]
[null,null,"","If we receive a contact for a new client and the outcome was to repair / replace or to service some equipment previously issued where would you expect them to appear in STS001? \nA contact of this nature is not a new request for social care support – it relates purely to a provision of service and not to any new or increased need for support. Requests of this nature would not appear in STS001.\n",null,null,null,null,null,null,null,"If we receive a contact for a new client and the outcome was to repair / replace or to service some equipment previously issued where would you expect them to appear in STS001?","\nA contact of this nature is not a new request for social care support – it relates purely to a provision of service and not to any new or increased need for support. Requests of this nature would not appear in STS001.\n",{"$f":"IF($AL$417=1,IF(ISNUMBER(SEARCH($AK$417,'Hide this - Workings'!D29)),1,0),\"\")","v":""},{"$f":"IF($AL$418=1,IF(ISNUMBER(SEARCH($AK$418,'Hide this - Workings'!D29)),1,0),\"\")","v":""},{"$f":"IF($AL$419=1,IF(ISNUMBER(SEARCH($AK$419,'Hide this - Workings'!D29)),1,0),\"\")","v":""},{"$f":"IF($AL$420=1,IF(ISNUMBER(SEARCH($AK$420,'Hide this - Workings'!D29)),1,0),\"\")","v":""},{"$f":"IF($AL$421=1,IF(ISNUMBER(SEARCH($AK$421,'Hide this - Workings'!D29)),1,0),\"\")","v":""},{"$f":"IF($AL$422=1,IF(ISNUMBER(SEARCH($AK$422,'Hide this - Workings'!D29)),1,0),\"\")","v":""},{"$f":"IF($AL$423=1,IF(ISNUMBER(SEARCH($AK$423,'Hide this - Workings'!D29)),1,0),\"\")","v":""},{"$f":"IF($AL$424=1,IF(ISNUMBER(SEARCH($AK$424,'Hide this - Workings'!D29)),1,0),\"\")","v":""},{"$f":"IF($AL$425=1,IF(ISNUMBER(SEARCH($AK$425,'Hide this - Workings'!D29)),1,0),\"\")","v":""},{"$f":"IF($AL$426=1,IF(ISNUMBER(SEARCH($AK$426,'Hide this - Workings'!D29)),1,0),\"\")","v":""},{"$f":"IF($AL$427=1,IF(ISNUMBER(SEARCH($AK$427,'Hide this - Workings'!D29)),1,0),\"\")","v":""},{"$f":"IF($AL$428=1,IF(ISNUMBER(SEARCH($AK$428,'Hide this - Workings'!D29)),1,0),\"\")","v":""},{"$f":"IF($AL$429=1,IF(ISNUMBER(SEARCH($AK$429,'Hide this - Workings'!D29)),1,0),\"\")","v":""},{"$f":"IF($AL$430=1,IF(ISNUMBER(SEARCH($AK$430,'Hide this - Workings'!D29)),1,0),\"\")","v":""},{"$f":"IF($AL$431=1,IF(ISNUMBER(SEARCH($AK$431,'Hide this - Workings'!D29)),1,0),\"\")","v":""},{"$f":"IF($AL$432=1,IF(ISNUMBER(SEARCH($AK$432,'Hide this - Workings'!D29)),1,0),\"\")","v":""},{"$f":"IF($AL$433=1,IF(ISNUMBER(SEARCH($AK$433,'Hide this - Workings'!D29)),1,0),\"\")","v":""},0,"A025",0,"If we receive a contact for a new client and the outcome was to repair / replace or to service some equipment previously issued where would you expect them to appear in STS001? \nA contact of this nature is not a new request for social care support – it relates purely to a provision of service and not to any new or increased need for support. Requests of this nature would not appear in STS001.\n","If we receive a contact for a new client and the outcome was to repair / replace or to service some equipment previously issued where would you expect them to appear in STS001?","\nA contact of this nature is not a new request for social care support – it relates purely to a provision of service and not to any new or increased need for support. Requests of this nature would not appear in STS001.\n"]
[null,null,"","Does ‘100% NHS Funded Care’ include clients returning to hospital? [STS001] If this the substantive sequel, i.e. there is no prospect of a return from hospital soon, then yes, clients returning to hospital after making a request for support would be counted here. This also assumes the response to the request for support did not result in any provision of long term social care support or ST-Max before the return to hospital occurred.",null,null,null,null,null,null,null,"Does ‘100% NHS Funded Care’ include clients returning to hospital? [STS001]","If this the substantive sequel, i.e. there is no prospect of a return from hospital soon, then yes, clients returning to hospital after making a request for support would be counted here. This also assumes the response to the request for support did not result in any provision of long term social care support or ST-Max before the return to hospital occurred.",{"$f":"IF($AL$417=1,IF(ISNUMBER(SEARCH($AK$417,'Hide this - Workings'!D30)),1,0),\"\")","v":""},{"$f":"IF($AL$418=1,IF(ISNUMBER(SEARCH($AK$418,'Hide this - Workings'!D30)),1,0),\"\")","v":""},{"$f":"IF($AL$419=1,IF(ISNUMBER(SEARCH($AK$419,'Hide this - Workings'!D30)),1,0),\"\")","v":""},{"$f":"IF($AL$420=1,IF(ISNUMBER(SEARCH($AK$420,'Hide this - Workings'!D30)),1,0),\"\")","v":""},{"$f":"IF($AL$421=1,IF(ISNUMBER(SEARCH($AK$421,'Hide this - Workings'!D30)),1,0),\"\")","v":""},{"$f":"IF($AL$422=1,IF(ISNUMBER(SEARCH($AK$422,'Hide this - Workings'!D30)),1,0),\"\")","v":""},{"$f":"IF($AL$423=1,IF(ISNUMBER(SEARCH($AK$423,'Hide this - Workings'!D30)),1,0),\"\")","v":""},{"$f":"IF($AL$424=1,IF(ISNUMBER(SEARCH($AK$424,'Hide this - Workings'!D30)),1,0),\"\")","v":""},{"$f":"IF($AL$425=1,IF(ISNUMBER(SEARCH($AK$425,'Hide this - Workings'!D30)),1,0),\"\")","v":""},{"$f":"IF($AL$426=1,IF(ISNUMBER(SEARCH($AK$426,'Hide this - Workings'!D30)),1,0),\"\")","v":""},{"$f":"IF($AL$427=1,IF(ISNUMBER(SEARCH($AK$427,'Hide this - Workings'!D30)),1,0),\"\")","v":""},{"$f":"IF($AL$428=1,IF(ISNUMBER(SEARCH($AK$428,'Hide this - Workings'!D30)),1,0),\"\")","v":""},{"$f":"IF($AL$429=1,IF(ISNUMBER(SEARCH($AK$429,'Hide this - Workings'!D30)),1,0),\"\")","v":""},{"$f":"IF($AL$430=1,IF(ISNUMBER(SEARCH($AK$430,'Hide this - Workings'!D30)),1,0),\"\")","v":""},{"$f":"IF($AL$431=1,IF(ISNUMBER(SEARCH($AK$431,'Hide this - Workings'!D30)),1,0),\"\")","v":""},{"$f":"IF($AL$432=1,IF(ISNUMBER(SEARCH($AK$432,'Hide this - Workings'!D30)),1,0),\"\")","v":""},{"$f":"IF($AL$433=1,IF(ISNUMBER(SEARCH($AK$433,'Hide this - Workings'!D30)),1,0),\"\")","v":""},0,"A026",0,"Does ‘100% NHS Funded Care’ include clients returning to hospital? [STS001] If this the substantive sequel, i.e. there is no prospect of a return from hospital soon, then yes, clients returning to hospital after making a request for support would be counted here. This also assumes the response to the request for support did not result in any provision of long term social care support or ST-Max before the return to hospital occurred.","Does ‘100% NHS Funded Care’ include clients returning to hospital? [STS001]","If this the substantive sequel, i.e. there is no prospect of a return from hospital soon, then yes, clients returning to hospital after making a request for support would be counted here. This also assumes the response to the request for support did not result in any provision of long term social care support or ST-Max before the return to hospital occurred."]
[null,null,"","What does ‘early’ mean in Early Cessation of Service for STS002a? At what point should I consider the reablement service we provided to be completed? To be counted as an ‘early cessation’, a change in the client’s circumstances must force the reablement service to be ended prior to its scheduled end date. An obvious instance would be if the client passed away. It does not matter at what point the cessation occurred. A short term service which has a revised end date because it did not work as planned does NOT constitute an ‘early cessation’ for SALT purposes, because the end date was changed in a planned way. So short term services which conclude without reducing ongoing dependency should be recorded as completed, with the appropriate sequel, even if they end earlier than originally anticipated. The guidance (2017-18) now has more detail on these types of scenario .",null,null,null,null,null,null,null,"What does ‘early’ mean in Early Cessation of Service for STS002a? At what point should I consider the reablement service we provided to be completed?","To be counted as an ‘early cessation’, a change in the client’s circumstances must force the reablement service to be ended prior to its scheduled end date. An obvious instance would be if the client passed away. It does not matter at what point the cessation occurred. A short term service which has a revised end date because it did not work as planned does NOT constitute an ‘early cessation’ for SALT purposes, because the end date was changed in a planned way. So short term services which conclude without reducing ongoing dependency should be recorded as completed, with the appropriate sequel, even if they end earlier than originally anticipated. The guidance (2017-18) now has more detail on these types of scenario .",{"$f":"IF($AL$417=1,IF(ISNUMBER(SEARCH($AK$417,'Hide this - Workings'!D31)),1,0),\"\")","v":""},{"$f":"IF($AL$418=1,IF(ISNUMBER(SEARCH($AK$418,'Hide this - Workings'!D31)),1,0),\"\")","v":""},{"$f":"IF($AL$419=1,IF(ISNUMBER(SEARCH($AK$419,'Hide this - Workings'!D31)),1,0),\"\")","v":""},{"$f":"IF($AL$420=1,IF(ISNUMBER(SEARCH($AK$420,'Hide this - Workings'!D31)),1,0),\"\")","v":""},{"$f":"IF($AL$421=1,IF(ISNUMBER(SEARCH($AK$421,'Hide this - Workings'!D31)),1,0),\"\")","v":""},{"$f":"IF($AL$422=1,IF(ISNUMBER(SEARCH($AK$422,'Hide this - Workings'!D31)),1,0),\"\")","v":""},{"$f":"IF($AL$423=1,IF(ISNUMBER(SEARCH($AK$423,'Hide this - Workings'!D31)),1,0),\"\")","v":""},{"$f":"IF($AL$424=1,IF(ISNUMBER(SEARCH($AK$424,'Hide this - Workings'!D31)),1,0),\"\")","v":""},{"$f":"IF($AL$425=1,IF(ISNUMBER(SEARCH($AK$425,'Hide this - Workings'!D31)),1,0),\"\")","v":""},{"$f":"IF($AL$426=1,IF(ISNUMBER(SEARCH($AK$426,'Hide this - Workings'!D31)),1,0),\"\")","v":""},{"$f":"IF($AL$427=1,IF(ISNUMBER(SEARCH($AK$427,'Hide this - Workings'!D31)),1,0),\"\")","v":""},{"$f":"IF($AL$428=1,IF(ISNUMBER(SEARCH($AK$428,'Hide this - Workings'!D31)),1,0),\"\")","v":""},{"$f":"IF($AL$429=1,IF(ISNUMBER(SEARCH($AK$429,'Hide this - Workings'!D31)),1,0),\"\")","v":""},{"$f":"IF($AL$430=1,IF(ISNUMBER(SEARCH($AK$430,'Hide this - Workings'!D31)),1,0),\"\")","v":""},{"$f":"IF($AL$431=1,IF(ISNUMBER(SEARCH($AK$431,'Hide this - Workings'!D31)),1,0),\"\")","v":""},{"$f":"IF($AL$432=1,IF(ISNUMBER(SEARCH($AK$432,'Hide this - Workings'!D31)),1,0),\"\")","v":""},{"$f":"IF($AL$433=1,IF(ISNUMBER(SEARCH($AK$433,'Hide this - Workings'!D31)),1,0),\"\")","v":""},0,"A027",0,"What does ‘early’ mean in Early Cessation of Service for STS002a? At what point should I consider the reablement service we provided to be completed? To be counted as an ‘early cessation’, a change in the client’s circumstances must force the reablement service to be ended prior to its scheduled end date. An obvious instance would be if the client passed away. It does not matter at what point the cessation occurred. A short term service which has a revised end date because it did not work as planned does NOT constitute an ‘early cessation’ for SALT purposes, because the end date was changed in a planned way. So short term services which conclude without reducing ongoing dependency should be recorded as completed, with the appropriate sequel, even if they end earlier than originally anticipated. The guidance (2017-18) now has more detail on these types of scenario .","What does ‘early’ mean in Early Cessation of Service for STS002a? At what point should I consider the reablement service we provided to be completed?","To be counted as an ‘early cessation’, a change in the client’s circumstances must force the reablement service to be ended prior to its scheduled end date. An obvious instance would be if the client passed away. It does not matter at what point the cessation occurred. A short term service which has a revised end date because it did not work as planned does NOT constitute an ‘early cessation’ for SALT purposes, because the end date was changed in a planned way. So short term services which conclude without reducing ongoing dependency should be recorded as completed, with the appropriate sequel, even if they end earlier than originally anticipated. The guidance (2017-18) now has more detail on these types of scenario ."]
[null,null,"","Can rehabilitation work done by rehabilitation workers in a health or joint health / social care team be included in STS002a? Clients can only be included in STS002a if they also appear in STS001 either in this year or a previous year. This means the request for support has to be received by the CASSR who then decide to commission or provide a short term service to the client with the aim of maximising independence. If the request for support went to a health team who were not considering social care needs, then this would not be relevant to STS001 or STS002a.",null,null,null,null,null,null,null,"Can rehabilitation work done by rehabilitation workers in a health or joint health / social care team be included in STS002a?","Clients can only be included in STS002a if they also appear in STS001 either in this year or a previous year. This means the request for support has to be received by the CASSR who then decide to commission or provide a short term service to the client with the aim of maximising independence. If the request for support went to a health team who were not considering social care needs, then this would not be relevant to STS001 or STS002a.",{"$f":"IF($AL$417=1,IF(ISNUMBER(SEARCH($AK$417,'Hide this - Workings'!D32)),1,0),\"\")","v":""},{"$f":"IF($AL$418=1,IF(ISNUMBER(SEARCH($AK$418,'Hide this - Workings'!D32)),1,0),\"\")","v":""},{"$f":"IF($AL$419=1,IF(ISNUMBER(SEARCH($AK$419,'Hide this - Workings'!D32)),1,0),\"\")","v":""},{"$f":"IF($AL$420=1,IF(ISNUMBER(SEARCH($AK$420,'Hide this - Workings'!D32)),1,0),\"\")","v":""},{"$f":"IF($AL$421=1,IF(ISNUMBER(SEARCH($AK$421,'Hide this - Workings'!D32)),1,0),\"\")","v":""},{"$f":"IF($AL$422=1,IF(ISNUMBER(SEARCH($AK$422,'Hide this - Workings'!D32)),1,0),\"\")","v":""},{"$f":"IF($AL$423=1,IF(ISNUMBER(SEARCH($AK$423,'Hide this - Workings'!D32)),1,0),\"\")","v":""},{"$f":"IF($AL$424=1,IF(ISNUMBER(SEARCH($AK$424,'Hide this - Workings'!D32)),1,0),\"\")","v":""},{"$f":"IF($AL$425=1,IF(ISNUMBER(SEARCH($AK$425,'Hide this - Workings'!D32)),1,0),\"\")","v":""},{"$f":"IF($AL$426=1,IF(ISNUMBER(SEARCH($AK$426,'Hide this - Workings'!D32)),1,0),\"\")","v":""},{"$f":"IF($AL$427=1,IF(ISNUMBER(SEARCH($AK$427,'Hide this - Workings'!D32)),1,0),\"\")","v":""},{"$f":"IF($AL$428=1,IF(ISNUMBER(SEARCH($AK$428,'Hide this - Workings'!D32)),1,0),\"\")","v":""},{"$f":"IF($AL$429=1,IF(ISNUMBER(SEARCH($AK$429,'Hide this - Workings'!D32)),1,0),\"\")","v":""},{"$f":"IF($AL$430=1,IF(ISNUMBER(SEARCH($AK$430,'Hide this - Workings'!D32)),1,0),\"\")","v":""},{"$f":"IF($AL$431=1,IF(ISNUMBER(SEARCH($AK$431,'Hide this - Workings'!D32)),1,0),\"\")","v":""},{"$f":"IF($AL$432=1,IF(ISNUMBER(SEARCH($AK$432,'Hide this - Workings'!D32)),1,0),\"\")","v":""},{"$f":"IF($AL$433=1,IF(ISNUMBER(SEARCH($AK$433,'Hide this - Workings'!D32)),1,0),\"\")","v":""},0,"A028",0,"Can rehabilitation work done by rehabilitation workers in a health or joint health / social care team be included in STS002a? Clients can only be included in STS002a if they also appear in STS001 either in this year or a previous year. This means the request for support has to be received by the CASSR who then decide to commission or provide a short term service to the client with the aim of maximising independence. If the request for support went to a health team who were not considering social care needs, then this would not be relevant to STS001 or STS002a.","Can rehabilitation work done by rehabilitation workers in a health or joint health / social care team be included in STS002a?","Clients can only be included in STS002a if they also appear in STS001 either in this year or a previous year. This means the request for support has to be received by the CASSR who then decide to commission or provide a short term service to the client with the aim of maximising independence. If the request for support went to a health team who were not considering social care needs, then this would not be relevant to STS001 or STS002a."]
[null,null,"","Should work with out of area clients be recorded in STS002a? If you provided short term support to maximise independence relating to clients from another area at your expense, then count them in your figures. If the other area pays for the work do not include them. Similarly, count local clients who were provided with short term support by another CASSR only if you pay for the work. This will probably require details for such clients to be recorded on your own client database in order to be accurately counted. ",null,null,null,null,null,null,null,"Should work with out of area clients be recorded in STS002a?","If you provided short term support to maximise independence relating to clients from another area at your expense, then count them in your figures. If the other area pays for the work do not include them. Similarly, count local clients who were provided with short term support by another CASSR only if you pay for the work. This will probably require details for such clients to be recorded on your own client database in order to be accurately counted. ",{"$f":"IF($AL$417=1,IF(ISNUMBER(SEARCH($AK$417,'Hide this - Workings'!D33)),1,0),\"\")","v":""},{"$f":"IF($AL$418=1,IF(ISNUMBER(SEARCH($AK$418,'Hide this - Workings'!D33)),1,0),\"\")","v":""},{"$f":"IF($AL$419=1,IF(ISNUMBER(SEARCH($AK$419,'Hide this - Workings'!D33)),1,0),\"\")","v":""},{"$f":"IF($AL$420=1,IF(ISNUMBER(SEARCH($AK$420,'Hide this - Workings'!D33)),1,0),\"\")","v":""},{"$f":"IF($AL$421=1,IF(ISNUMBER(SEARCH($AK$421,'Hide this - Workings'!D33)),1,0),\"\")","v":""},{"$f":"IF($AL$422=1,IF(ISNUMBER(SEARCH($AK$422,'Hide this - Workings'!D33)),1,0),\"\")","v":""},{"$f":"IF($AL$423=1,IF(ISNUMBER(SEARCH($AK$423,'Hide this - Workings'!D33)),1,0),\"\")","v":""},{"$f":"IF($AL$424=1,IF(ISNUMBER(SEARCH($AK$424,'Hide this - Workings'!D33)),1,0),\"\")","v":""},{"$f":"IF($AL$425=1,IF(ISNUMBER(SEARCH($AK$425,'Hide this - Workings'!D33)),1,0),\"\")","v":""},{"$f":"IF($AL$426=1,IF(ISNUMBER(SEARCH($AK$426,'Hide this - Workings'!D33)),1,0),\"\")","v":""},{"$f":"IF($AL$427=1,IF(ISNUMBER(SEARCH($AK$427,'Hide this - Workings'!D33)),1,0),\"\")","v":""},{"$f":"IF($AL$428=1,IF(ISNUMBER(SEARCH($AK$428,'Hide this - Workings'!D33)),1,0),\"\")","v":""},{"$f":"IF($AL$429=1,IF(ISNUMBER(SEARCH($AK$429,'Hide this - Workings'!D33)),1,0),\"\")","v":""},{"$f":"IF($AL$430=1,IF(ISNUMBER(SEARCH($AK$430,'Hide this - Workings'!D33)),1,0),\"\")","v":""},{"$f":"IF($AL$431=1,IF(ISNUMBER(SEARCH($AK$431,'Hide this - Workings'!D33)),1,0),\"\")","v":""},{"$f":"IF($AL$432=1,IF(ISNUMBER(SEARCH($AK$432,'Hide this - Workings'!D33)),1,0),\"\")","v":""},{"$f":"IF($AL$433=1,IF(ISNUMBER(SEARCH($AK$433,'Hide this - Workings'!D33)),1,0),\"\")","v":""},0,"A029",0,"Should work with out of area clients be recorded in STS002a? If you provided short term support to maximise independence relating to clients from another area at your expense, then count them in your figures. If the other area pays for the work do not include them. Similarly, count local clients who were provided with short term support by another CASSR only if you pay for the work. This will probably require details for such clients to be recorded on your own client database in order to be accurately counted. ","Should work with out of area clients be recorded in STS002a?","If you provided short term support to maximise independence relating to clients from another area at your expense, then count them in your figures. If the other area pays for the work do not include them. Similarly, count local clients who were provided with short term support by another CASSR only if you pay for the work. This will probably require details for such clients to be recorded on your own client database in order to be accurately counted. "]
[null,null,"","In our council a number of clients move directly from reablement care (ST-MAX) to CHC funded care. We retain care management but the care is funded by health. Which sequel should we choose to reflect this care? We don’t expect that there will be many clients who move directly from ST-MAX to CHC funded care, but it is certainly possible. Similarly not all councils will care manage CHC funded care. Whilst you retain care management the fact that health are funding the care combined with the way that CHC funding may be time limited means that the sequel ‘Long term support (any setting)’ would not be appropriate. Select the sequel of 'Early cessation of service (not leading to long term support) - 100% NHS funded care/End of Life/deceased'.",null,null,null,null,null,null,null,"In our council a number of clients move directly from reablement care (ST-MAX) to CHC funded care. We retain care management but the care is funded by health. Which sequel should we choose to reflect this care?","We don’t expect that there will be many clients who move directly from ST-MAX to CHC funded care, but it is certainly possible. Similarly not all councils will care manage CHC funded care. Whilst you retain care management the fact that health are funding the care combined with the way that CHC funding may be time limited means that the sequel ‘Long term support (any setting)’ would not be appropriate. Select the sequel of 'Early cessation of service (not leading to long term support) - 100% NHS funded care/End of Life/deceased'.",{"$f":"IF($AL$417=1,IF(ISNUMBER(SEARCH($AK$417,'Hide this - Workings'!D34)),1,0),\"\")","v":""},{"$f":"IF($AL$418=1,IF(ISNUMBER(SEARCH($AK$418,'Hide this - Workings'!D34)),1,0),\"\")","v":""},{"$f":"IF($AL$419=1,IF(ISNUMBER(SEARCH($AK$419,'Hide this - Workings'!D34)),1,0),\"\")","v":""},{"$f":"IF($AL$420=1,IF(ISNUMBER(SEARCH($AK$420,'Hide this - Workings'!D34)),1,0),\"\")","v":""},{"$f":"IF($AL$421=1,IF(ISNUMBER(SEARCH($AK$421,'Hide this - Workings'!D34)),1,0),\"\")","v":""},{"$f":"IF($AL$422=1,IF(ISNUMBER(SEARCH($AK$422,'Hide this - Workings'!D34)),1,0),\"\")","v":""},{"$f":"IF($AL$423=1,IF(ISNUMBER(SEARCH($AK$423,'Hide this - Workings'!D34)),1,0),\"\")","v":""},{"$f":"IF($AL$424=1,IF(ISNUMBER(SEARCH($AK$424,'Hide this - Workings'!D34)),1,0),\"\")","v":""},{"$f":"IF($AL$425=1,IF(ISNUMBER(SEARCH($AK$425,'Hide this - Workings'!D34)),1,0),\"\")","v":""},{"$f":"IF($AL$426=1,IF(ISNUMBER(SEARCH($AK$426,'Hide this - Workings'!D34)),1,0),\"\")","v":""},{"$f":"IF($AL$427=1,IF(ISNUMBER(SEARCH($AK$427,'Hide this - Workings'!D34)),1,0),\"\")","v":""},{"$f":"IF($AL$428=1,IF(ISNUMBER(SEARCH($AK$428,'Hide this - Workings'!D34)),1,0),\"\")","v":""},{"$f":"IF($AL$429=1,IF(ISNUMBER(SEARCH($AK$429,'Hide this - Workings'!D34)),1,0),\"\")","v":""},{"$f":"IF($AL$430=1,IF(ISNUMBER(SEARCH($AK$430,'Hide this - Workings'!D34)),1,0),\"\")","v":""},{"$f":"IF($AL$431=1,IF(ISNUMBER(SEARCH($AK$431,'Hide this - Workings'!D34)),1,0),\"\")","v":""},{"$f":"IF($AL$432=1,IF(ISNUMBER(SEARCH($AK$432,'Hide this - Workings'!D34)),1,0),\"\")","v":""},{"$f":"IF($AL$433=1,IF(ISNUMBER(SEARCH($AK$433,'Hide this - Workings'!D34)),1,0),\"\")","v":""},0,"A030",0,"In our council a number of clients move directly from reablement care (ST-MAX) to CHC funded care. We retain care management but the care is funded by health. Which sequel should we choose to reflect this care? We don’t expect that there will be many clients who move directly from ST-MAX to CHC funded care, but it is certainly possible. Similarly not all councils will care manage CHC funded care. Whilst you retain care management the fact that health are funding the care combined with the way that CHC funding may be time limited means that the sequel ‘Long term support (any setting)’ would not be appropriate. Select the sequel of 'Early cessation of service (not leading to long term support) - 100% NHS funded care/End of Life/deceased'.","In our council a number of clients move directly from reablement care (ST-MAX) to CHC funded care. We retain care management but the care is funded by health. Which sequel should we choose to reflect this care?","We don’t expect that there will be many clients who move directly from ST-MAX to CHC funded care, but it is certainly possible. Similarly not all councils will care manage CHC funded care. Whilst you retain care management the fact that health are funding the care combined with the way that CHC funding may be time limited means that the sequel ‘Long term support (any setting)’ would not be appropriate. Select the sequel of 'Early cessation of service (not leading to long term support) - 100% NHS funded care/End of Life/deceased'."]
[null,null,"","We are unsure whether new reablement clients’ support should be considered ‘early cessation’ or not. Can you tell us which sequel should apply? [STS002a] Scenario 1: A client received just four days of support, but then cancelled the care because they told us they were feeling much better and no longer needed the help.\nA: This case should be recorded as ‘early cessation-(not leading to long term support - other reason)' because it is unclear how ST-Max could be expected to have had any impact in such a short time.\nScenario 2: A client’s family was unhappy with the carers who attended and after two weeks they cancelled the care package (with the clients’ agreement) saying they would take over the support themselves.\nA: This case should also be recorded as ‘early cessation-(not leading to long term support - other reason)' because the ST-Max has been interrupted without an opportunity for its benefits to become known.\nScenario 3: A care package was cancelled after two weeks following the first review between the agency, reablement staff and client. The service user reported gaining new confidence following their hospital discharge and felt sufficiently independent to not require any ongoing support.\nA: This case should NOT be recorded as ‘early cessation’ – although the planned or maximum duration of 4-6 weeks was not required, if there is evidence that ST-Max has been responsible for such an improvement, then it can be considered to be ‘complete’ and the sequel recorded in the same way as an episode of ST-Max which ran for 4 or 6 weeks.\nScenario 4: A care package was cancelled after two weeks following the first review between the agency, reablement staff and client. The service user was struggling to make progress following their hospital discharge and required ongoing home care, possibly residential care.\nA: This case should NOT be recorded as ‘early cessation’. ST-Max has been attempted but has not been successful, and this is obvious after just two weeks. In such cases the reablement can be considered ‘complete’ because there was no reason to continue, and sufficient time to conclude the impact of ST-Max (in this case, unsuccessful). The sequel chosen should then reflect whatever ongoing long-term support was provided.\nScenario 5: The agency reported staff could not gain access to the client’s property on first visit. The client had earlier been readmitted to hospital and so the package had to be cancelled.\nA: No ST-Max was actually delivered. This client should not be included in STS002a. The sequel for STS001 does not need to be amended, as ‘ST-Max’ was the sequel made in response to the request for support.\nScenario 6: The client completed 6 weeks reablement but before any long term support arrangements could be put in place, they were readmitted to hospital and died.\nA: Because the ongoing support arrangements didn’t commence before the hospital readmission, this case should be considered ‘early cessation’. All cases in which the client dies or is admitted to hospital or requires palliative care, even after the end of ST-Max services but before the commencement or delivery of any subsequent services, should be counted as ‘Early cessation of service (not leading to long term support) - NHS funded care/End of Life/deceased’\n\n",null,null,null,null,null,null,null,"We are unsure whether new reablement clients’ support should be considered ‘early cessation’ or not. Can you tell us which sequel should apply? [STS002a]","Scenario 1: A client received just four days of support, but then cancelled the care because they told us they were feeling much better and no longer needed the help.\nA: This case should be recorded as ‘early cessation-(not leading to long term support - other reason)' because it is unclear how ST-Max could be expected to have had any impact in such a short time.\nScenario 2: A client’s family was unhappy with the carers who attended and after two weeks they cancelled the care package (with the clients’ agreement) saying they would take over the support themselves.\nA: This case should also be recorded as ‘early cessation-(not leading to long term support - other reason)' because the ST-Max has been interrupted without an opportunity for its benefits to become known.\nScenario 3: A care package was cancelled after two weeks following the first review between the agency, reablement staff and client. The service user reported gaining new confidence following their hospital discharge and felt sufficiently independent to not require any ongoing support.\nA: This case should NOT be recorded as ‘early cessation’ – although the planned or maximum duration of 4-6 weeks was not required, if there is evidence that ST-Max has been responsible for such an improvement, then it can be considered to be ‘complete’ and the sequel recorded in the same way as an episode of ST-Max which ran for 4 or 6 weeks.\nScenario 4: A care package was cancelled after two weeks following the first review between the agency, reablement staff and client. The service user was struggling to make progress following their hospital discharge and required ongoing home care, possibly residential care.\nA: This case should NOT be recorded as ‘early cessation’. ST-Max has been attempted but has not been successful, and this is obvious after just two weeks. In such cases the reablement can be considered ‘complete’ because there was no reason to continue, and sufficient time to conclude the impact of ST-Max (in this case, unsuccessful). The sequel chosen should then reflect whatever ongoing long-term support was provided.\nScenario 5: The agency reported staff could not gain access to the client’s property on first visit. The client had earlier been readmitted to hospital and so the package had to be cancelled.\nA: No ST-Max was actually delivered. This client should not be included in STS002a. The sequel for STS001 does not need to be amended, as ‘ST-Max’ was the sequel made in response to the request for support.\nScenario 6: The client completed 6 weeks reablement but before any long term support arrangements could be put in place, they were readmitted to hospital and died.\nA: Because the ongoing support arrangements didn’t commence before the hospital readmission, this case should be considered ‘early cessation’. All cases in which the client dies or is admitted to hospital or requires palliative care, even after the end of ST-Max services but before the commencement or delivery of any subsequent services, should be counted as ‘Early cessation of service (not leading to long term support) - NHS funded care/End of Life/deceased’\n\n",{"$f":"IF($AL$417=1,IF(ISNUMBER(SEARCH($AK$417,'Hide this - Workings'!D35)),1,0),\"\")","v":""},{"$f":"IF($AL$418=1,IF(ISNUMBER(SEARCH($AK$418,'Hide this - Workings'!D35)),1,0),\"\")","v":""},{"$f":"IF($AL$419=1,IF(ISNUMBER(SEARCH($AK$419,'Hide this - Workings'!D35)),1,0),\"\")","v":""},{"$f":"IF($AL$420=1,IF(ISNUMBER(SEARCH($AK$420,'Hide this - Workings'!D35)),1,0),\"\")","v":""},{"$f":"IF($AL$421=1,IF(ISNUMBER(SEARCH($AK$421,'Hide this - Workings'!D35)),1,0),\"\")","v":""},{"$f":"IF($AL$422=1,IF(ISNUMBER(SEARCH($AK$422,'Hide this - Workings'!D35)),1,0),\"\")","v":""},{"$f":"IF($AL$423=1,IF(ISNUMBER(SEARCH($AK$423,'Hide this - Workings'!D35)),1,0),\"\")","v":""},{"$f":"IF($AL$424=1,IF(ISNUMBER(SEARCH($AK$424,'Hide this - Workings'!D35)),1,0),\"\")","v":""},{"$f":"IF($AL$425=1,IF(ISNUMBER(SEARCH($AK$425,'Hide this - Workings'!D35)),1,0),\"\")","v":""},{"$f":"IF($AL$426=1,IF(ISNUMBER(SEARCH($AK$426,'Hide this - Workings'!D35)),1,0),\"\")","v":""},{"$f":"IF($AL$427=1,IF(ISNUMBER(SEARCH($AK$427,'Hide this - Workings'!D35)),1,0),\"\")","v":""},{"$f":"IF($AL$428=1,IF(ISNUMBER(SEARCH($AK$428,'Hide this - Workings'!D35)),1,0),\"\")","v":""},{"$f":"IF($AL$429=1,IF(ISNUMBER(SEARCH($AK$429,'Hide this - Workings'!D35)),1,0),\"\")","v":""},{"$f":"IF($AL$430=1,IF(ISNUMBER(SEARCH($AK$430,'Hide this - Workings'!D35)),1,0),\"\")","v":""},{"$f":"IF($AL$431=1,IF(ISNUMBER(SEARCH($AK$431,'Hide this - Workings'!D35)),1,0),\"\")","v":""},{"$f":"IF($AL$432=1,IF(ISNUMBER(SEARCH($AK$432,'Hide this - Workings'!D35)),1,0),\"\")","v":""},{"$f":"IF($AL$433=1,IF(ISNUMBER(SEARCH($AK$433,'Hide this - Workings'!D35)),1,0),\"\")","v":""},0,"A031",0,"We are unsure whether new reablement clients’ support should be considered ‘early cessation’ or not. Can you tell us which sequel should apply? [STS002a] Scenario 1: A client received just four days of support, but then cancelled the care because they told us they were feeling much better and no longer needed the help.\nA: This case should be recorded as ‘early cessation-(not leading to long term support - other reason)' because it is unclear how ST-Max could be expected to have had any impact in such a short time.\nScenario 2: A client’s family was unhappy with the carers who attended and after two weeks they cancelled the care package (with the clients’ agreement) saying they would take over the support themselves.\nA: This case should also be recorded as ‘early cessation-(not leading to long term support - other reason)' because the ST-Max has been interrupted without an opportunity for its benefits to become known.\nScenario 3: A care package was cancelled after two weeks following the first review between the agency, reablement staff and client. The service user reported gaining new confidence following their hospital discharge and felt sufficiently independent to not require any ongoing support.\nA: This case should NOT be recorded as ‘early cessation’ – although the planned or maximum duration of 4-6 weeks was not required, if there is evidence that ST-Max has been responsible for such an improvement, then it can be considered to be ‘complete’ and the sequel recorded in the same way as an episode of ST-Max which ran for 4 or 6 weeks.\nScenario 4: A care package was cancelled after two weeks following the first review between the agency, reablement staff and client. The service user was struggling to make progress following their hospital discharge and required ongoing home care, possibly residential care.\nA: This case should NOT be recorded as ‘early cessation’. ST-Max has been attempted but has not been successful, and this is obvious after just two weeks. In such cases the reablement can be considered ‘complete’ because there was no reason to continue, and sufficient time to conclude the impact of ST-Max (in this case, unsuccessful). The sequel chosen should then reflect whatever ongoing long-term support was provided.\nScenario 5: The agency reported staff could not gain access to the client’s property on first visit. The client had earlier been readmitted to hospital and so the package had to be cancelled.\nA: No ST-Max was actually delivered. This client should not be included in STS002a. The sequel for STS001 does not need to be amended, as ‘ST-Max’ was the sequel made in response to the request for support.\nScenario 6: The client completed 6 weeks reablement but before any long term support arrangements could be put in place, they were readmitted to hospital and died.\nA: Because the ongoing support arrangements didn’t commence before the hospital readmission, this case should be considered ‘early cessation’. All cases in which the client dies or is admitted to hospital or requires palliative care, even after the end of ST-Max services but before the commencement or delivery of any subsequent services, should be counted as ‘Early cessation of service (not leading to long term support) - NHS funded care/End of Life/deceased’\n\n","We are unsure whether new reablement clients’ support should be considered ‘early cessation’ or not. Can you tell us which sequel should apply? [STS002a]","Scenario 1: A client received just four days of support, but then cancelled the care because they told us they were feeling much better and no longer needed the help.\nA: This case should be recorded as ‘early cessation-(not leading to long term support - other reason)' because it is unclear how ST-Max could be expected to have had any impact in such a short time.\nScenario 2: A client’s family was unhappy with the carers who attended and after two weeks they cancelled the care package (with the clients’ agreement) saying they would take over the support themselves.\nA: This case should also be recorded as ‘early cessation-(not leading to long term support - other reason)' because the ST-Max has been interrupted without an opportunity for its benefits to become known.\nScenario 3: A care package was cancelled after two weeks following the first review between the agency, reablement staff and client. The service user reported gaining new confidence following their hospital discharge and felt sufficiently independent to not require any ongoing support.\nA: This case should NOT be recorded as ‘early cessation’ – although the planned or maximum duration of 4-6 weeks was not required, if there is evidence that ST-Max has been responsible for such an improvement, then it can be considered to be ‘complete’ and the sequel recorded in the same way as an episode of ST-Max which ran for 4 or 6 weeks.\nScenario 4: A care package was cancelled after two weeks following the first review between the agency, reablement staff and client. The service user was struggling to make progress following their hospital discharge and required ongoing home care, possibly residential care.\nA: This case should NOT be recorded as ‘early cessation’. ST-Max has been attempted but has not been successful, and this is obvious after just two weeks. In such cases the reablement can be considered ‘complete’ because there was no reason to continue, and sufficient time to conclude the impact of ST-Max (in this case, unsuccessful). The sequel chosen should then reflect whatever ongoing long-term support was provided.\nScenario 5: The agency reported staff could not gain access to the client’s property on first visit. The client had earlier been readmitted to hospital and so the package had to be cancelled.\nA: No ST-Max was actually delivered. This client should not be included in STS002a. The sequel for STS001 does not need to be amended, as ‘ST-Max’ was the sequel made in response to the request for support.\nScenario 6: The client completed 6 weeks reablement but before any long term support arrangements could be put in place, they were readmitted to hospital and died.\nA: Because the ongoing support arrangements didn’t commence before the hospital readmission, this case should be considered ‘early cessation’. All cases in which the client dies or is admitted to hospital or requires palliative care, even after the end of ST-Max services but before the commencement or delivery of any subsequent services, should be counted as ‘Early cessation of service (not leading to long term support) - NHS funded care/End of Life/deceased’\n\n"]
[null,null,"","Do clients have to be referred to a short term service (ST-Max) via a planned or unplanned review? No. Clients may be referred for short term interventions for a number of reasons and at various points, not necessarily from a review. But to appear in STS002b they must currently be in receipt of social care services at the time of the decision to provide short term support and this would mean they will also appear as a service user in measure LTS001a.\n",null,null,null,null,null,null,null,"Do clients have to be referred to a short term service (ST-Max) via a planned or unplanned review?","No. Clients may be referred for short term interventions for a number of reasons and at various points, not necessarily from a review. But to appear in STS002b they must currently be in receipt of social care services at the time of the decision to provide short term support and this would mean they will also appear as a service user in measure LTS001a.\n",{"$f":"IF($AL$417=1,IF(ISNUMBER(SEARCH($AK$417,'Hide this - Workings'!D36)),1,0),\"\")","v":""},{"$f":"IF($AL$418=1,IF(ISNUMBER(SEARCH($AK$418,'Hide this - Workings'!D36)),1,0),\"\")","v":""},{"$f":"IF($AL$419=1,IF(ISNUMBER(SEARCH($AK$419,'Hide this - Workings'!D36)),1,0),\"\")","v":""},{"$f":"IF($AL$420=1,IF(ISNUMBER(SEARCH($AK$420,'Hide this - Workings'!D36)),1,0),\"\")","v":""},{"$f":"IF($AL$421=1,IF(ISNUMBER(SEARCH($AK$421,'Hide this - Workings'!D36)),1,0),\"\")","v":""},{"$f":"IF($AL$422=1,IF(ISNUMBER(SEARCH($AK$422,'Hide this - Workings'!D36)),1,0),\"\")","v":""},{"$f":"IF($AL$423=1,IF(ISNUMBER(SEARCH($AK$423,'Hide this - Workings'!D36)),1,0),\"\")","v":""},{"$f":"IF($AL$424=1,IF(ISNUMBER(SEARCH($AK$424,'Hide this - Workings'!D36)),1,0),\"\")","v":""},{"$f":"IF($AL$425=1,IF(ISNUMBER(SEARCH($AK$425,'Hide this - Workings'!D36)),1,0),\"\")","v":""},{"$f":"IF($AL$426=1,IF(ISNUMBER(SEARCH($AK$426,'Hide this - Workings'!D36)),1,0),\"\")","v":""},{"$f":"IF($AL$427=1,IF(ISNUMBER(SEARCH($AK$427,'Hide this - Workings'!D36)),1,0),\"\")","v":""},{"$f":"IF($AL$428=1,IF(ISNUMBER(SEARCH($AK$428,'Hide this - Workings'!D36)),1,0),\"\")","v":""},{"$f":"IF($AL$429=1,IF(ISNUMBER(SEARCH($AK$429,'Hide this - Workings'!D36)),1,0),\"\")","v":""},{"$f":"IF($AL$430=1,IF(ISNUMBER(SEARCH($AK$430,'Hide this - Workings'!D36)),1,0),\"\")","v":""},{"$f":"IF($AL$431=1,IF(ISNUMBER(SEARCH($AK$431,'Hide this - Workings'!D36)),1,0),\"\")","v":""},{"$f":"IF($AL$432=1,IF(ISNUMBER(SEARCH($AK$432,'Hide this - Workings'!D36)),1,0),\"\")","v":""},{"$f":"IF($AL$433=1,IF(ISNUMBER(SEARCH($AK$433,'Hide this - Workings'!D36)),1,0),\"\")","v":""},0,"A032",0,"Do clients have to be referred to a short term service (ST-Max) via a planned or unplanned review? No. Clients may be referred for short term interventions for a number of reasons and at various points, not necessarily from a review. But to appear in STS002b they must currently be in receipt of social care services at the time of the decision to provide short term support and this would mean they will also appear as a service user in measure LTS001a.\n","Do clients have to be referred to a short term service (ST-Max) via a planned or unplanned review?","No. Clients may be referred for short term interventions for a number of reasons and at various points, not necessarily from a review. But to appear in STS002b they must currently be in receipt of social care services at the time of the decision to provide short term support and this would mean they will also appear as a service user in measure LTS001a.\n"]
[null,null,"","When the existing clients reported in STS002b receive ST-MAX their long term packages of care may either continue or in some instances be suspended during the period of ST-MAX. Please could you give some advice on how the outcomes of ST-MAX for these clients should be reported in STS002b? You are correct in assuming that it is possible for long term support services to continue while the short term support to maximise independence \"ST-MAX\" is being provided. In any case, if the outcome of the ST-MAX is to return to that long term service package, then you would then need to consider whether the level of care had changed following ST-Max and record that support under one of the 'No Change in Setting' sequels. An increases or decreases in packages can be reflected, as can moves between residential/nursing and community services.\n",null,null,null,null,null,null,null,"When the existing clients reported in STS002b receive ST-MAX their long term packages of care may either continue or in some instances be suspended during the period of ST-MAX. Please could you give some advice on how the outcomes of ST-MAX for these clients should be reported in STS002b?","You are correct in assuming that it is possible for long term support services to continue while the short term support to maximise independence \"ST-MAX\" is being provided. In any case, if the outcome of the ST-MAX is to return to that long term service package, then you would then need to consider whether the level of care had changed following ST-Max and record that support under one of the 'No Change in Setting' sequels. An increases or decreases in packages can be reflected, as can moves between residential/nursing and community services.\n",{"$f":"IF($AL$417=1,IF(ISNUMBER(SEARCH($AK$417,'Hide this - Workings'!D37)),1,0),\"\")","v":""},{"$f":"IF($AL$418=1,IF(ISNUMBER(SEARCH($AK$418,'Hide this - Workings'!D37)),1,0),\"\")","v":""},{"$f":"IF($AL$419=1,IF(ISNUMBER(SEARCH($AK$419,'Hide this - Workings'!D37)),1,0),\"\")","v":""},{"$f":"IF($AL$420=1,IF(ISNUMBER(SEARCH($AK$420,'Hide this - Workings'!D37)),1,0),\"\")","v":""},{"$f":"IF($AL$421=1,IF(ISNUMBER(SEARCH($AK$421,'Hide this - Workings'!D37)),1,0),\"\")","v":""},{"$f":"IF($AL$422=1,IF(ISNUMBER(SEARCH($AK$422,'Hide this - Workings'!D37)),1,0),\"\")","v":""},{"$f":"IF($AL$423=1,IF(ISNUMBER(SEARCH($AK$423,'Hide this - Workings'!D37)),1,0),\"\")","v":""},{"$f":"IF($AL$424=1,IF(ISNUMBER(SEARCH($AK$424,'Hide this - Workings'!D37)),1,0),\"\")","v":""},{"$f":"IF($AL$425=1,IF(ISNUMBER(SEARCH($AK$425,'Hide this - Workings'!D37)),1,0),\"\")","v":""},{"$f":"IF($AL$426=1,IF(ISNUMBER(SEARCH($AK$426,'Hide this - Workings'!D37)),1,0),\"\")","v":""},{"$f":"IF($AL$427=1,IF(ISNUMBER(SEARCH($AK$427,'Hide this - Workings'!D37)),1,0),\"\")","v":""},{"$f":"IF($AL$428=1,IF(ISNUMBER(SEARCH($AK$428,'Hide this - Workings'!D37)),1,0),\"\")","v":""},{"$f":"IF($AL$429=1,IF(ISNUMBER(SEARCH($AK$429,'Hide this - Workings'!D37)),1,0),\"\")","v":""},{"$f":"IF($AL$430=1,IF(ISNUMBER(SEARCH($AK$430,'Hide this - Workings'!D37)),1,0),\"\")","v":""},{"$f":"IF($AL$431=1,IF(ISNUMBER(SEARCH($AK$431,'Hide this - Workings'!D37)),1,0),\"\")","v":""},{"$f":"IF($AL$432=1,IF(ISNUMBER(SEARCH($AK$432,'Hide this - Workings'!D37)),1,0),\"\")","v":""},{"$f":"IF($AL$433=1,IF(ISNUMBER(SEARCH($AK$433,'Hide this - Workings'!D37)),1,0),\"\")","v":""},0,"A033",0,{"$f":"IF((IFERROR(N37,0))>1,D37,\"\")","v":"When the existing clients reported in STS002b receive ST-MAX their long term packages of care may either continue or in some instances be suspended during the period of ST-MAX. Please could you give some advice on how the outcomes of ST-MAX for these clients should be reported in STS002b? You are correct in assuming that it is possible for long term support services to continue while the short term support to maximise independence \"ST-MAX\" is being provided. In any case, if the outcome of the ST-MAX is to return to that long term service package, then you would then need to consider whether the level of care had changed following ST-Max and record that support under one of the 'No Change in Setting' sequels. An increases or decreases in packages can be reflected, as can moves between residential/nursing and community services.\n"},{"$f":"IF((IFERROR(N37,0))>1,L37,\"\")","v":"When the existing clients reported in STS002b receive ST-MAX their long term packages of care may either continue or in some instances be suspended during the period of ST-MAX. Please could you give some advice on how the outcomes of ST-MAX for these clients should be reported in STS002b?"},{"$f":"IF((IFERROR(N37,0))>1,M37,\"\")","v":"You are correct in assuming that it is possible for long term support services to continue while the short term support to maximise independence \"ST-MAX\" is being provided. In any case, if the outcome of the ST-MAX is to return to that long term service package, then you would then need to consider whether the level of care had changed following ST-Max and record that support under one of the 'No Change in Setting' sequels. An increases or decreases in packages can be reflected, as can moves between residential/nursing and community services.\n"}]
[null,null,"","A client with an existing home care package was offered ST-Max and after 6 weeks, the ongoing support requirements were assessed to be lower than the previous package. Home care resumed at a lower level. Which sequel should be chosen? The sequels introduced in STS002b for 2017-18 now allow this to be recorded as 'No change in setting - level of long term support decreased'.\n",null,null,null,null,null,null,null,"A client with an existing home care package was offered ST-Max and after 6 weeks, the ongoing support requirements were assessed to be lower than the previous package. Home care resumed at a lower level. Which sequel should be chosen?","The sequels introduced in STS002b for 2017-18 now allow this to be recorded as 'No change in setting - level of long term support decreased'.\n",{"$f":"IF($AL$417=1,IF(ISNUMBER(SEARCH($AK$417,'Hide this - Workings'!D38)),1,0),\"\")","v":""},{"$f":"IF($AL$418=1,IF(ISNUMBER(SEARCH($AK$418,'Hide this - Workings'!D38)),1,0),\"\")","v":""},{"$f":"IF($AL$419=1,IF(ISNUMBER(SEARCH($AK$419,'Hide this - Workings'!D38)),1,0),\"\")","v":""},{"$f":"IF($AL$420=1,IF(ISNUMBER(SEARCH($AK$420,'Hide this - Workings'!D38)),1,0),\"\")","v":""},{"$f":"IF($AL$421=1,IF(ISNUMBER(SEARCH($AK$421,'Hide this - Workings'!D38)),1,0),\"\")","v":""},{"$f":"IF($AL$422=1,IF(ISNUMBER(SEARCH($AK$422,'Hide this - Workings'!D38)),1,0),\"\")","v":""},{"$f":"IF($AL$423=1,IF(ISNUMBER(SEARCH($AK$423,'Hide this - Workings'!D38)),1,0),\"\")","v":""},{"$f":"IF($AL$424=1,IF(ISNUMBER(SEARCH($AK$424,'Hide this - Workings'!D38)),1,0),\"\")","v":""},{"$f":"IF($AL$425=1,IF(ISNUMBER(SEARCH($AK$425,'Hide this - Workings'!D38)),1,0),\"\")","v":""},{"$f":"IF($AL$426=1,IF(ISNUMBER(SEARCH($AK$426,'Hide this - Workings'!D38)),1,0),\"\")","v":""},{"$f":"IF($AL$427=1,IF(ISNUMBER(SEARCH($AK$427,'Hide this - Workings'!D38)),1,0),\"\")","v":""},{"$f":"IF($AL$428=1,IF(ISNUMBER(SEARCH($AK$428,'Hide this - Workings'!D38)),1,0),\"\")","v":""},{"$f":"IF($AL$429=1,IF(ISNUMBER(SEARCH($AK$429,'Hide this - Workings'!D38)),1,0),\"\")","v":""},{"$f":"IF($AL$430=1,IF(ISNUMBER(SEARCH($AK$430,'Hide this - Workings'!D38)),1,0),\"\")","v":""},{"$f":"IF($AL$431=1,IF(ISNUMBER(SEARCH($AK$431,'Hide this - Workings'!D38)),1,0),\"\")","v":""},{"$f":"IF($AL$432=1,IF(ISNUMBER(SEARCH($AK$432,'Hide this - Workings'!D38)),1,0),\"\")","v":""},{"$f":"IF($AL$433=1,IF(ISNUMBER(SEARCH($AK$433,'Hide this - Workings'!D38)),1,0),\"\")","v":""},0,"A034",0,"A client with an existing home care package was offered ST-Max and after 6 weeks, the ongoing support requirements were assessed to be lower than the previous package. Home care resumed at a lower level. Which sequel should be chosen? The sequels introduced in STS002b for 2017-18 now allow this to be recorded as 'No change in setting - level of long term support decreased'.\n","A client with an existing home care package was offered ST-Max and after 6 weeks, the ongoing support requirements were assessed to be lower than the previous package. Home care resumed at a lower level. Which sequel should be chosen?","The sequels introduced in STS002b for 2017-18 now allow this to be recorded as 'No change in setting - level of long term support decreased'.\n"]
[null,null,"","A client with an existing day care package was offered ST-Max and after 6 weeks required no ongoing home care, although day care continued. Which sequel should be chosen? The day care provision counts as ‘long term support’ so they are appropriately included in STS002b. The fact that no home care was needed, but day care continued after ST-Max means that one of the 'no change in setting' sequels is appropriate. Which particular sequel is correct depends on whether the level of long term care has changed following ST-Max (e.g. did the client attend for an extra day per week, etc.)",null,null,null,null,null,null,null,"A client with an existing day care package was offered ST-Max and after 6 weeks required no ongoing home care, although day care continued. Which sequel should be chosen?","The day care provision counts as ‘long term support’ so they are appropriately included in STS002b. The fact that no home care was needed, but day care continued after ST-Max means that one of the 'no change in setting' sequels is appropriate. Which particular sequel is correct depends on whether the level of long term care has changed following ST-Max (e.g. did the client attend for an extra day per week, etc.)",{"$f":"IF($AL$417=1,IF(ISNUMBER(SEARCH($AK$417,'Hide this - Workings'!D39)),1,0),\"\")","v":""},{"$f":"IF($AL$418=1,IF(ISNUMBER(SEARCH($AK$418,'Hide this - Workings'!D39)),1,0),\"\")","v":""},{"$f":"IF($AL$419=1,IF(ISNUMBER(SEARCH($AK$419,'Hide this - Workings'!D39)),1,0),\"\")","v":""},{"$f":"IF($AL$420=1,IF(ISNUMBER(SEARCH($AK$420,'Hide this - Workings'!D39)),1,0),\"\")","v":""},{"$f":"IF($AL$421=1,IF(ISNUMBER(SEARCH($AK$421,'Hide this - Workings'!D39)),1,0),\"\")","v":""},{"$f":"IF($AL$422=1,IF(ISNUMBER(SEARCH($AK$422,'Hide this - Workings'!D39)),1,0),\"\")","v":""},{"$f":"IF($AL$423=1,IF(ISNUMBER(SEARCH($AK$423,'Hide this - Workings'!D39)),1,0),\"\")","v":""},{"$f":"IF($AL$424=1,IF(ISNUMBER(SEARCH($AK$424,'Hide this - Workings'!D39)),1,0),\"\")","v":""},{"$f":"IF($AL$425=1,IF(ISNUMBER(SEARCH($AK$425,'Hide this - Workings'!D39)),1,0),\"\")","v":""},{"$f":"IF($AL$426=1,IF(ISNUMBER(SEARCH($AK$426,'Hide this - Workings'!D39)),1,0),\"\")","v":""},{"$f":"IF($AL$427=1,IF(ISNUMBER(SEARCH($AK$427,'Hide this - Workings'!D39)),1,0),\"\")","v":""},{"$f":"IF($AL$428=1,IF(ISNUMBER(SEARCH($AK$428,'Hide this - Workings'!D39)),1,0),\"\")","v":""},{"$f":"IF($AL$429=1,IF(ISNUMBER(SEARCH($AK$429,'Hide this - Workings'!D39)),1,0),\"\")","v":""},{"$f":"IF($AL$430=1,IF(ISNUMBER(SEARCH($AK$430,'Hide this - Workings'!D39)),1,0),\"\")","v":""},{"$f":"IF($AL$431=1,IF(ISNUMBER(SEARCH($AK$431,'Hide this - Workings'!D39)),1,0),\"\")","v":""},{"$f":"IF($AL$432=1,IF(ISNUMBER(SEARCH($AK$432,'Hide this - Workings'!D39)),1,0),\"\")","v":""},{"$f":"IF($AL$433=1,IF(ISNUMBER(SEARCH($AK$433,'Hide this - Workings'!D39)),1,0),\"\")","v":""},0,"A035",0,"A client with an existing day care package was offered ST-Max and after 6 weeks required no ongoing home care, although day care continued. Which sequel should be chosen? The day care provision counts as ‘long term support’ so they are appropriately included in STS002b. The fact that no home care was needed, but day care continued after ST-Max means that one of the 'no change in setting' sequels is appropriate. Which particular sequel is correct depends on whether the level of long term care has changed following ST-Max (e.g. did the client attend for an extra day per week, etc.)","A client with an existing day care package was offered ST-Max and after 6 weeks required no ongoing home care, although day care continued. Which sequel should be chosen?","The day care provision counts as ‘long term support’ so they are appropriately included in STS002b. The fact that no home care was needed, but day care continued after ST-Max means that one of the 'no change in setting' sequels is appropriate. Which particular sequel is correct depends on whether the level of long term care has changed following ST-Max (e.g. did the client attend for an extra day per week, etc.)"]
[null,null,"","Should people who receive services only from health be included in the return? [STS004] \nIf a person has had a joint assessment, where both their health and social care needs assessed, or an assessment just from social care services only, and they go onto receive a service from social care only, health only, or health and social care, then they should be included on the return. The important element for inclusion is that there must be a social care element to the assessment. \n",null,null,null,null,null,null,null,"Should people who receive services only from health be included in the return? [STS004]","\nIf a person has had a joint assessment, where both their health and social care needs assessed, or an assessment just from social care services only, and they go onto receive a service from social care only, health only, or health and social care, then they should be included on the return. The important element for inclusion is that there must be a social care element to the assessment. \n",{"$f":"IF($AL$417=1,IF(ISNUMBER(SEARCH($AK$417,'Hide this - Workings'!D40)),1,0),\"\")","v":""},{"$f":"IF($AL$418=1,IF(ISNUMBER(SEARCH($AK$418,'Hide this - Workings'!D40)),1,0),\"\")","v":""},{"$f":"IF($AL$419=1,IF(ISNUMBER(SEARCH($AK$419,'Hide this - Workings'!D40)),1,0),\"\")","v":""},{"$f":"IF($AL$420=1,IF(ISNUMBER(SEARCH($AK$420,'Hide this - Workings'!D40)),1,0),\"\")","v":""},{"$f":"IF($AL$421=1,IF(ISNUMBER(SEARCH($AK$421,'Hide this - Workings'!D40)),1,0),\"\")","v":""},{"$f":"IF($AL$422=1,IF(ISNUMBER(SEARCH($AK$422,'Hide this - Workings'!D40)),1,0),\"\")","v":""},{"$f":"IF($AL$423=1,IF(ISNUMBER(SEARCH($AK$423,'Hide this - Workings'!D40)),1,0),\"\")","v":""},{"$f":"IF($AL$424=1,IF(ISNUMBER(SEARCH($AK$424,'Hide this - Workings'!D40)),1,0),\"\")","v":""},{"$f":"IF($AL$425=1,IF(ISNUMBER(SEARCH($AK$425,'Hide this - Workings'!D40)),1,0),\"\")","v":""},{"$f":"IF($AL$426=1,IF(ISNUMBER(SEARCH($AK$426,'Hide this - Workings'!D40)),1,0),\"\")","v":""},{"$f":"IF($AL$427=1,IF(ISNUMBER(SEARCH($AK$427,'Hide this - Workings'!D40)),1,0),\"\")","v":""},{"$f":"IF($AL$428=1,IF(ISNUMBER(SEARCH($AK$428,'Hide this - Workings'!D40)),1,0),\"\")","v":""},{"$f":"IF($AL$429=1,IF(ISNUMBER(SEARCH($AK$429,'Hide this - Workings'!D40)),1,0),\"\")","v":""},{"$f":"IF($AL$430=1,IF(ISNUMBER(SEARCH($AK$430,'Hide this - Workings'!D40)),1,0),\"\")","v":""},{"$f":"IF($AL$431=1,IF(ISNUMBER(SEARCH($AK$431,'Hide this - Workings'!D40)),1,0),\"\")","v":""},{"$f":"IF($AL$432=1,IF(ISNUMBER(SEARCH($AK$432,'Hide this - Workings'!D40)),1,0),\"\")","v":""},{"$f":"IF($AL$433=1,IF(ISNUMBER(SEARCH($AK$433,'Hide this - Workings'!D40)),1,0),\"\")","v":""},0,"A036",0,"Should people who receive services only from health be included in the return? [STS004] \nIf a person has had a joint assessment, where both their health and social care needs assessed, or an assessment just from social care services only, and they go onto receive a service from social care only, health only, or health and social care, then they should be included on the return. The important element for inclusion is that there must be a social care element to the assessment. \n","Should people who receive services only from health be included in the return? [STS004]","\nIf a person has had a joint assessment, where both their health and social care needs assessed, or an assessment just from social care services only, and they go onto receive a service from social care only, health only, or health and social care, then they should be included on the return. The important element for inclusion is that there must be a social care element to the assessment. \n"]
[null,null,"","If the rehabilitation is provided jointly, with the majority provided by a PCT and only 10% by social services, should councils only include 10% of cases? [STS004] No. They should include all cases as it is a joint indicator. The individual must though have had a multi-disciplinary assessment, and have received services aimed at rehabilitation / reablement with an expectation that the patient will return home.",null,null,null,null,null,null,null,"If the rehabilitation is provided jointly, with the majority provided by a PCT and only 10% by social services, should councils only include 10% of cases? [STS004]","No. They should include all cases as it is a joint indicator. The individual must though have had a multi-disciplinary assessment, and have received services aimed at rehabilitation / reablement with an expectation that the patient will return home.",{"$f":"IF($AL$417=1,IF(ISNUMBER(SEARCH($AK$417,'Hide this - Workings'!D41)),1,0),\"\")","v":""},{"$f":"IF($AL$418=1,IF(ISNUMBER(SEARCH($AK$418,'Hide this - Workings'!D41)),1,0),\"\")","v":""},{"$f":"IF($AL$419=1,IF(ISNUMBER(SEARCH($AK$419,'Hide this - Workings'!D41)),1,0),\"\")","v":""},{"$f":"IF($AL$420=1,IF(ISNUMBER(SEARCH($AK$420,'Hide this - Workings'!D41)),1,0),\"\")","v":""},{"$f":"IF($AL$421=1,IF(ISNUMBER(SEARCH($AK$421,'Hide this - Workings'!D41)),1,0),\"\")","v":""},{"$f":"IF($AL$422=1,IF(ISNUMBER(SEARCH($AK$422,'Hide this - Workings'!D41)),1,0),\"\")","v":""},{"$f":"IF($AL$423=1,IF(ISNUMBER(SEARCH($AK$423,'Hide this - Workings'!D41)),1,0),\"\")","v":""},{"$f":"IF($AL$424=1,IF(ISNUMBER(SEARCH($AK$424,'Hide this - Workings'!D41)),1,0),\"\")","v":""},{"$f":"IF($AL$425=1,IF(ISNUMBER(SEARCH($AK$425,'Hide this - Workings'!D41)),1,0),\"\")","v":""},{"$f":"IF($AL$426=1,IF(ISNUMBER(SEARCH($AK$426,'Hide this - Workings'!D41)),1,0),\"\")","v":""},{"$f":"IF($AL$427=1,IF(ISNUMBER(SEARCH($AK$427,'Hide this - Workings'!D41)),1,0),\"\")","v":""},{"$f":"IF($AL$428=1,IF(ISNUMBER(SEARCH($AK$428,'Hide this - Workings'!D41)),1,0),\"\")","v":""},{"$f":"IF($AL$429=1,IF(ISNUMBER(SEARCH($AK$429,'Hide this - Workings'!D41)),1,0),\"\")","v":""},{"$f":"IF($AL$430=1,IF(ISNUMBER(SEARCH($AK$430,'Hide this - Workings'!D41)),1,0),\"\")","v":""},{"$f":"IF($AL$431=1,IF(ISNUMBER(SEARCH($AK$431,'Hide this - Workings'!D41)),1,0),\"\")","v":""},{"$f":"IF($AL$432=1,IF(ISNUMBER(SEARCH($AK$432,'Hide this - Workings'!D41)),1,0),\"\")","v":""},{"$f":"IF($AL$433=1,IF(ISNUMBER(SEARCH($AK$433,'Hide this - Workings'!D41)),1,0),\"\")","v":""},0,"A037",0,"If the rehabilitation is provided jointly, with the majority provided by a PCT and only 10% by social services, should councils only include 10% of cases? [STS004] No. They should include all cases as it is a joint indicator. The individual must though have had a multi-disciplinary assessment, and have received services aimed at rehabilitation / reablement with an expectation that the patient will return home.","If the rehabilitation is provided jointly, with the majority provided by a PCT and only 10% by social services, should councils only include 10% of cases? [STS004]","No. They should include all cases as it is a joint indicator. The individual must though have had a multi-disciplinary assessment, and have received services aimed at rehabilitation / reablement with an expectation that the patient will return home."]
[null,null,"","Should those people who died during the 91 days be excluded altogether from numerator and denominator? [STS004] No, they should be included in the denominator but not reported in the numerator.",null,null,null,null,null,null,null,"Should those people who died during the 91 days be excluded altogether from numerator and denominator? [STS004]","No, they should be included in the denominator but not reported in the numerator.",{"$f":"IF($AL$417=1,IF(ISNUMBER(SEARCH($AK$417,'Hide this - Workings'!D42)),1,0),\"\")","v":""},{"$f":"IF($AL$418=1,IF(ISNUMBER(SEARCH($AK$418,'Hide this - Workings'!D42)),1,0),\"\")","v":""},{"$f":"IF($AL$419=1,IF(ISNUMBER(SEARCH($AK$419,'Hide this - Workings'!D42)),1,0),\"\")","v":""},{"$f":"IF($AL$420=1,IF(ISNUMBER(SEARCH($AK$420,'Hide this - Workings'!D42)),1,0),\"\")","v":""},{"$f":"IF($AL$421=1,IF(ISNUMBER(SEARCH($AK$421,'Hide this - Workings'!D42)),1,0),\"\")","v":""},{"$f":"IF($AL$422=1,IF(ISNUMBER(SEARCH($AK$422,'Hide this - Workings'!D42)),1,0),\"\")","v":""},{"$f":"IF($AL$423=1,IF(ISNUMBER(SEARCH($AK$423,'Hide this - Workings'!D42)),1,0),\"\")","v":""},{"$f":"IF($AL$424=1,IF(ISNUMBER(SEARCH($AK$424,'Hide this - Workings'!D42)),1,0),\"\")","v":""},{"$f":"IF($AL$425=1,IF(ISNUMBER(SEARCH($AK$425,'Hide this - Workings'!D42)),1,0),\"\")","v":""},{"$f":"IF($AL$426=1,IF(ISNUMBER(SEARCH($AK$426,'Hide this - Workings'!D42)),1,0),\"\")","v":""},{"$f":"IF($AL$427=1,IF(ISNUMBER(SEARCH($AK$427,'Hide this - Workings'!D42)),1,0),\"\")","v":""},{"$f":"IF($AL$428=1,IF(ISNUMBER(SEARCH($AK$428,'Hide this - Workings'!D42)),1,0),\"\")","v":""},{"$f":"IF($AL$429=1,IF(ISNUMBER(SEARCH($AK$429,'Hide this - Workings'!D42)),1,0),\"\")","v":""},{"$f":"IF($AL$430=1,IF(ISNUMBER(SEARCH($AK$430,'Hide this - Workings'!D42)),1,0),\"\")","v":""},{"$f":"IF($AL$431=1,IF(ISNUMBER(SEARCH($AK$431,'Hide this - Workings'!D42)),1,0),\"\")","v":""},{"$f":"IF($AL$432=1,IF(ISNUMBER(SEARCH($AK$432,'Hide this - Workings'!D42)),1,0),\"\")","v":""},{"$f":"IF($AL$433=1,IF(ISNUMBER(SEARCH($AK$433,'Hide this - Workings'!D42)),1,0),\"\")","v":""},0,"A038",0,"Should those people who died during the 91 days be excluded altogether from numerator and denominator? [STS004] No, they should be included in the denominator but not reported in the numerator.","Should those people who died during the 91 days be excluded altogether from numerator and denominator? [STS004]","No, they should be included in the denominator but not reported in the numerator."]
[null,null,"","There are sometimes occasions where there are not enough reablement beds for clients (who are flagged to receive reablement services) to move into immediately when they are discharged from hospital. These clients can be moved into ‘regular’ care home beds and may start their reablement services a couple of weeks (or more) after their hospital discharge. In these cases should the start date of the 91 day period for STS004 (and ASCOF 2B) be the date of hospital discharge or the start of the reablement? As ASCOF measure 2B is trying to measure the outcome of the rehabilitation service, the clock should start when the person starts their rehabilitation service.\nIt would be helpful if you could include information within the Comments section at the end of the return about the number of hospital discharges that are delayed in this way.",null,null,null,null,null,null,null,"There are sometimes occasions where there are not enough reablement beds for clients (who are flagged to receive reablement services) to move into immediately when they are discharged from hospital. These clients can be moved into ‘regular’ care home beds and may start their reablement services a couple of weeks (or more) after their hospital discharge. In these cases should the start date of the 91 day period for STS004 (and ASCOF 2B) be the date of hospital discharge or the start of the reablement?","As ASCOF measure 2B is trying to measure the outcome of the rehabilitation service, the clock should start when the person starts their rehabilitation service.\nIt would be helpful if you could include information within the Comments section at the end of the return about the number of hospital discharges that are delayed in this way.",{"$f":"IF($AL$417=1,IF(ISNUMBER(SEARCH($AK$417,'Hide this - Workings'!D43)),1,0),\"\")","v":""},{"$f":"IF($AL$418=1,IF(ISNUMBER(SEARCH($AK$418,'Hide this - Workings'!D43)),1,0),\"\")","v":""},{"$f":"IF($AL$419=1,IF(ISNUMBER(SEARCH($AK$419,'Hide this - Workings'!D43)),1,0),\"\")","v":""},{"$f":"IF($AL$420=1,IF(ISNUMBER(SEARCH($AK$420,'Hide this - Workings'!D43)),1,0),\"\")","v":""},{"$f":"IF($AL$421=1,IF(ISNUMBER(SEARCH($AK$421,'Hide this - Workings'!D43)),1,0),\"\")","v":""},{"$f":"IF($AL$422=1,IF(ISNUMBER(SEARCH($AK$422,'Hide this - Workings'!D43)),1,0),\"\")","v":""},{"$f":"IF($AL$423=1,IF(ISNUMBER(SEARCH($AK$423,'Hide this - Workings'!D43)),1,0),\"\")","v":""},{"$f":"IF($AL$424=1,IF(ISNUMBER(SEARCH($AK$424,'Hide this - Workings'!D43)),1,0),\"\")","v":""},{"$f":"IF($AL$425=1,IF(ISNUMBER(SEARCH($AK$425,'Hide this - Workings'!D43)),1,0),\"\")","v":""},{"$f":"IF($AL$426=1,IF(ISNUMBER(SEARCH($AK$426,'Hide this - Workings'!D43)),1,0),\"\")","v":""},{"$f":"IF($AL$427=1,IF(ISNUMBER(SEARCH($AK$427,'Hide this - Workings'!D43)),1,0),\"\")","v":""},{"$f":"IF($AL$428=1,IF(ISNUMBER(SEARCH($AK$428,'Hide this - Workings'!D43)),1,0),\"\")","v":""},{"$f":"IF($AL$429=1,IF(ISNUMBER(SEARCH($AK$429,'Hide this - Workings'!D43)),1,0),\"\")","v":""},{"$f":"IF($AL$430=1,IF(ISNUMBER(SEARCH($AK$430,'Hide this - Workings'!D43)),1,0),\"\")","v":""},{"$f":"IF($AL$431=1,IF(ISNUMBER(SEARCH($AK$431,'Hide this - Workings'!D43)),1,0),\"\")","v":""},{"$f":"IF($AL$432=1,IF(ISNUMBER(SEARCH($AK$432,'Hide this - Workings'!D43)),1,0),\"\")","v":""},{"$f":"IF($AL$433=1,IF(ISNUMBER(SEARCH($AK$433,'Hide this - Workings'!D43)),1,0),\"\")","v":""},0,"A039",0,"There are sometimes occasions where there are not enough reablement beds for clients (who are flagged to receive reablement services) to move into immediately when they are discharged from hospital. These clients can be moved into ‘regular’ care home beds and may start their reablement services a couple of weeks (or more) after their hospital discharge. In these cases should the start date of the 91 day period for STS004 (and ASCOF 2B) be the date of hospital discharge or the start of the reablement? As ASCOF measure 2B is trying to measure the outcome of the rehabilitation service, the clock should start when the person starts their rehabilitation service.\nIt would be helpful if you could include information within the Comments section at the end of the return about the number of hospital discharges that are delayed in this way.","There are sometimes occasions where there are not enough reablement beds for clients (who are flagged to receive reablement services) to move into immediately when they are discharged from hospital. These clients can be moved into ‘regular’ care home beds and may start their reablement services a couple of weeks (or more) after their hospital discharge. In these cases should the start date of the 91 day period for STS004 (and ASCOF 2B) be the date of hospital discharge or the start of the reablement?","As ASCOF measure 2B is trying to measure the outcome of the rehabilitation service, the clock should start when the person starts their rehabilitation service.\nIt would be helpful if you could include information within the Comments section at the end of the return about the number of hospital discharges that are delayed in this way."]
[null,null,"","We have a question about ST-Max and the reablement/rehabilitation work captured in STS004. Are they the same? STS004 is an older measure that was included in an earlier collection prior to SALT. The scope of ‘reablement/rehabilitation’ is wider than ST-Max because it includes work done by Health teams (although the social care needs of the client must have been assessed and addressed) as well as joint teams and social-care only teams. The interventions are frequently shorter than those in ST-Max and may serve more of an immediate, crisis intervention to enable a smoother hospital discharge. ST-Max services frequently occur for someone making a request for support from the community. However, there is a good degree of overlap, and it is possible to check STS001 total sequels (for over 65s, Route of Access ‘Discharge from Hospital’, sequel of ST-Max) and divide this number by 4 to get an approximate number of clients provided with ST-Max from hospital in one quarter. Because the STS004 data also covers one quarter, these numbers might be expected to be very roughly equal, although this is not a validation check or requirement. It also doesn’t account for any STS004 clients who are ‘existing clients’ in SALT terms.",null,null,null,null,null,null,null,"We have a question about ST-Max and the reablement/rehabilitation work captured in STS004. Are they the same?","STS004 is an older measure that was included in an earlier collection prior to SALT. The scope of ‘reablement/rehabilitation’ is wider than ST-Max because it includes work done by Health teams (although the social care needs of the client must have been assessed and addressed) as well as joint teams and social-care only teams. The interventions are frequently shorter than those in ST-Max and may serve more of an immediate, crisis intervention to enable a smoother hospital discharge. ST-Max services frequently occur for someone making a request for support from the community. However, there is a good degree of overlap, and it is possible to check STS001 total sequels (for over 65s, Route of Access ‘Discharge from Hospital’, sequel of ST-Max) and divide this number by 4 to get an approximate number of clients provided with ST-Max from hospital in one quarter. Because the STS004 data also covers one quarter, these numbers might be expected to be very roughly equal, although this is not a validation check or requirement. It also doesn’t account for any STS004 clients who are ‘existing clients’ in SALT terms.",{"$f":"IF($AL$417=1,IF(ISNUMBER(SEARCH($AK$417,'Hide this - Workings'!D44)),1,0),\"\")","v":""},{"$f":"IF($AL$418=1,IF(ISNUMBER(SEARCH($AK$418,'Hide this - Workings'!D44)),1,0),\"\")","v":""},{"$f":"IF($AL$419=1,IF(ISNUMBER(SEARCH($AK$419,'Hide this - Workings'!D44)),1,0),\"\")","v":""},{"$f":"IF($AL$420=1,IF(ISNUMBER(SEARCH($AK$420,'Hide this - Workings'!D44)),1,0),\"\")","v":""},{"$f":"IF($AL$421=1,IF(ISNUMBER(SEARCH($AK$421,'Hide this - Workings'!D44)),1,0),\"\")","v":""},{"$f":"IF($AL$422=1,IF(ISNUMBER(SEARCH($AK$422,'Hide this - Workings'!D44)),1,0),\"\")","v":""},{"$f":"IF($AL$423=1,IF(ISNUMBER(SEARCH($AK$423,'Hide this - Workings'!D44)),1,0),\"\")","v":""},{"$f":"IF($AL$424=1,IF(ISNUMBER(SEARCH($AK$424,'Hide this - Workings'!D44)),1,0),\"\")","v":""},{"$f":"IF($AL$425=1,IF(ISNUMBER(SEARCH($AK$425,'Hide this - Workings'!D44)),1,0),\"\")","v":""},{"$f":"IF($AL$426=1,IF(ISNUMBER(SEARCH($AK$426,'Hide this - Workings'!D44)),1,0),\"\")","v":""},{"$f":"IF($AL$427=1,IF(ISNUMBER(SEARCH($AK$427,'Hide this - Workings'!D44)),1,0),\"\")","v":""},{"$f":"IF($AL$428=1,IF(ISNUMBER(SEARCH($AK$428,'Hide this - Workings'!D44)),1,0),\"\")","v":""},{"$f":"IF($AL$429=1,IF(ISNUMBER(SEARCH($AK$429,'Hide this - Workings'!D44)),1,0),\"\")","v":""},{"$f":"IF($AL$430=1,IF(ISNUMBER(SEARCH($AK$430,'Hide this - Workings'!D44)),1,0),\"\")","v":""},{"$f":"IF($AL$431=1,IF(ISNUMBER(SEARCH($AK$431,'Hide this - Workings'!D44)),1,0),\"\")","v":""},{"$f":"IF($AL$432=1,IF(ISNUMBER(SEARCH($AK$432,'Hide this - Workings'!D44)),1,0),\"\")","v":""},{"$f":"IF($AL$433=1,IF(ISNUMBER(SEARCH($AK$433,'Hide this - Workings'!D44)),1,0),\"\")","v":""},0,"A040",0,"We have a question about ST-Max and the reablement/rehabilitation work captured in STS004. Are they the same? STS004 is an older measure that was included in an earlier collection prior to SALT. The scope of ‘reablement/rehabilitation’ is wider than ST-Max because it includes work done by Health teams (although the social care needs of the client must have been assessed and addressed) as well as joint teams and social-care only teams. The interventions are frequently shorter than those in ST-Max and may serve more of an immediate, crisis intervention to enable a smoother hospital discharge. ST-Max services frequently occur for someone making a request for support from the community. However, there is a good degree of overlap, and it is possible to check STS001 total sequels (for over 65s, Route of Access ‘Discharge from Hospital’, sequel of ST-Max) and divide this number by 4 to get an approximate number of clients provided with ST-Max from hospital in one quarter. Because the STS004 data also covers one quarter, these numbers might be expected to be very roughly equal, although this is not a validation check or requirement. It also doesn’t account for any STS004 clients who are ‘existing clients’ in SALT terms.","We have a question about ST-Max and the reablement/rehabilitation work captured in STS004. Are they the same?","STS004 is an older measure that was included in an earlier collection prior to SALT. The scope of ‘reablement/rehabilitation’ is wider than ST-Max because it includes work done by Health teams (although the social care needs of the client must have been assessed and addressed) as well as joint teams and social-care only teams. The interventions are frequently shorter than those in ST-Max and may serve more of an immediate, crisis intervention to enable a smoother hospital discharge. ST-Max services frequently occur for someone making a request for support from the community. However, there is a good degree of overlap, and it is possible to check STS001 total sequels (for over 65s, Route of Access ‘Discharge from Hospital’, sequel of ST-Max) and divide this number by 4 to get an approximate number of clients provided with ST-Max from hospital in one quarter. Because the STS004 data also covers one quarter, these numbers might be expected to be very roughly equal, although this is not a validation check or requirement. It also doesn’t account for any STS004 clients who are ‘existing clients’ in SALT terms."]
[null,null,"","Could you please explain where Day Care would be recorded in the SALT return? Day care may appear within several SALT tables, both as a long term service and as a sequel to requests for support or short term care to maximise independence.\nFor clients to be included within the long term support tables the following criteria must apply:\na) The support “is provided or commissioned by social services or an NHS health partner under Section 75 Agreements and must be part of a care / support plan following an assessment.” (See ‘Who to include / exclude?’ section for measure LTS001a).\nb) The support “encompasses services provided with the intention of maintaining quality of life for an individual on an ongoing basis, and which has been allocated on the basis of eligibility criteria / policies…”.(see ‘General Description’ section for measure LTS001a).\nIf these criteria are matched then day care should be reported according to the guidance on the hierarchy specified in the ‘Support Setting / Delivery Mechanism’ section of LTS001a.\nDay care may also be put in place after a period of short term care to maximise independence. In this case it may be reported within the STS002a tables as sequel ‘Long Term Support (any setting)’. Sequels to short term care to maximise independence for new clients are reported as according to the hierarchy detailed in the ‘Where More than One Sequel Applies’ section of STS002a. For STS002b day care would be captured under one of the 'no change in setting' sequels, depending on whether the day care represents an increase/decrease in the level of long term support. .\nFinally day care may be put in place as a result of a request for support from a new client. In this instance it would appear in STS001 as a sequel to the request for support. Within table STS001 care is reported according to the hierarchy detailed in the ‘Hierarchy of Sequels’ section of STS001.",null,null,null,null,null,null,null,"Could you please explain where Day Care would be recorded in the SALT return?","Day care may appear within several SALT tables, both as a long term service and as a sequel to requests for support or short term care to maximise independence.\nFor clients to be included within the long term support tables the following criteria must apply:\na) The support “is provided or commissioned by social services or an NHS health partner under Section 75 Agreements and must be part of a care / support plan following an assessment.” (See ‘Who to include / exclude?’ section for measure LTS001a).\nb) The support “encompasses services provided with the intention of maintaining quality of life for an individual on an ongoing basis, and which has been allocated on the basis of eligibility criteria / policies…”.(see ‘General Description’ section for measure LTS001a).\nIf these criteria are matched then day care should be reported according to the guidance on the hierarchy specified in the ‘Support Setting / Delivery Mechanism’ section of LTS001a.\nDay care may also be put in place after a period of short term care to maximise independence. In this case it may be reported within the STS002a tables as sequel ‘Long Term Support (any setting)’. Sequels to short term care to maximise independence for new clients are reported as according to the hierarchy detailed in the ‘Where More than One Sequel Applies’ section of STS002a. For STS002b day care would be captured under one of the 'no change in setting' sequels, depending on whether the day care represents an increase/decrease in the level of long term support. .\nFinally day care may be put in place as a result of a request for support from a new client. In this instance it would appear in STS001 as a sequel to the request for support. Within table STS001 care is reported according to the hierarchy detailed in the ‘Hierarchy of Sequels’ section of STS001.",{"$f":"IF($AL$417=1,IF(ISNUMBER(SEARCH($AK$417,'Hide this - Workings'!D45)),1,0),\"\")","v":""},{"$f":"IF($AL$418=1,IF(ISNUMBER(SEARCH($AK$418,'Hide this - Workings'!D45)),1,0),\"\")","v":""},{"$f":"IF($AL$419=1,IF(ISNUMBER(SEARCH($AK$419,'Hide this - Workings'!D45)),1,0),\"\")","v":""},{"$f":"IF($AL$420=1,IF(ISNUMBER(SEARCH($AK$420,'Hide this - Workings'!D45)),1,0),\"\")","v":""},{"$f":"IF($AL$421=1,IF(ISNUMBER(SEARCH($AK$421,'Hide this - Workings'!D45)),1,0),\"\")","v":""},{"$f":"IF($AL$422=1,IF(ISNUMBER(SEARCH($AK$422,'Hide this - Workings'!D45)),1,0),\"\")","v":""},{"$f":"IF($AL$423=1,IF(ISNUMBER(SEARCH($AK$423,'Hide this - Workings'!D45)),1,0),\"\")","v":""},{"$f":"IF($AL$424=1,IF(ISNUMBER(SEARCH($AK$424,'Hide this - Workings'!D45)),1,0),\"\")","v":""},{"$f":"IF($AL$425=1,IF(ISNUMBER(SEARCH($AK$425,'Hide this - Workings'!D45)),1,0),\"\")","v":""},{"$f":"IF($AL$426=1,IF(ISNUMBER(SEARCH($AK$426,'Hide this - Workings'!D45)),1,0),\"\")","v":""},{"$f":"IF($AL$427=1,IF(ISNUMBER(SEARCH($AK$427,'Hide this - Workings'!D45)),1,0),\"\")","v":""},{"$f":"IF($AL$428=1,IF(ISNUMBER(SEARCH($AK$428,'Hide this - Workings'!D45)),1,0),\"\")","v":""},{"$f":"IF($AL$429=1,IF(ISNUMBER(SEARCH($AK$429,'Hide this - Workings'!D45)),1,0),\"\")","v":""},{"$f":"IF($AL$430=1,IF(ISNUMBER(SEARCH($AK$430,'Hide this - Workings'!D45)),1,0),\"\")","v":""},{"$f":"IF($AL$431=1,IF(ISNUMBER(SEARCH($AK$431,'Hide this - Workings'!D45)),1,0),\"\")","v":""},{"$f":"IF($AL$432=1,IF(ISNUMBER(SEARCH($AK$432,'Hide this - Workings'!D45)),1,0),\"\")","v":""},{"$f":"IF($AL$433=1,IF(ISNUMBER(SEARCH($AK$433,'Hide this - Workings'!D45)),1,0),\"\")","v":""},0,"A041",0,"Could you please explain where Day Care would be recorded in the SALT return? Day care may appear within several SALT tables, both as a long term service and as a sequel to requests for support or short term care to maximise independence.\nFor clients to be included within the long term support tables the following criteria must apply:\na) The support “is provided or commissioned by social services or an NHS health partner under Section 75 Agreements and must be part of a care / support plan following an assessment.” (See ‘Who to include / exclude?’ section for measure LTS001a).\nb) The support “encompasses services provided with the intention of maintaining quality of life for an individual on an ongoing basis, and which has been allocated on the basis of eligibility criteria / policies…”.(see ‘General Description’ section for measure LTS001a).\nIf these criteria are matched then day care should be reported according to the guidance on the hierarchy specified in the ‘Support Setting / Delivery Mechanism’ section of LTS001a.\nDay care may also be put in place after a period of short term care to maximise independence. In this case it may be reported within the STS002a tables as sequel ‘Long Term Support (any setting)’. Sequels to short term care to maximise independence for new clients are reported as according to the hierarchy detailed in the ‘Where More than One Sequel Applies’ section of STS002a. For STS002b day care would be captured under one of the 'no change in setting' sequels, depending on whether the day care represents an increase/decrease in the level of long term support. .\nFinally day care may be put in place as a result of a request for support from a new client. In this instance it would appear in STS001 as a sequel to the request for support. Within table STS001 care is reported according to the hierarchy detailed in the ‘Hierarchy of Sequels’ section of STS001.","Could you please explain where Day Care would be recorded in the SALT return?","Day care may appear within several SALT tables, both as a long term service and as a sequel to requests for support or short term care to maximise independence.\nFor clients to be included within the long term support tables the following criteria must apply:\na) The support “is provided or commissioned by social services or an NHS health partner under Section 75 Agreements and must be part of a care / support plan following an assessment.” (See ‘Who to include / exclude?’ section for measure LTS001a).\nb) The support “encompasses services provided with the intention of maintaining quality of life for an individual on an ongoing basis, and which has been allocated on the basis of eligibility criteria / policies…”.(see ‘General Description’ section for measure LTS001a).\nIf these criteria are matched then day care should be reported according to the guidance on the hierarchy specified in the ‘Support Setting / Delivery Mechanism’ section of LTS001a.\nDay care may also be put in place after a period of short term care to maximise independence. In this case it may be reported within the STS002a tables as sequel ‘Long Term Support (any setting)’. Sequels to short term care to maximise independence for new clients are reported as according to the hierarchy detailed in the ‘Where More than One Sequel Applies’ section of STS002a. For STS002b day care would be captured under one of the 'no change in setting' sequels, depending on whether the day care represents an increase/decrease in the level of long term support. .\nFinally day care may be put in place as a result of a request for support from a new client. In this instance it would appear in STS001 as a sequel to the request for support. Within table STS001 care is reported according to the hierarchy detailed in the ‘Hierarchy of Sequels’ section of STS001."]
[null,null,"","Is Mental Health work included in SALT? Yes, if it includes a social care component. In the same way that such activity would be included STS001 in relation to sequels to requests for support measures LTS001a/b/c should also include this work as long as the other criteria for inclusion in the LTS tables are met. If you have joint health and social services teams (operating a partnership under Section 75 Agreements) then work completed by mental health teams should be included, providing this includes a social care element and the work could lead to social care services.",null,null,null,null,null,null,null,"Is Mental Health work included in SALT?","Yes, if it includes a social care component. In the same way that such activity would be included STS001 in relation to sequels to requests for support measures LTS001a/b/c should also include this work as long as the other criteria for inclusion in the LTS tables are met. If you have joint health and social services teams (operating a partnership under Section 75 Agreements) then work completed by mental health teams should be included, providing this includes a social care element and the work could lead to social care services.",{"$f":"IF($AL$417=1,IF(ISNUMBER(SEARCH($AK$417,'Hide this - Workings'!D46)),1,0),\"\")","v":""},{"$f":"IF($AL$418=1,IF(ISNUMBER(SEARCH($AK$418,'Hide this - Workings'!D46)),1,0),\"\")","v":""},{"$f":"IF($AL$419=1,IF(ISNUMBER(SEARCH($AK$419,'Hide this - Workings'!D46)),1,0),\"\")","v":""},{"$f":"IF($AL$420=1,IF(ISNUMBER(SEARCH($AK$420,'Hide this - Workings'!D46)),1,0),\"\")","v":""},{"$f":"IF($AL$421=1,IF(ISNUMBER(SEARCH($AK$421,'Hide this - Workings'!D46)),1,0),\"\")","v":""},{"$f":"IF($AL$422=1,IF(ISNUMBER(SEARCH($AK$422,'Hide this - Workings'!D46)),1,0),\"\")","v":""},{"$f":"IF($AL$423=1,IF(ISNUMBER(SEARCH($AK$423,'Hide this - Workings'!D46)),1,0),\"\")","v":""},{"$f":"IF($AL$424=1,IF(ISNUMBER(SEARCH($AK$424,'Hide this - Workings'!D46)),1,0),\"\")","v":""},{"$f":"IF($AL$425=1,IF(ISNUMBER(SEARCH($AK$425,'Hide this - Workings'!D46)),1,0),\"\")","v":""},{"$f":"IF($AL$426=1,IF(ISNUMBER(SEARCH($AK$426,'Hide this - Workings'!D46)),1,0),\"\")","v":""},{"$f":"IF($AL$427=1,IF(ISNUMBER(SEARCH($AK$427,'Hide this - Workings'!D46)),1,0),\"\")","v":""},{"$f":"IF($AL$428=1,IF(ISNUMBER(SEARCH($AK$428,'Hide this - Workings'!D46)),1,0),\"\")","v":""},{"$f":"IF($AL$429=1,IF(ISNUMBER(SEARCH($AK$429,'Hide this - Workings'!D46)),1,0),\"\")","v":""},{"$f":"IF($AL$430=1,IF(ISNUMBER(SEARCH($AK$430,'Hide this - Workings'!D46)),1,0),\"\")","v":""},{"$f":"IF($AL$431=1,IF(ISNUMBER(SEARCH($AK$431,'Hide this - Workings'!D46)),1,0),\"\")","v":""},{"$f":"IF($AL$432=1,IF(ISNUMBER(SEARCH($AK$432,'Hide this - Workings'!D46)),1,0),\"\")","v":""},{"$f":"IF($AL$433=1,IF(ISNUMBER(SEARCH($AK$433,'Hide this - Workings'!D46)),1,0),\"\")","v":""},0,"A042",0,"Is Mental Health work included in SALT? Yes, if it includes a social care component. In the same way that such activity would be included STS001 in relation to sequels to requests for support measures LTS001a/b/c should also include this work as long as the other criteria for inclusion in the LTS tables are met. If you have joint health and social services teams (operating a partnership under Section 75 Agreements) then work completed by mental health teams should be included, providing this includes a social care element and the work could lead to social care services.","Is Mental Health work included in SALT?","Yes, if it includes a social care component. In the same way that such activity would be included STS001 in relation to sequels to requests for support measures LTS001a/b/c should also include this work as long as the other criteria for inclusion in the LTS tables are met. If you have joint health and social services teams (operating a partnership under Section 75 Agreements) then work completed by mental health teams should be included, providing this includes a social care element and the work could lead to social care services."]
[null,null,"","How should we treat supported accommodation services in SALT? If the supported housing service is provided by the housing department or other agencies, it should be excluded from SALT.",null,null,null,null,null,null,null,"How should we treat supported accommodation services in SALT?","If the supported housing service is provided by the housing department or other agencies, it should be excluded from SALT.",{"$f":"IF($AL$417=1,IF(ISNUMBER(SEARCH($AK$417,'Hide this - Workings'!D47)),1,0),\"\")","v":""},{"$f":"IF($AL$418=1,IF(ISNUMBER(SEARCH($AK$418,'Hide this - Workings'!D47)),1,0),\"\")","v":""},{"$f":"IF($AL$419=1,IF(ISNUMBER(SEARCH($AK$419,'Hide this - Workings'!D47)),1,0),\"\")","v":""},{"$f":"IF($AL$420=1,IF(ISNUMBER(SEARCH($AK$420,'Hide this - Workings'!D47)),1,0),\"\")","v":""},{"$f":"IF($AL$421=1,IF(ISNUMBER(SEARCH($AK$421,'Hide this - Workings'!D47)),1,0),\"\")","v":""},{"$f":"IF($AL$422=1,IF(ISNUMBER(SEARCH($AK$422,'Hide this - Workings'!D47)),1,0),\"\")","v":""},{"$f":"IF($AL$423=1,IF(ISNUMBER(SEARCH($AK$423,'Hide this - Workings'!D47)),1,0),\"\")","v":""},{"$f":"IF($AL$424=1,IF(ISNUMBER(SEARCH($AK$424,'Hide this - Workings'!D47)),1,0),\"\")","v":""},{"$f":"IF($AL$425=1,IF(ISNUMBER(SEARCH($AK$425,'Hide this - Workings'!D47)),1,0),\"\")","v":""},{"$f":"IF($AL$426=1,IF(ISNUMBER(SEARCH($AK$426,'Hide this - Workings'!D47)),1,0),\"\")","v":""},{"$f":"IF($AL$427=1,IF(ISNUMBER(SEARCH($AK$427,'Hide this - Workings'!D47)),1,0),\"\")","v":""},{"$f":"IF($AL$428=1,IF(ISNUMBER(SEARCH($AK$428,'Hide this - Workings'!D47)),1,0),\"\")","v":""},{"$f":"IF($AL$429=1,IF(ISNUMBER(SEARCH($AK$429,'Hide this - Workings'!D47)),1,0),\"\")","v":""},{"$f":"IF($AL$430=1,IF(ISNUMBER(SEARCH($AK$430,'Hide this - Workings'!D47)),1,0),\"\")","v":""},{"$f":"IF($AL$431=1,IF(ISNUMBER(SEARCH($AK$431,'Hide this - Workings'!D47)),1,0),\"\")","v":""},{"$f":"IF($AL$432=1,IF(ISNUMBER(SEARCH($AK$432,'Hide this - Workings'!D47)),1,0),\"\")","v":""},{"$f":"IF($AL$433=1,IF(ISNUMBER(SEARCH($AK$433,'Hide this - Workings'!D47)),1,0),\"\")","v":""},0,"A043",0,"How should we treat supported accommodation services in SALT? If the supported housing service is provided by the housing department or other agencies, it should be excluded from SALT.","How should we treat supported accommodation services in SALT?","If the supported housing service is provided by the housing department or other agencies, it should be excluded from SALT."]
[null,null,"","Wat happens if a client who starts the year with a fully cash personal budget then begins to receive some additional council commissioned care in what becomes a mixed personal budget? How do we capture this in the LTS measures? The 'hierarchy' applies to all LTS measures but the above scenario will be captured differently in each LTS measure depending on the circumstances.\nIn LTS001a the client would be reported within the column headed ‘Direct Payment Only’ as this was the highest category in the hierarchy to apply during the year. If the personal budget you describe is still in place on 31st March, then in LTS001b the client would appear in the column 'Part Direct Payment' because at the end of the year, this is the highest category which applies to their personal budget of mixed cash and commissioned services. Similarly, if support had been in place continuously for more than 12 months, the same 'Part Direct Payment' category would apply for LTS001c. ",null,null,null,null,null,null,null,"Wat happens if a client who starts the year with a fully cash personal budget then begins to receive some additional council commissioned care in what becomes a mixed personal budget? How do we capture this in the LTS measures?","The 'hierarchy' applies to all LTS measures but the above scenario will be captured differently in each LTS measure depending on the circumstances.\nIn LTS001a the client would be reported within the column headed ‘Direct Payment Only’ as this was the highest category in the hierarchy to apply during the year. If the personal budget you describe is still in place on 31st March, then in LTS001b the client would appear in the column 'Part Direct Payment' because at the end of the year, this is the highest category which applies to their personal budget of mixed cash and commissioned services. Similarly, if support had been in place continuously for more than 12 months, the same 'Part Direct Payment' category would apply for LTS001c. ",{"$f":"IF($AL$417=1,IF(ISNUMBER(SEARCH($AK$417,'Hide this - Workings'!D48)),1,0),\"\")","v":""},{"$f":"IF($AL$418=1,IF(ISNUMBER(SEARCH($AK$418,'Hide this - Workings'!D48)),1,0),\"\")","v":""},{"$f":"IF($AL$419=1,IF(ISNUMBER(SEARCH($AK$419,'Hide this - Workings'!D48)),1,0),\"\")","v":""},{"$f":"IF($AL$420=1,IF(ISNUMBER(SEARCH($AK$420,'Hide this - Workings'!D48)),1,0),\"\")","v":""},{"$f":"IF($AL$421=1,IF(ISNUMBER(SEARCH($AK$421,'Hide this - Workings'!D48)),1,0),\"\")","v":""},{"$f":"IF($AL$422=1,IF(ISNUMBER(SEARCH($AK$422,'Hide this - Workings'!D48)),1,0),\"\")","v":""},{"$f":"IF($AL$423=1,IF(ISNUMBER(SEARCH($AK$423,'Hide this - Workings'!D48)),1,0),\"\")","v":""},{"$f":"IF($AL$424=1,IF(ISNUMBER(SEARCH($AK$424,'Hide this - Workings'!D48)),1,0),\"\")","v":""},{"$f":"IF($AL$425=1,IF(ISNUMBER(SEARCH($AK$425,'Hide this - Workings'!D48)),1,0),\"\")","v":""},{"$f":"IF($AL$426=1,IF(ISNUMBER(SEARCH($AK$426,'Hide this - Workings'!D48)),1,0),\"\")","v":""},{"$f":"IF($AL$427=1,IF(ISNUMBER(SEARCH($AK$427,'Hide this - Workings'!D48)),1,0),\"\")","v":""},{"$f":"IF($AL$428=1,IF(ISNUMBER(SEARCH($AK$428,'Hide this - Workings'!D48)),1,0),\"\")","v":""},{"$f":"IF($AL$429=1,IF(ISNUMBER(SEARCH($AK$429,'Hide this - Workings'!D48)),1,0),\"\")","v":""},{"$f":"IF($AL$430=1,IF(ISNUMBER(SEARCH($AK$430,'Hide this - Workings'!D48)),1,0),\"\")","v":""},{"$f":"IF($AL$431=1,IF(ISNUMBER(SEARCH($AK$431,'Hide this - Workings'!D48)),1,0),\"\")","v":""},{"$f":"IF($AL$432=1,IF(ISNUMBER(SEARCH($AK$432,'Hide this - Workings'!D48)),1,0),\"\")","v":""},{"$f":"IF($AL$433=1,IF(ISNUMBER(SEARCH($AK$433,'Hide this - Workings'!D48)),1,0),\"\")","v":""},0,"A044",0,"Wat happens if a client who starts the year with a fully cash personal budget then begins to receive some additional council commissioned care in what becomes a mixed personal budget? How do we capture this in the LTS measures? The 'hierarchy' applies to all LTS measures but the above scenario will be captured differently in each LTS measure depending on the circumstances.\nIn LTS001a the client would be reported within the column headed ‘Direct Payment Only’ as this was the highest category in the hierarchy to apply during the year. If the personal budget you describe is still in place on 31st March, then in LTS001b the client would appear in the column 'Part Direct Payment' because at the end of the year, this is the highest category which applies to their personal budget of mixed cash and commissioned services. Similarly, if support had been in place continuously for more than 12 months, the same 'Part Direct Payment' category would apply for LTS001c. ","Wat happens if a client who starts the year with a fully cash personal budget then begins to receive some additional council commissioned care in what becomes a mixed personal budget? How do we capture this in the LTS measures?","The 'hierarchy' applies to all LTS measures but the above scenario will be captured differently in each LTS measure depending on the circumstances.\nIn LTS001a the client would be reported within the column headed ‘Direct Payment Only’ as this was the highest category in the hierarchy to apply during the year. If the personal budget you describe is still in place on 31st March, then in LTS001b the client would appear in the column 'Part Direct Payment' because at the end of the year, this is the highest category which applies to their personal budget of mixed cash and commissioned services. Similarly, if support had been in place continuously for more than 12 months, the same 'Part Direct Payment' category would apply for LTS001c. "]
[null,null,"","The SALT guidance mentions professional support - could you provide some more guidance as to the types of activity categorised this way? In particular could you provide some guidance on why mental health professional support is treated differently? [LTS001a, LTS001b, LTS001c] Professional support describes a broad range of input from operational social work staff which is put in place over and above the process of assessment, care commissioning and review. For a client to be considered as having professional support, the service must be included as part of their care plan. It typically occurs when the care manager goes on working with the client after the care management process has been completed (as part of the care plan/package), or another professional is involved to provide active, on-going support which may take the form of therapy, support or professional input, e.g., counselling.\nActive Professional Support could be for example a support professional telephoning a client on a weekly basis to ask how things are and discuss any issues the client might have. In contrast to the client having a phone number that they could call if they felt there was anything they would like to discuss - this would be more ‘passive’ support.\nMental health professional support is treated differently for the purposes of inclusion in measure LTS001 than for clients with a different primary support reason. With SALT, we have moved towards a consideration of long vs. short term support and 'preventative' vs. 'treatment' interventions. Mental health support tends to be significant in terms of cost, intensity and duration. Support might be required for months at a time or longer, meets council eligibility criteria and necessitates drawing up a support plan for the client. Therefore it was agreed that where such criteria are met, support to mental health clients should be treated as long term support in SALT and be included in the LTS001 measure. Including the work being done by mental health trusts in this way will therefore appropriately represent the degree to which clients with significant mental health support needs are being assisted to remain in the community and allow capture of both the duration and outcomes for those clients (e.g., through the sequels to review, inclusion in the user survey etc.).\n",null,null,null,null,null,null,null,"The SALT guidance mentions professional support - could you provide some more guidance as to the types of activity categorised this way? In particular could you provide some guidance on why mental health professional support is treated differently? [LTS001a, LTS001b, LTS001c]","Professional support describes a broad range of input from operational social work staff which is put in place over and above the process of assessment, care commissioning and review. For a client to be considered as having professional support, the service must be included as part of their care plan. It typically occurs when the care manager goes on working with the client after the care management process has been completed (as part of the care plan/package), or another professional is involved to provide active, on-going support which may take the form of therapy, support or professional input, e.g., counselling.\nActive Professional Support could be for example a support professional telephoning a client on a weekly basis to ask how things are and discuss any issues the client might have. In contrast to the client having a phone number that they could call if they felt there was anything they would like to discuss - this would be more ‘passive’ support.\nMental health professional support is treated differently for the purposes of inclusion in measure LTS001 than for clients with a different primary support reason. With SALT, we have moved towards a consideration of long vs. short term support and 'preventative' vs. 'treatment' interventions. Mental health support tends to be significant in terms of cost, intensity and duration. Support might be required for months at a time or longer, meets council eligibility criteria and necessitates drawing up a support plan for the client. Therefore it was agreed that where such criteria are met, support to mental health clients should be treated as long term support in SALT and be included in the LTS001 measure. Including the work being done by mental health trusts in this way will therefore appropriately represent the degree to which clients with significant mental health support needs are being assisted to remain in the community and allow capture of both the duration and outcomes for those clients (e.g., through the sequels to review, inclusion in the user survey etc.).\n",{"$f":"IF($AL$417=1,IF(ISNUMBER(SEARCH($AK$417,'Hide this - Workings'!D49)),1,0),\"\")","v":""},{"$f":"IF($AL$418=1,IF(ISNUMBER(SEARCH($AK$418,'Hide this - Workings'!D49)),1,0),\"\")","v":""},{"$f":"IF($AL$419=1,IF(ISNUMBER(SEARCH($AK$419,'Hide this - Workings'!D49)),1,0),\"\")","v":""},{"$f":"IF($AL$420=1,IF(ISNUMBER(SEARCH($AK$420,'Hide this - Workings'!D49)),1,0),\"\")","v":""},{"$f":"IF($AL$421=1,IF(ISNUMBER(SEARCH($AK$421,'Hide this - Workings'!D49)),1,0),\"\")","v":""},{"$f":"IF($AL$422=1,IF(ISNUMBER(SEARCH($AK$422,'Hide this - Workings'!D49)),1,0),\"\")","v":""},{"$f":"IF($AL$423=1,IF(ISNUMBER(SEARCH($AK$423,'Hide this - Workings'!D49)),1,0),\"\")","v":""},{"$f":"IF($AL$424=1,IF(ISNUMBER(SEARCH($AK$424,'Hide this - Workings'!D49)),1,0),\"\")","v":""},{"$f":"IF($AL$425=1,IF(ISNUMBER(SEARCH($AK$425,'Hide this - Workings'!D49)),1,0),\"\")","v":""},{"$f":"IF($AL$426=1,IF(ISNUMBER(SEARCH($AK$426,'Hide this - Workings'!D49)),1,0),\"\")","v":""},{"$f":"IF($AL$427=1,IF(ISNUMBER(SEARCH($AK$427,'Hide this - Workings'!D49)),1,0),\"\")","v":""},{"$f":"IF($AL$428=1,IF(ISNUMBER(SEARCH($AK$428,'Hide this - Workings'!D49)),1,0),\"\")","v":""},{"$f":"IF($AL$429=1,IF(ISNUMBER(SEARCH($AK$429,'Hide this - Workings'!D49)),1,0),\"\")","v":""},{"$f":"IF($AL$430=1,IF(ISNUMBER(SEARCH($AK$430,'Hide this - Workings'!D49)),1,0),\"\")","v":""},{"$f":"IF($AL$431=1,IF(ISNUMBER(SEARCH($AK$431,'Hide this - Workings'!D49)),1,0),\"\")","v":""},{"$f":"IF($AL$432=1,IF(ISNUMBER(SEARCH($AK$432,'Hide this - Workings'!D49)),1,0),\"\")","v":""},{"$f":"IF($AL$433=1,IF(ISNUMBER(SEARCH($AK$433,'Hide this - Workings'!D49)),1,0),\"\")","v":""},{"$f":"SUM(N49:AD49)","v":0},"A045",{"$f":"AE49","v":0},"The SALT guidance mentions professional support - could you provide some more guidance as to the types of activity categorised this way? In particular could you provide some guidance on why mental health professional support is treated differently? [LTS001a, LTS001b, LTS001c] Professional support describes a broad range of input from operational social work staff which is put in place over and above the process of assessment, care commissioning and review. For a client to be considered as having professional support, the service must be included as part of their care plan. It typically occurs when the care manager goes on working with the client after the care management process has been completed (as part of the care plan/package), or another professional is involved to provide active, on-going support which may take the form of therapy, support or professional input, e.g., counselling.\nActive Professional Support could be for example a support professional telephoning a client on a weekly basis to ask how things are and discuss any issues the client might have. In contrast to the client having a phone number that they could call if they felt there was anything they would like to discuss - this would be more ‘passive’ support.\nMental health professional support is treated differently for the purposes of inclusion in measure LTS001 than for clients with a different primary support reason. With SALT, we have moved towards a consideration of long vs. short term support and 'preventative' vs. 'treatment' interventions. Mental health support tends to be significant in terms of cost, intensity and duration. Support might be required for months at a time or longer, meets council eligibility criteria and necessitates drawing up a support plan for the client. Therefore it was agreed that where such criteria are met, support to mental health clients should be treated as long term support in SALT and be included in the LTS001 measure. Including the work being done by mental health trusts in this way will therefore appropriately represent the degree to which clients with significant mental health support needs are being assisted to remain in the community and allow capture of both the duration and outcomes for those clients (e.g., through the sequels to review, inclusion in the user survey etc.).\n","The SALT guidance mentions professional support - could you provide some more guidance as to the types of activity categorised this way? In particular could you provide some guidance on why mental health professional support is treated differently? [LTS001a, LTS001b, LTS001c]","Professional support describes a broad range of input from operational social work staff which is put in place over and above the process of assessment, care commissioning and review. For a client to be considered as having professional support, the service must be included as part of their care plan. It typically occurs when the care manager goes on working with the client after the care management process has been completed (as part of the care plan/package), or another professional is involved to provide active, on-going support which may take the form of therapy, support or professional input, e.g., counselling.\nActive Professional Support could be for example a support professional telephoning a client on a weekly basis to ask how things are and discuss any issues the client might have. In contrast to the client having a phone number that they could call if they felt there was anything they would like to discuss - this would be more ‘passive’ support.\nMental health professional support is treated differently for the purposes of inclusion in measure LTS001 than for clients with a different primary support reason. With SALT, we have moved towards a consideration of long vs. short term support and 'preventative' vs. 'treatment' interventions. Mental health support tends to be significant in terms of cost, intensity and duration. Support might be required for months at a time or longer, meets council eligibility criteria and necessitates drawing up a support plan for the client. Therefore it was agreed that where such criteria are met, support to mental health clients should be treated as long term support in SALT and be included in the LTS001 measure. Including the work being done by mental health trusts in this way will therefore appropriately represent the degree to which clients with significant mental health support needs are being assisted to remain in the community and allow capture of both the duration and outcomes for those clients (e.g., through the sequels to review, inclusion in the user survey etc.).\n"]
[null,null,"","Where within the SALT return should permanent adult placements be recorded? Adult placements are referenced as ‘Shared Lives (scheme)’ within SALT. Shared Lives is referenced as an accommodation category within SALT measure LTS004 which collects data on the accommodation status of adults with learning disabilities. Clients in shared lives arrangements will appear elsewhere in SALT as part of long term support arrangements and reviews, or sequels to requests for support and ST-Max. They are always recorded as being in a 'community' setting.",null,null,null,null,null,null,null,"Where within the SALT return should permanent adult placements be recorded?","Adult placements are referenced as ‘Shared Lives (scheme)’ within SALT. Shared Lives is referenced as an accommodation category within SALT measure LTS004 which collects data on the accommodation status of adults with learning disabilities. Clients in shared lives arrangements will appear elsewhere in SALT as part of long term support arrangements and reviews, or sequels to requests for support and ST-Max. They are always recorded as being in a 'community' setting.",{"$f":"IF($AL$417=1,IF(ISNUMBER(SEARCH($AK$417,'Hide this - Workings'!D50)),1,0),\"\")","v":""},{"$f":"IF($AL$418=1,IF(ISNUMBER(SEARCH($AK$418,'Hide this - Workings'!D50)),1,0),\"\")","v":""},{"$f":"IF($AL$419=1,IF(ISNUMBER(SEARCH($AK$419,'Hide this - Workings'!D50)),1,0),\"\")","v":""},{"$f":"IF($AL$420=1,IF(ISNUMBER(SEARCH($AK$420,'Hide this - Workings'!D50)),1,0),\"\")","v":""},{"$f":"IF($AL$421=1,IF(ISNUMBER(SEARCH($AK$421,'Hide this - Workings'!D50)),1,0),\"\")","v":""},{"$f":"IF($AL$422=1,IF(ISNUMBER(SEARCH($AK$422,'Hide this - Workings'!D50)),1,0),\"\")","v":""},{"$f":"IF($AL$423=1,IF(ISNUMBER(SEARCH($AK$423,'Hide this - Workings'!D50)),1,0),\"\")","v":""},{"$f":"IF($AL$424=1,IF(ISNUMBER(SEARCH($AK$424,'Hide this - Workings'!D50)),1,0),\"\")","v":""},{"$f":"IF($AL$425=1,IF(ISNUMBER(SEARCH($AK$425,'Hide this - Workings'!D50)),1,0),\"\")","v":""},{"$f":"IF($AL$426=1,IF(ISNUMBER(SEARCH($AK$426,'Hide this - Workings'!D50)),1,0),\"\")","v":""},{"$f":"IF($AL$427=1,IF(ISNUMBER(SEARCH($AK$427,'Hide this - Workings'!D50)),1,0),\"\")","v":""},{"$f":"IF($AL$428=1,IF(ISNUMBER(SEARCH($AK$428,'Hide this - Workings'!D50)),1,0),\"\")","v":""},{"$f":"IF($AL$429=1,IF(ISNUMBER(SEARCH($AK$429,'Hide this - Workings'!D50)),1,0),\"\")","v":""},{"$f":"IF($AL$430=1,IF(ISNUMBER(SEARCH($AK$430,'Hide this - Workings'!D50)),1,0),\"\")","v":""},{"$f":"IF($AL$431=1,IF(ISNUMBER(SEARCH($AK$431,'Hide this - Workings'!D50)),1,0),\"\")","v":""},{"$f":"IF($AL$432=1,IF(ISNUMBER(SEARCH($AK$432,'Hide this - Workings'!D50)),1,0),\"\")","v":""},{"$f":"IF($AL$433=1,IF(ISNUMBER(SEARCH($AK$433,'Hide this - Workings'!D50)),1,0),\"\")","v":""},0,"A046",0,"Where within the SALT return should permanent adult placements be recorded? Adult placements are referenced as ‘Shared Lives (scheme)’ within SALT. Shared Lives is referenced as an accommodation category within SALT measure LTS004 which collects data on the accommodation status of adults with learning disabilities. Clients in shared lives arrangements will appear elsewhere in SALT as part of long term support arrangements and reviews, or sequels to requests for support and ST-Max. They are always recorded as being in a 'community' setting.","Where within the SALT return should permanent adult placements be recorded?","Adult placements are referenced as ‘Shared Lives (scheme)’ within SALT. Shared Lives is referenced as an accommodation category within SALT measure LTS004 which collects data on the accommodation status of adults with learning disabilities. Clients in shared lives arrangements will appear elsewhere in SALT as part of long term support arrangements and reviews, or sequels to requests for support and ST-Max. They are always recorded as being in a 'community' setting."]
[null,null,"","I have a question regarding how to categorise direct payments for services that aren't a long term service. Should they be counted as a Long term community-based direct payment, or should they be categorised as a non-direct payment service of the same type? We occasionally give a direct payment for occupational therapy equipment, and more often for short professional support, short term placements or carers respite services. How should these payments be recorded? [LTS001] Direct payments for services that are not considered as long term in SALT should not be reported in SALT measure LTS001. Provision of equipment is not included in the SALT LTS measures so similarly, a direct payment made for a client to purchase equipment themselves would also not be included. As you suggest, the ways in which the payment is used might vary to include both purchase of equipment (which appears in SALT STS001 as ‘ongoing low level support’) or some sort of professional support (which appears in SALT as ‘short term support (other)’ etc. if you were able to report them as their STS ‘equivalents’ where they appear as sequels to STS events then you should do so. We appreciate though that this level of detail may not be easily achievable within some recording systems and as such it would be acceptable for you to report such payments as, ‘short term support (other)’.",null,null,null,null,null,null,null,"I have a question regarding how to categorise direct payments for services that aren't a long term service. Should they be counted as a Long term community-based direct payment, or should they be categorised as a non-direct payment service of the same type? We occasionally give a direct payment for occupational therapy equipment, and more often for short professional support, short term placements or carers respite services. How should these payments be recorded? [LTS001]","Direct payments for services that are not considered as long term in SALT should not be reported in SALT measure LTS001. Provision of equipment is not included in the SALT LTS measures so similarly, a direct payment made for a client to purchase equipment themselves would also not be included. As you suggest, the ways in which the payment is used might vary to include both purchase of equipment (which appears in SALT STS001 as ‘ongoing low level support’) or some sort of professional support (which appears in SALT as ‘short term support (other)’ etc. if you were able to report them as their STS ‘equivalents’ where they appear as sequels to STS events then you should do so. We appreciate though that this level of detail may not be easily achievable within some recording systems and as such it would be acceptable for you to report such payments as, ‘short term support (other)’.",{"$f":"IF($AL$417=1,IF(ISNUMBER(SEARCH($AK$417,'Hide this - Workings'!D51)),1,0),\"\")","v":""},{"$f":"IF($AL$418=1,IF(ISNUMBER(SEARCH($AK$418,'Hide this - Workings'!D51)),1,0),\"\")","v":""},{"$f":"IF($AL$419=1,IF(ISNUMBER(SEARCH($AK$419,'Hide this - Workings'!D51)),1,0),\"\")","v":""},{"$f":"IF($AL$420=1,IF(ISNUMBER(SEARCH($AK$420,'Hide this - Workings'!D51)),1,0),\"\")","v":""},{"$f":"IF($AL$421=1,IF(ISNUMBER(SEARCH($AK$421,'Hide this - Workings'!D51)),1,0),\"\")","v":""},{"$f":"IF($AL$422=1,IF(ISNUMBER(SEARCH($AK$422,'Hide this - Workings'!D51)),1,0),\"\")","v":""},{"$f":"IF($AL$423=1,IF(ISNUMBER(SEARCH($AK$423,'Hide this - Workings'!D51)),1,0),\"\")","v":""},{"$f":"IF($AL$424=1,IF(ISNUMBER(SEARCH($AK$424,'Hide this - Workings'!D51)),1,0),\"\")","v":""},{"$f":"IF($AL$425=1,IF(ISNUMBER(SEARCH($AK$425,'Hide this - Workings'!D51)),1,0),\"\")","v":""},{"$f":"IF($AL$426=1,IF(ISNUMBER(SEARCH($AK$426,'Hide this - Workings'!D51)),1,0),\"\")","v":""},{"$f":"IF($AL$427=1,IF(ISNUMBER(SEARCH($AK$427,'Hide this - Workings'!D51)),1,0),\"\")","v":""},{"$f":"IF($AL$428=1,IF(ISNUMBER(SEARCH($AK$428,'Hide this - Workings'!D51)),1,0),\"\")","v":""},{"$f":"IF($AL$429=1,IF(ISNUMBER(SEARCH($AK$429,'Hide this - Workings'!D51)),1,0),\"\")","v":""},{"$f":"IF($AL$430=1,IF(ISNUMBER(SEARCH($AK$430,'Hide this - Workings'!D51)),1,0),\"\")","v":""},{"$f":"IF($AL$431=1,IF(ISNUMBER(SEARCH($AK$431,'Hide this - Workings'!D51)),1,0),\"\")","v":""},{"$f":"IF($AL$432=1,IF(ISNUMBER(SEARCH($AK$432,'Hide this - Workings'!D51)),1,0),\"\")","v":""},{"$f":"IF($AL$433=1,IF(ISNUMBER(SEARCH($AK$433,'Hide this - Workings'!D51)),1,0),\"\")","v":""},0,"A047",0,"I have a question regarding how to categorise direct payments for services that aren't a long term service. Should they be counted as a Long term community-based direct payment, or should they be categorised as a non-direct payment service of the same type? We occasionally give a direct payment for occupational therapy equipment, and more often for short professional support, short term placements or carers respite services. How should these payments be recorded? [LTS001] Direct payments for services that are not considered as long term in SALT should not be reported in SALT measure LTS001. Provision of equipment is not included in the SALT LTS measures so similarly, a direct payment made for a client to purchase equipment themselves would also not be included. As you suggest, the ways in which the payment is used might vary to include both purchase of equipment (which appears in SALT STS001 as ‘ongoing low level support’) or some sort of professional support (which appears in SALT as ‘short term support (other)’ etc. if you were able to report them as their STS ‘equivalents’ where they appear as sequels to STS events then you should do so. We appreciate though that this level of detail may not be easily achievable within some recording systems and as such it would be acceptable for you to report such payments as, ‘short term support (other)’.","I have a question regarding how to categorise direct payments for services that aren't a long term service. Should they be counted as a Long term community-based direct payment, or should they be categorised as a non-direct payment service of the same type? We occasionally give a direct payment for occupational therapy equipment, and more often for short professional support, short term placements or carers respite services. How should these payments be recorded? [LTS001]","Direct payments for services that are not considered as long term in SALT should not be reported in SALT measure LTS001. Provision of equipment is not included in the SALT LTS measures so similarly, a direct payment made for a client to purchase equipment themselves would also not be included. As you suggest, the ways in which the payment is used might vary to include both purchase of equipment (which appears in SALT STS001 as ‘ongoing low level support’) or some sort of professional support (which appears in SALT as ‘short term support (other)’ etc. if you were able to report them as their STS ‘equivalents’ where they appear as sequels to STS events then you should do so. We appreciate though that this level of detail may not be easily achievable within some recording systems and as such it would be acceptable for you to report such payments as, ‘short term support (other)’."]
[null,null,"","We have a client in the community who started the year on a mixture of direct payments and council commissioned services (through a personal budget). By the end of the year they’d given up the direct payment and asked us to commission everything, using their personal budget allocation. How should this client be recorded in the hierarchy for LTS001a? Because the hierarchy looks across the whole of the year to find the first category of support that applies, you would choose ‘part direct payment’ because this did apply for part of the year.",null,null,null,null,null,null,null,"We have a client in the community who started the year on a mixture of direct payments and council commissioned services (through a personal budget). By the end of the year they’d given up the direct payment and asked us to commission everything, using their personal budget allocation. How should this client be recorded in the hierarchy for LTS001a?","Because the hierarchy looks across the whole of the year to find the first category of support that applies, you would choose ‘part direct payment’ because this did apply for part of the year.",{"$f":"IF($AL$417=1,IF(ISNUMBER(SEARCH($AK$417,'Hide this - Workings'!D52)),1,0),\"\")","v":""},{"$f":"IF($AL$418=1,IF(ISNUMBER(SEARCH($AK$418,'Hide this - Workings'!D52)),1,0),\"\")","v":""},{"$f":"IF($AL$419=1,IF(ISNUMBER(SEARCH($AK$419,'Hide this - Workings'!D52)),1,0),\"\")","v":""},{"$f":"IF($AL$420=1,IF(ISNUMBER(SEARCH($AK$420,'Hide this - Workings'!D52)),1,0),\"\")","v":""},{"$f":"IF($AL$421=1,IF(ISNUMBER(SEARCH($AK$421,'Hide this - Workings'!D52)),1,0),\"\")","v":""},{"$f":"IF($AL$422=1,IF(ISNUMBER(SEARCH($AK$422,'Hide this - Workings'!D52)),1,0),\"\")","v":""},{"$f":"IF($AL$423=1,IF(ISNUMBER(SEARCH($AK$423,'Hide this - Workings'!D52)),1,0),\"\")","v":""},{"$f":"IF($AL$424=1,IF(ISNUMBER(SEARCH($AK$424,'Hide this - Workings'!D52)),1,0),\"\")","v":""},{"$f":"IF($AL$425=1,IF(ISNUMBER(SEARCH($AK$425,'Hide this - Workings'!D52)),1,0),\"\")","v":""},{"$f":"IF($AL$426=1,IF(ISNUMBER(SEARCH($AK$426,'Hide this - Workings'!D52)),1,0),\"\")","v":""},{"$f":"IF($AL$427=1,IF(ISNUMBER(SEARCH($AK$427,'Hide this - Workings'!D52)),1,0),\"\")","v":""},{"$f":"IF($AL$428=1,IF(ISNUMBER(SEARCH($AK$428,'Hide this - Workings'!D52)),1,0),\"\")","v":""},{"$f":"IF($AL$429=1,IF(ISNUMBER(SEARCH($AK$429,'Hide this - Workings'!D52)),1,0),\"\")","v":""},{"$f":"IF($AL$430=1,IF(ISNUMBER(SEARCH($AK$430,'Hide this - Workings'!D52)),1,0),\"\")","v":""},{"$f":"IF($AL$431=1,IF(ISNUMBER(SEARCH($AK$431,'Hide this - Workings'!D52)),1,0),\"\")","v":""},{"$f":"IF($AL$432=1,IF(ISNUMBER(SEARCH($AK$432,'Hide this - Workings'!D52)),1,0),\"\")","v":""},{"$f":"IF($AL$433=1,IF(ISNUMBER(SEARCH($AK$433,'Hide this - Workings'!D52)),1,0),\"\")","v":""},0,"A048",0,"We have a client in the community who started the year on a mixture of direct payments and council commissioned services (through a personal budget). By the end of the year they’d given up the direct payment and asked us to commission everything, using their personal budget allocation. How should this client be recorded in the hierarchy for LTS001a? Because the hierarchy looks across the whole of the year to find the first category of support that applies, you would choose ‘part direct payment’ because this did apply for part of the year.","We have a client in the community who started the year on a mixture of direct payments and council commissioned services (through a personal budget). By the end of the year they’d given up the direct payment and asked us to commission everything, using their personal budget allocation. How should this client be recorded in the hierarchy for LTS001a?","Because the hierarchy looks across the whole of the year to find the first category of support that applies, you would choose ‘part direct payment’ because this did apply for part of the year."]
[null,null,"","We have a client in the residential care but during the year the home was deregistered and became a supported living facility (group home). The client was able to continue living there with additional onsite support (home care). How should we treat this client in LTS001a? Because during the year the client was in a Care Quality Commission registered home and residential care is higher up in the hierarchy than the community classified group home, the support setting should be ‘residential care’ for the purposes of LTS001a.",null,null,null,null,null,null,null,"We have a client in the residential care but during the year the home was deregistered and became a supported living facility (group home). The client was able to continue living there with additional onsite support (home care). How should we treat this client in LTS001a?","Because during the year the client was in a Care Quality Commission registered home and residential care is higher up in the hierarchy than the community classified group home, the support setting should be ‘residential care’ for the purposes of LTS001a.",{"$f":"IF($AL$417=1,IF(ISNUMBER(SEARCH($AK$417,'Hide this - Workings'!D53)),1,0),\"\")","v":""},{"$f":"IF($AL$418=1,IF(ISNUMBER(SEARCH($AK$418,'Hide this - Workings'!D53)),1,0),\"\")","v":""},{"$f":"IF($AL$419=1,IF(ISNUMBER(SEARCH($AK$419,'Hide this - Workings'!D53)),1,0),\"\")","v":""},{"$f":"IF($AL$420=1,IF(ISNUMBER(SEARCH($AK$420,'Hide this - Workings'!D53)),1,0),\"\")","v":""},{"$f":"IF($AL$421=1,IF(ISNUMBER(SEARCH($AK$421,'Hide this - Workings'!D53)),1,0),\"\")","v":""},{"$f":"IF($AL$422=1,IF(ISNUMBER(SEARCH($AK$422,'Hide this - Workings'!D53)),1,0),\"\")","v":""},{"$f":"IF($AL$423=1,IF(ISNUMBER(SEARCH($AK$423,'Hide this - Workings'!D53)),1,0),\"\")","v":""},{"$f":"IF($AL$424=1,IF(ISNUMBER(SEARCH($AK$424,'Hide this - Workings'!D53)),1,0),\"\")","v":""},{"$f":"IF($AL$425=1,IF(ISNUMBER(SEARCH($AK$425,'Hide this - Workings'!D53)),1,0),\"\")","v":""},{"$f":"IF($AL$426=1,IF(ISNUMBER(SEARCH($AK$426,'Hide this - Workings'!D53)),1,0),\"\")","v":""},{"$f":"IF($AL$427=1,IF(ISNUMBER(SEARCH($AK$427,'Hide this - Workings'!D53)),1,0),\"\")","v":""},{"$f":"IF($AL$428=1,IF(ISNUMBER(SEARCH($AK$428,'Hide this - Workings'!D53)),1,0),\"\")","v":""},{"$f":"IF($AL$429=1,IF(ISNUMBER(SEARCH($AK$429,'Hide this - Workings'!D53)),1,0),\"\")","v":""},{"$f":"IF($AL$430=1,IF(ISNUMBER(SEARCH($AK$430,'Hide this - Workings'!D53)),1,0),\"\")","v":""},{"$f":"IF($AL$431=1,IF(ISNUMBER(SEARCH($AK$431,'Hide this - Workings'!D53)),1,0),\"\")","v":""},{"$f":"IF($AL$432=1,IF(ISNUMBER(SEARCH($AK$432,'Hide this - Workings'!D53)),1,0),\"\")","v":""},{"$f":"IF($AL$433=1,IF(ISNUMBER(SEARCH($AK$433,'Hide this - Workings'!D53)),1,0),\"\")","v":""},0,"A049",0,"We have a client in the residential care but during the year the home was deregistered and became a supported living facility (group home). The client was able to continue living there with additional onsite support (home care). How should we treat this client in LTS001a? Because during the year the client was in a Care Quality Commission registered home and residential care is higher up in the hierarchy than the community classified group home, the support setting should be ‘residential care’ for the purposes of LTS001a.","We have a client in the residential care but during the year the home was deregistered and became a supported living facility (group home). The client was able to continue living there with additional onsite support (home care). How should we treat this client in LTS001a?","Because during the year the client was in a Care Quality Commission registered home and residential care is higher up in the hierarchy than the community classified group home, the support setting should be ‘residential care’ for the purposes of LTS001a."]
[null,null,"","We have a client in the community who started the year on a mixture of direct payments and council commissioned services (through a personal budget). By the end of the year they’d given up the direct payment and asked us to commission everything, using their personal budget allocation. How should this client be recorded in the hierarchy for LTS001b? LTS001b is only concerned with what support was being provided on 31st March. Because all the support was under a personal budget being managed by the CASSR, you would select ‘CASSR Managed Personal Budget’. ",null,null,null,null,null,null,null,"We have a client in the community who started the year on a mixture of direct payments and council commissioned services (through a personal budget). By the end of the year they’d given up the direct payment and asked us to commission everything, using their personal budget allocation. How should this client be recorded in the hierarchy for LTS001b?","LTS001b is only concerned with what support was being provided on 31st March. Because all the support was under a personal budget being managed by the CASSR, you would select ‘CASSR Managed Personal Budget’. ",{"$f":"IF($AL$417=1,IF(ISNUMBER(SEARCH($AK$417,'Hide this - Workings'!D54)),1,0),\"\")","v":""},{"$f":"IF($AL$418=1,IF(ISNUMBER(SEARCH($AK$418,'Hide this - Workings'!D54)),1,0),\"\")","v":""},{"$f":"IF($AL$419=1,IF(ISNUMBER(SEARCH($AK$419,'Hide this - Workings'!D54)),1,0),\"\")","v":""},{"$f":"IF($AL$420=1,IF(ISNUMBER(SEARCH($AK$420,'Hide this - Workings'!D54)),1,0),\"\")","v":""},{"$f":"IF($AL$421=1,IF(ISNUMBER(SEARCH($AK$421,'Hide this - Workings'!D54)),1,0),\"\")","v":""},{"$f":"IF($AL$422=1,IF(ISNUMBER(SEARCH($AK$422,'Hide this - Workings'!D54)),1,0),\"\")","v":""},{"$f":"IF($AL$423=1,IF(ISNUMBER(SEARCH($AK$423,'Hide this - Workings'!D54)),1,0),\"\")","v":""},{"$f":"IF($AL$424=1,IF(ISNUMBER(SEARCH($AK$424,'Hide this - Workings'!D54)),1,0),\"\")","v":""},{"$f":"IF($AL$425=1,IF(ISNUMBER(SEARCH($AK$425,'Hide this - Workings'!D54)),1,0),\"\")","v":""},{"$f":"IF($AL$426=1,IF(ISNUMBER(SEARCH($AK$426,'Hide this - Workings'!D54)),1,0),\"\")","v":""},{"$f":"IF($AL$427=1,IF(ISNUMBER(SEARCH($AK$427,'Hide this - Workings'!D54)),1,0),\"\")","v":""},{"$f":"IF($AL$428=1,IF(ISNUMBER(SEARCH($AK$428,'Hide this - Workings'!D54)),1,0),\"\")","v":""},{"$f":"IF($AL$429=1,IF(ISNUMBER(SEARCH($AK$429,'Hide this - Workings'!D54)),1,0),\"\")","v":""},{"$f":"IF($AL$430=1,IF(ISNUMBER(SEARCH($AK$430,'Hide this - Workings'!D54)),1,0),\"\")","v":""},{"$f":"IF($AL$431=1,IF(ISNUMBER(SEARCH($AK$431,'Hide this - Workings'!D54)),1,0),\"\")","v":""},{"$f":"IF($AL$432=1,IF(ISNUMBER(SEARCH($AK$432,'Hide this - Workings'!D54)),1,0),\"\")","v":""},{"$f":"IF($AL$433=1,IF(ISNUMBER(SEARCH($AK$433,'Hide this - Workings'!D54)),1,0),\"\")","v":""},{"$f":"SUM(N54:AD54)","v":0},"A050",{"$f":"AE54","v":0},"We have a client in the community who started the year on a mixture of direct payments and council commissioned services (through a personal budget). By the end of the year they’d given up the direct payment and asked us to commission everything, using their personal budget allocation. How should this client be recorded in the hierarchy for LTS001b? LTS001b is only concerned with what support was being provided on 31st March. Because all the support was under a personal budget being managed by the CASSR, you would select ‘CASSR Managed Personal Budget’. ","We have a client in the community who started the year on a mixture of direct payments and council commissioned services (through a personal budget). By the end of the year they’d given up the direct payment and asked us to commission everything, using their personal budget allocation. How should this client be recorded in the hierarchy for LTS001b?","LTS001b is only concerned with what support was being provided on 31st March. Because all the support was under a personal budget being managed by the CASSR, you would select ‘CASSR Managed Personal Budget’. "]
[null,null,"","We have a client in the residential care but during the year the home was deregistered and became a supported living facility (group home). The client was able to continue living there with additional onsite support (home care). How should we treat this client in LTS001b? Because by 31st March the support was based in the community (a home cannot be considered residential or nursing care unless it is registered with the Care Quality Commission) the arrangements being used for providing the care package needs to be considered in order to choose the right ‘delivery mechanism’. The support setting should be ‘community’.",null,null,null,null,null,null,null,"We have a client in the residential care but during the year the home was deregistered and became a supported living facility (group home). The client was able to continue living there with additional onsite support (home care). How should we treat this client in LTS001b?","Because by 31st March the support was based in the community (a home cannot be considered residential or nursing care unless it is registered with the Care Quality Commission) the arrangements being used for providing the care package needs to be considered in order to choose the right ‘delivery mechanism’. The support setting should be ‘community’.",{"$f":"IF($AL$417=1,IF(ISNUMBER(SEARCH($AK$417,'Hide this - Workings'!D55)),1,0),\"\")","v":""},{"$f":"IF($AL$418=1,IF(ISNUMBER(SEARCH($AK$418,'Hide this - Workings'!D55)),1,0),\"\")","v":""},{"$f":"IF($AL$419=1,IF(ISNUMBER(SEARCH($AK$419,'Hide this - Workings'!D55)),1,0),\"\")","v":""},{"$f":"IF($AL$420=1,IF(ISNUMBER(SEARCH($AK$420,'Hide this - Workings'!D55)),1,0),\"\")","v":""},{"$f":"IF($AL$421=1,IF(ISNUMBER(SEARCH($AK$421,'Hide this - Workings'!D55)),1,0),\"\")","v":""},{"$f":"IF($AL$422=1,IF(ISNUMBER(SEARCH($AK$422,'Hide this - Workings'!D55)),1,0),\"\")","v":""},{"$f":"IF($AL$423=1,IF(ISNUMBER(SEARCH($AK$423,'Hide this - Workings'!D55)),1,0),\"\")","v":""},{"$f":"IF($AL$424=1,IF(ISNUMBER(SEARCH($AK$424,'Hide this - Workings'!D55)),1,0),\"\")","v":""},{"$f":"IF($AL$425=1,IF(ISNUMBER(SEARCH($AK$425,'Hide this - Workings'!D55)),1,0),\"\")","v":""},{"$f":"IF($AL$426=1,IF(ISNUMBER(SEARCH($AK$426,'Hide this - Workings'!D55)),1,0),\"\")","v":""},{"$f":"IF($AL$427=1,IF(ISNUMBER(SEARCH($AK$427,'Hide this - Workings'!D55)),1,0),\"\")","v":""},{"$f":"IF($AL$428=1,IF(ISNUMBER(SEARCH($AK$428,'Hide this - Workings'!D55)),1,0),\"\")","v":""},{"$f":"IF($AL$429=1,IF(ISNUMBER(SEARCH($AK$429,'Hide this - Workings'!D55)),1,0),\"\")","v":""},{"$f":"IF($AL$430=1,IF(ISNUMBER(SEARCH($AK$430,'Hide this - Workings'!D55)),1,0),\"\")","v":""},{"$f":"IF($AL$431=1,IF(ISNUMBER(SEARCH($AK$431,'Hide this - Workings'!D55)),1,0),\"\")","v":""},{"$f":"IF($AL$432=1,IF(ISNUMBER(SEARCH($AK$432,'Hide this - Workings'!D55)),1,0),\"\")","v":""},{"$f":"IF($AL$433=1,IF(ISNUMBER(SEARCH($AK$433,'Hide this - Workings'!D55)),1,0),\"\")","v":""},0,"A051",0,"We have a client in the residential care but during the year the home was deregistered and became a supported living facility (group home). The client was able to continue living there with additional onsite support (home care). How should we treat this client in LTS001b? Because by 31st March the support was based in the community (a home cannot be considered residential or nursing care unless it is registered with the Care Quality Commission) the arrangements being used for providing the care package needs to be considered in order to choose the right ‘delivery mechanism’. The support setting should be ‘community’.","We have a client in the residential care but during the year the home was deregistered and became a supported living facility (group home). The client was able to continue living there with additional onsite support (home care). How should we treat this client in LTS001b?","Because by 31st March the support was based in the community (a home cannot be considered residential or nursing care unless it is registered with the Care Quality Commission) the arrangements being used for providing the care package needs to be considered in order to choose the right ‘delivery mechanism’. The support setting should be ‘community’."]
[null,null,"","If a client transfers from long term support in the community to long term support residential, should this person be counted as having continuous support for the purposes of measure LTS001c? Irrespective of the change in setting the authority will have been providing continuous support to the client, which fits with the definition within SALT for inclusion in measure LTS001c if the support is for longer than 12 months.",null,null,null,null,null,null,null,"If a client transfers from long term support in the community to long term support residential, should this person be counted as having continuous support for the purposes of measure LTS001c?","Irrespective of the change in setting the authority will have been providing continuous support to the client, which fits with the definition within SALT for inclusion in measure LTS001c if the support is for longer than 12 months.",{"$f":"IF($AL$417=1,IF(ISNUMBER(SEARCH($AK$417,'Hide this - Workings'!D56)),1,0),\"\")","v":""},{"$f":"IF($AL$418=1,IF(ISNUMBER(SEARCH($AK$418,'Hide this - Workings'!D56)),1,0),\"\")","v":""},{"$f":"IF($AL$419=1,IF(ISNUMBER(SEARCH($AK$419,'Hide this - Workings'!D56)),1,0),\"\")","v":""},{"$f":"IF($AL$420=1,IF(ISNUMBER(SEARCH($AK$420,'Hide this - Workings'!D56)),1,0),\"\")","v":""},{"$f":"IF($AL$421=1,IF(ISNUMBER(SEARCH($AK$421,'Hide this - Workings'!D56)),1,0),\"\")","v":""},{"$f":"IF($AL$422=1,IF(ISNUMBER(SEARCH($AK$422,'Hide this - Workings'!D56)),1,0),\"\")","v":""},{"$f":"IF($AL$423=1,IF(ISNUMBER(SEARCH($AK$423,'Hide this - Workings'!D56)),1,0),\"\")","v":""},{"$f":"IF($AL$424=1,IF(ISNUMBER(SEARCH($AK$424,'Hide this - Workings'!D56)),1,0),\"\")","v":""},{"$f":"IF($AL$425=1,IF(ISNUMBER(SEARCH($AK$425,'Hide this - Workings'!D56)),1,0),\"\")","v":""},{"$f":"IF($AL$426=1,IF(ISNUMBER(SEARCH($AK$426,'Hide this - Workings'!D56)),1,0),\"\")","v":""},{"$f":"IF($AL$427=1,IF(ISNUMBER(SEARCH($AK$427,'Hide this - Workings'!D56)),1,0),\"\")","v":""},{"$f":"IF($AL$428=1,IF(ISNUMBER(SEARCH($AK$428,'Hide this - Workings'!D56)),1,0),\"\")","v":""},{"$f":"IF($AL$429=1,IF(ISNUMBER(SEARCH($AK$429,'Hide this - Workings'!D56)),1,0),\"\")","v":""},{"$f":"IF($AL$430=1,IF(ISNUMBER(SEARCH($AK$430,'Hide this - Workings'!D56)),1,0),\"\")","v":""},{"$f":"IF($AL$431=1,IF(ISNUMBER(SEARCH($AK$431,'Hide this - Workings'!D56)),1,0),\"\")","v":""},{"$f":"IF($AL$432=1,IF(ISNUMBER(SEARCH($AK$432,'Hide this - Workings'!D56)),1,0),\"\")","v":""},{"$f":"IF($AL$433=1,IF(ISNUMBER(SEARCH($AK$433,'Hide this - Workings'!D56)),1,0),\"\")","v":""},0,"A052",0,"If a client transfers from long term support in the community to long term support residential, should this person be counted as having continuous support for the purposes of measure LTS001c? Irrespective of the change in setting the authority will have been providing continuous support to the client, which fits with the definition within SALT for inclusion in measure LTS001c if the support is for longer than 12 months.","If a client transfers from long term support in the community to long term support residential, should this person be counted as having continuous support for the purposes of measure LTS001c?","Irrespective of the change in setting the authority will have been providing continuous support to the client, which fits with the definition within SALT for inclusion in measure LTS001c if the support is for longer than 12 months."]
[null,null,"","We have clients whose care was interrupted during the year, but who would otherwise have had more than 12 months of service. Should we include them in LTS001c? You should include them if you consider the provision of support to be ‘continuous’, which can include some temporary interruptions. Typically this might occur when a client goes into hospital briefly, requests care to be suspended because they might need or want to stay away from home, receive respite care in a residential home in order to give their carer a break, etc.\nThere is no one way of handling this type of situation in local authorities, but there is a basic distinction between care which is temporarily ‘suspended’ and care which is ‘terminated’. In the latter case, there is no expectation that the care package would be restarted without the need to reassess need. Circumstances may be completely different after a client is discharged following a long stay in hospital. Their existing care package would be cancelled. Such a client would be considered ‘new’ for the purposes of SALT and not appear in LTS001c. For other clients with shorter interruptions to care packages, the council may judge the period of support to be continuous - but you should indicate through comments made in the end section of the LTS001c measure how you decided to include or exclude clients from the measure. For example, if you used a rule to exclude anyone with more than 4 consecutive weeks of suspended care from the figures, please tell us about that. If you based your counting on the commissioning records, which showed whether a client’s care package was suspended or terminated, state that in your end comments. In this way, NHS Digital will get a better understanding of how the figures in this measure were compiled, and be able to more clearly communicate how the data should be interpreted by those attempting to use it.",null,null,null,null,null,null,null,"We have clients whose care was interrupted during the year, but who would otherwise have had more than 12 months of service. Should we include them in LTS001c?","You should include them if you consider the provision of support to be ‘continuous’, which can include some temporary interruptions. Typically this might occur when a client goes into hospital briefly, requests care to be suspended because they might need or want to stay away from home, receive respite care in a residential home in order to give their carer a break, etc.\nThere is no one way of handling this type of situation in local authorities, but there is a basic distinction between care which is temporarily ‘suspended’ and care which is ‘terminated’. In the latter case, there is no expectation that the care package would be restarted without the need to reassess need. Circumstances may be completely different after a client is discharged following a long stay in hospital. Their existing care package would be cancelled. Such a client would be considered ‘new’ for the purposes of SALT and not appear in LTS001c. For other clients with shorter interruptions to care packages, the council may judge the period of support to be continuous - but you should indicate through comments made in the end section of the LTS001c measure how you decided to include or exclude clients from the measure. For example, if you used a rule to exclude anyone with more than 4 consecutive weeks of suspended care from the figures, please tell us about that. If you based your counting on the commissioning records, which showed whether a client’s care package was suspended or terminated, state that in your end comments. In this way, NHS Digital will get a better understanding of how the figures in this measure were compiled, and be able to more clearly communicate how the data should be interpreted by those attempting to use it.",{"$f":"IF($AL$417=1,IF(ISNUMBER(SEARCH($AK$417,'Hide this - Workings'!D57)),1,0),\"\")","v":""},{"$f":"IF($AL$418=1,IF(ISNUMBER(SEARCH($AK$418,'Hide this - Workings'!D57)),1,0),\"\")","v":""},{"$f":"IF($AL$419=1,IF(ISNUMBER(SEARCH($AK$419,'Hide this - Workings'!D57)),1,0),\"\")","v":""},{"$f":"IF($AL$420=1,IF(ISNUMBER(SEARCH($AK$420,'Hide this - Workings'!D57)),1,0),\"\")","v":""},{"$f":"IF($AL$421=1,IF(ISNUMBER(SEARCH($AK$421,'Hide this - Workings'!D57)),1,0),\"\")","v":""},{"$f":"IF($AL$422=1,IF(ISNUMBER(SEARCH($AK$422,'Hide this - Workings'!D57)),1,0),\"\")","v":""},{"$f":"IF($AL$423=1,IF(ISNUMBER(SEARCH($AK$423,'Hide this - Workings'!D57)),1,0),\"\")","v":""},{"$f":"IF($AL$424=1,IF(ISNUMBER(SEARCH($AK$424,'Hide this - Workings'!D57)),1,0),\"\")","v":""},{"$f":"IF($AL$425=1,IF(ISNUMBER(SEARCH($AK$425,'Hide this - Workings'!D57)),1,0),\"\")","v":""},{"$f":"IF($AL$426=1,IF(ISNUMBER(SEARCH($AK$426,'Hide this - Workings'!D57)),1,0),\"\")","v":""},{"$f":"IF($AL$427=1,IF(ISNUMBER(SEARCH($AK$427,'Hide this - Workings'!D57)),1,0),\"\")","v":""},{"$f":"IF($AL$428=1,IF(ISNUMBER(SEARCH($AK$428,'Hide this - Workings'!D57)),1,0),\"\")","v":""},{"$f":"IF($AL$429=1,IF(ISNUMBER(SEARCH($AK$429,'Hide this - Workings'!D57)),1,0),\"\")","v":""},{"$f":"IF($AL$430=1,IF(ISNUMBER(SEARCH($AK$430,'Hide this - Workings'!D57)),1,0),\"\")","v":""},{"$f":"IF($AL$431=1,IF(ISNUMBER(SEARCH($AK$431,'Hide this - Workings'!D57)),1,0),\"\")","v":""},{"$f":"IF($AL$432=1,IF(ISNUMBER(SEARCH($AK$432,'Hide this - Workings'!D57)),1,0),\"\")","v":""},{"$f":"IF($AL$433=1,IF(ISNUMBER(SEARCH($AK$433,'Hide this - Workings'!D57)),1,0),\"\")","v":""},0,"A053",0,"We have clients whose care was interrupted during the year, but who would otherwise have had more than 12 months of service. Should we include them in LTS001c? You should include them if you consider the provision of support to be ‘continuous’, which can include some temporary interruptions. Typically this might occur when a client goes into hospital briefly, requests care to be suspended because they might need or want to stay away from home, receive respite care in a residential home in order to give their carer a break, etc.\nThere is no one way of handling this type of situation in local authorities, but there is a basic distinction between care which is temporarily ‘suspended’ and care which is ‘terminated’. In the latter case, there is no expectation that the care package would be restarted without the need to reassess need. Circumstances may be completely different after a client is discharged following a long stay in hospital. Their existing care package would be cancelled. Such a client would be considered ‘new’ for the purposes of SALT and not appear in LTS001c. For other clients with shorter interruptions to care packages, the council may judge the period of support to be continuous - but you should indicate through comments made in the end section of the LTS001c measure how you decided to include or exclude clients from the measure. For example, if you used a rule to exclude anyone with more than 4 consecutive weeks of suspended care from the figures, please tell us about that. If you based your counting on the commissioning records, which showed whether a client’s care package was suspended or terminated, state that in your end comments. In this way, NHS Digital will get a better understanding of how the figures in this measure were compiled, and be able to more clearly communicate how the data should be interpreted by those attempting to use it.","We have clients whose care was interrupted during the year, but who would otherwise have had more than 12 months of service. Should we include them in LTS001c?","You should include them if you consider the provision of support to be ‘continuous’, which can include some temporary interruptions. Typically this might occur when a client goes into hospital briefly, requests care to be suspended because they might need or want to stay away from home, receive respite care in a residential home in order to give their carer a break, etc.\nThere is no one way of handling this type of situation in local authorities, but there is a basic distinction between care which is temporarily ‘suspended’ and care which is ‘terminated’. In the latter case, there is no expectation that the care package would be restarted without the need to reassess need. Circumstances may be completely different after a client is discharged following a long stay in hospital. Their existing care package would be cancelled. Such a client would be considered ‘new’ for the purposes of SALT and not appear in LTS001c. For other clients with shorter interruptions to care packages, the council may judge the period of support to be continuous - but you should indicate through comments made in the end section of the LTS001c measure how you decided to include or exclude clients from the measure. For example, if you used a rule to exclude anyone with more than 4 consecutive weeks of suspended care from the figures, please tell us about that. If you based your counting on the commissioning records, which showed whether a client’s care package was suspended or terminated, state that in your end comments. In this way, NHS Digital will get a better understanding of how the figures in this measure were compiled, and be able to more clearly communicate how the data should be interpreted by those attempting to use it."]
[null,null,"","Are we right in thinking that some reviews will not be captured and reported on with the new SALT return – in particular those completed for service users in services less than 12 months who have a planned review (i.e., planned 6 week reviews)? [LTS002a] You are right to identify that a number of reviews will not be collected in SALT.\nLTS002a is restricted to only unplanned reviews and those planned reviews resulting in a move to residential / nursing care. This does not prevent or discourage local authorities from recording 6-week or other planned reviews for local business management or other purposes. The data in SALT is intended to support priority areas in national policy and local benchmarking purposes.",null,null,null,null,null,null,null,"Are we right in thinking that some reviews will not be captured and reported on with the new SALT return – in particular those completed for service users in services less than 12 months who have a planned review (i.e., planned 6 week reviews)? [LTS002a]","You are right to identify that a number of reviews will not be collected in SALT.\nLTS002a is restricted to only unplanned reviews and those planned reviews resulting in a move to residential / nursing care. This does not prevent or discourage local authorities from recording 6-week or other planned reviews for local business management or other purposes. The data in SALT is intended to support priority areas in national policy and local benchmarking purposes.",{"$f":"IF($AL$417=1,IF(ISNUMBER(SEARCH($AK$417,'Hide this - Workings'!D58)),1,0),\"\")","v":""},{"$f":"IF($AL$418=1,IF(ISNUMBER(SEARCH($AK$418,'Hide this - Workings'!D58)),1,0),\"\")","v":""},{"$f":"IF($AL$419=1,IF(ISNUMBER(SEARCH($AK$419,'Hide this - Workings'!D58)),1,0),\"\")","v":""},{"$f":"IF($AL$420=1,IF(ISNUMBER(SEARCH($AK$420,'Hide this - Workings'!D58)),1,0),\"\")","v":""},{"$f":"IF($AL$421=1,IF(ISNUMBER(SEARCH($AK$421,'Hide this - Workings'!D58)),1,0),\"\")","v":""},{"$f":"IF($AL$422=1,IF(ISNUMBER(SEARCH($AK$422,'Hide this - Workings'!D58)),1,0),\"\")","v":""},{"$f":"IF($AL$423=1,IF(ISNUMBER(SEARCH($AK$423,'Hide this - Workings'!D58)),1,0),\"\")","v":""},{"$f":"IF($AL$424=1,IF(ISNUMBER(SEARCH($AK$424,'Hide this - Workings'!D58)),1,0),\"\")","v":""},{"$f":"IF($AL$425=1,IF(ISNUMBER(SEARCH($AK$425,'Hide this - Workings'!D58)),1,0),\"\")","v":""},{"$f":"IF($AL$426=1,IF(ISNUMBER(SEARCH($AK$426,'Hide this - Workings'!D58)),1,0),\"\")","v":""},{"$f":"IF($AL$427=1,IF(ISNUMBER(SEARCH($AK$427,'Hide this - Workings'!D58)),1,0),\"\")","v":""},{"$f":"IF($AL$428=1,IF(ISNUMBER(SEARCH($AK$428,'Hide this - Workings'!D58)),1,0),\"\")","v":""},{"$f":"IF($AL$429=1,IF(ISNUMBER(SEARCH($AK$429,'Hide this - Workings'!D58)),1,0),\"\")","v":""},{"$f":"IF($AL$430=1,IF(ISNUMBER(SEARCH($AK$430,'Hide this - Workings'!D58)),1,0),\"\")","v":""},{"$f":"IF($AL$431=1,IF(ISNUMBER(SEARCH($AK$431,'Hide this - Workings'!D58)),1,0),\"\")","v":""},{"$f":"IF($AL$432=1,IF(ISNUMBER(SEARCH($AK$432,'Hide this - Workings'!D58)),1,0),\"\")","v":""},{"$f":"IF($AL$433=1,IF(ISNUMBER(SEARCH($AK$433,'Hide this - Workings'!D58)),1,0),\"\")","v":""},0,"A054",0,"Are we right in thinking that some reviews will not be captured and reported on with the new SALT return – in particular those completed for service users in services less than 12 months who have a planned review (i.e., planned 6 week reviews)? [LTS002a] You are right to identify that a number of reviews will not be collected in SALT.\nLTS002a is restricted to only unplanned reviews and those planned reviews resulting in a move to residential / nursing care. This does not prevent or discourage local authorities from recording 6-week or other planned reviews for local business management or other purposes. The data in SALT is intended to support priority areas in national policy and local benchmarking purposes.","Are we right in thinking that some reviews will not be captured and reported on with the new SALT return – in particular those completed for service users in services less than 12 months who have a planned review (i.e., planned 6 week reviews)? [LTS002a]","You are right to identify that a number of reviews will not be collected in SALT.\nLTS002a is restricted to only unplanned reviews and those planned reviews resulting in a move to residential / nursing care. This does not prevent or discourage local authorities from recording 6-week or other planned reviews for local business management or other purposes. The data in SALT is intended to support priority areas in national policy and local benchmarking purposes."]
[null,null,"","How should I record the emergency short term provision of additional services for existing clients? These events would be followed up by an unscheduled review to determine the ongoing support needs. [LTS002a, LTS002b] SALT captures changes in care provision following review events. SALT would not capture changes to care provision in advance of a review, with the exception of sequels to ST-MAX provision in STS002b.\n",null,null,null,null,null,null,null,"How should I record the emergency short term provision of additional services for existing clients? These events would be followed up by an unscheduled review to determine the ongoing support needs. [LTS002a, LTS002b]","SALT captures changes in care provision following review events. SALT would not capture changes to care provision in advance of a review, with the exception of sequels to ST-MAX provision in STS002b.\n",{"$f":"IF($AL$417=1,IF(ISNUMBER(SEARCH($AK$417,'Hide this - Workings'!D59)),1,0),\"\")","v":""},{"$f":"IF($AL$418=1,IF(ISNUMBER(SEARCH($AK$418,'Hide this - Workings'!D59)),1,0),\"\")","v":""},{"$f":"IF($AL$419=1,IF(ISNUMBER(SEARCH($AK$419,'Hide this - Workings'!D59)),1,0),\"\")","v":""},{"$f":"IF($AL$420=1,IF(ISNUMBER(SEARCH($AK$420,'Hide this - Workings'!D59)),1,0),\"\")","v":""},{"$f":"IF($AL$421=1,IF(ISNUMBER(SEARCH($AK$421,'Hide this - Workings'!D59)),1,0),\"\")","v":""},{"$f":"IF($AL$422=1,IF(ISNUMBER(SEARCH($AK$422,'Hide this - Workings'!D59)),1,0),\"\")","v":""},{"$f":"IF($AL$423=1,IF(ISNUMBER(SEARCH($AK$423,'Hide this - Workings'!D59)),1,0),\"\")","v":""},{"$f":"IF($AL$424=1,IF(ISNUMBER(SEARCH($AK$424,'Hide this - Workings'!D59)),1,0),\"\")","v":""},{"$f":"IF($AL$425=1,IF(ISNUMBER(SEARCH($AK$425,'Hide this - Workings'!D59)),1,0),\"\")","v":""},{"$f":"IF($AL$426=1,IF(ISNUMBER(SEARCH($AK$426,'Hide this - Workings'!D59)),1,0),\"\")","v":""},{"$f":"IF($AL$427=1,IF(ISNUMBER(SEARCH($AK$427,'Hide this - Workings'!D59)),1,0),\"\")","v":""},{"$f":"IF($AL$428=1,IF(ISNUMBER(SEARCH($AK$428,'Hide this - Workings'!D59)),1,0),\"\")","v":""},{"$f":"IF($AL$429=1,IF(ISNUMBER(SEARCH($AK$429,'Hide this - Workings'!D59)),1,0),\"\")","v":""},{"$f":"IF($AL$430=1,IF(ISNUMBER(SEARCH($AK$430,'Hide this - Workings'!D59)),1,0),\"\")","v":""},{"$f":"IF($AL$431=1,IF(ISNUMBER(SEARCH($AK$431,'Hide this - Workings'!D59)),1,0),\"\")","v":""},{"$f":"IF($AL$432=1,IF(ISNUMBER(SEARCH($AK$432,'Hide this - Workings'!D59)),1,0),\"\")","v":""},{"$f":"IF($AL$433=1,IF(ISNUMBER(SEARCH($AK$433,'Hide this - Workings'!D59)),1,0),\"\")","v":""},0,"A055",0,"How should I record the emergency short term provision of additional services for existing clients? These events would be followed up by an unscheduled review to determine the ongoing support needs. [LTS002a, LTS002b] SALT captures changes in care provision following review events. SALT would not capture changes to care provision in advance of a review, with the exception of sequels to ST-MAX provision in STS002b.\n","How should I record the emergency short term provision of additional services for existing clients? These events would be followed up by an unscheduled review to determine the ongoing support needs. [LTS002a, LTS002b]","SALT captures changes in care provision following review events. SALT would not capture changes to care provision in advance of a review, with the exception of sequels to ST-MAX provision in STS002b.\n"]
[null,null,"","If a client with long term support falls down the stairs and is admitted to hospital, what would the Significant Event reason be? [LTS002a, LTS002b] The significant event 'Hospital (Planned and Unplanned episodes)' should be chosen, because it is the immediate event preceding review. Although a fall led to the admission to hospital, the pre-discharge review being carried out by social care is concerned with ensuring adequate support following the hospital treatment, which will depend how successful that treatment has been in reducing the client's on-going needs. If the fall had not required hospital admission and the review was being carried out as a direct response, then 'other reason' would be the appropriate significant event.\n",null,null,null,null,null,null,null,"If a client with long term support falls down the stairs and is admitted to hospital, what would the Significant Event reason be? [LTS002a, LTS002b]","The significant event 'Hospital (Planned and Unplanned episodes)' should be chosen, because it is the immediate event preceding review. Although a fall led to the admission to hospital, the pre-discharge review being carried out by social care is concerned with ensuring adequate support following the hospital treatment, which will depend how successful that treatment has been in reducing the client's on-going needs. If the fall had not required hospital admission and the review was being carried out as a direct response, then 'other reason' would be the appropriate significant event.\n",{"$f":"IF($AL$417=1,IF(ISNUMBER(SEARCH($AK$417,'Hide this - Workings'!D60)),1,0),\"\")","v":""},{"$f":"IF($AL$418=1,IF(ISNUMBER(SEARCH($AK$418,'Hide this - Workings'!D60)),1,0),\"\")","v":""},{"$f":"IF($AL$419=1,IF(ISNUMBER(SEARCH($AK$419,'Hide this - Workings'!D60)),1,0),\"\")","v":""},{"$f":"IF($AL$420=1,IF(ISNUMBER(SEARCH($AK$420,'Hide this - Workings'!D60)),1,0),\"\")","v":""},{"$f":"IF($AL$421=1,IF(ISNUMBER(SEARCH($AK$421,'Hide this - Workings'!D60)),1,0),\"\")","v":""},{"$f":"IF($AL$422=1,IF(ISNUMBER(SEARCH($AK$422,'Hide this - Workings'!D60)),1,0),\"\")","v":""},{"$f":"IF($AL$423=1,IF(ISNUMBER(SEARCH($AK$423,'Hide this - Workings'!D60)),1,0),\"\")","v":""},{"$f":"IF($AL$424=1,IF(ISNUMBER(SEARCH($AK$424,'Hide this - Workings'!D60)),1,0),\"\")","v":""},{"$f":"IF($AL$425=1,IF(ISNUMBER(SEARCH($AK$425,'Hide this - Workings'!D60)),1,0),\"\")","v":""},{"$f":"IF($AL$426=1,IF(ISNUMBER(SEARCH($AK$426,'Hide this - Workings'!D60)),1,0),\"\")","v":""},{"$f":"IF($AL$427=1,IF(ISNUMBER(SEARCH($AK$427,'Hide this - Workings'!D60)),1,0),\"\")","v":""},{"$f":"IF($AL$428=1,IF(ISNUMBER(SEARCH($AK$428,'Hide this - Workings'!D60)),1,0),\"\")","v":""},{"$f":"IF($AL$429=1,IF(ISNUMBER(SEARCH($AK$429,'Hide this - Workings'!D60)),1,0),\"\")","v":""},{"$f":"IF($AL$430=1,IF(ISNUMBER(SEARCH($AK$430,'Hide this - Workings'!D60)),1,0),\"\")","v":""},{"$f":"IF($AL$431=1,IF(ISNUMBER(SEARCH($AK$431,'Hide this - Workings'!D60)),1,0),\"\")","v":""},{"$f":"IF($AL$432=1,IF(ISNUMBER(SEARCH($AK$432,'Hide this - Workings'!D60)),1,0),\"\")","v":""},{"$f":"IF($AL$433=1,IF(ISNUMBER(SEARCH($AK$433,'Hide this - Workings'!D60)),1,0),\"\")","v":""},0,"A056",0,"If a client with long term support falls down the stairs and is admitted to hospital, what would the Significant Event reason be? [LTS002a, LTS002b] The significant event 'Hospital (Planned and Unplanned episodes)' should be chosen, because it is the immediate event preceding review. Although a fall led to the admission to hospital, the pre-discharge review being carried out by social care is concerned with ensuring adequate support following the hospital treatment, which will depend how successful that treatment has been in reducing the client's on-going needs. If the fall had not required hospital admission and the review was being carried out as a direct response, then 'other reason' would be the appropriate significant event.\n","If a client with long term support falls down the stairs and is admitted to hospital, what would the Significant Event reason be? [LTS002a, LTS002b]","The significant event 'Hospital (Planned and Unplanned episodes)' should be chosen, because it is the immediate event preceding review. Although a fall led to the admission to hospital, the pre-discharge review being carried out by social care is concerned with ensuring adequate support following the hospital treatment, which will depend how successful that treatment has been in reducing the client's on-going needs. If the fall had not required hospital admission and the review was being carried out as a direct response, then 'other reason' would be the appropriate significant event.\n"]
[null,null,"","Following review of a long term client in LTS001 the social worker arranges a residential care placement and this is recorded on our system however following financial assessment the client decides to pay privately for their placement and not to remain in contact with the local authority. Which of the following sequels should apply - All long term support ended or Change in setting – Move to residential care? [LTS002a, LTS002b] This client has become a self-funder, and therefore both the support setting and mechanism of service delivery will no longer be captured in any measure of the SALT return, because the local authority no longer provides, commissions or reviews that support. The change has taken place as part of the sequence of events used to determine the appropriate sequel to your review, so the correct sequel to use is 'All long term support ended'. Care should be taken in relation to clients who are placed in residential or nursing care subject to a 12 week disregard who after this period become self-funders, as all 12-week disregard arrangements must be reported as new long term admissions.\n",null,null,null,null,null,null,null,"Following review of a long term client in LTS001 the social worker arranges a residential care placement and this is recorded on our system however following financial assessment the client decides to pay privately for their placement and not to remain in contact with the local authority. Which of the following sequels should apply - All long term support ended or Change in setting – Move to residential care? [LTS002a, LTS002b]","This client has become a self-funder, and therefore both the support setting and mechanism of service delivery will no longer be captured in any measure of the SALT return, because the local authority no longer provides, commissions or reviews that support. The change has taken place as part of the sequence of events used to determine the appropriate sequel to your review, so the correct sequel to use is 'All long term support ended'. Care should be taken in relation to clients who are placed in residential or nursing care subject to a 12 week disregard who after this period become self-funders, as all 12-week disregard arrangements must be reported as new long term admissions.\n",{"$f":"IF($AL$417=1,IF(ISNUMBER(SEARCH($AK$417,'Hide this - Workings'!D61)),1,0),\"\")","v":""},{"$f":"IF($AL$418=1,IF(ISNUMBER(SEARCH($AK$418,'Hide this - Workings'!D61)),1,0),\"\")","v":""},{"$f":"IF($AL$419=1,IF(ISNUMBER(SEARCH($AK$419,'Hide this - Workings'!D61)),1,0),\"\")","v":""},{"$f":"IF($AL$420=1,IF(ISNUMBER(SEARCH($AK$420,'Hide this - Workings'!D61)),1,0),\"\")","v":""},{"$f":"IF($AL$421=1,IF(ISNUMBER(SEARCH($AK$421,'Hide this - Workings'!D61)),1,0),\"\")","v":""},{"$f":"IF($AL$422=1,IF(ISNUMBER(SEARCH($AK$422,'Hide this - Workings'!D61)),1,0),\"\")","v":""},{"$f":"IF($AL$423=1,IF(ISNUMBER(SEARCH($AK$423,'Hide this - Workings'!D61)),1,0),\"\")","v":""},{"$f":"IF($AL$424=1,IF(ISNUMBER(SEARCH($AK$424,'Hide this - Workings'!D61)),1,0),\"\")","v":""},{"$f":"IF($AL$425=1,IF(ISNUMBER(SEARCH($AK$425,'Hide this - Workings'!D61)),1,0),\"\")","v":""},{"$f":"IF($AL$426=1,IF(ISNUMBER(SEARCH($AK$426,'Hide this - Workings'!D61)),1,0),\"\")","v":""},{"$f":"IF($AL$427=1,IF(ISNUMBER(SEARCH($AK$427,'Hide this - Workings'!D61)),1,0),\"\")","v":""},{"$f":"IF($AL$428=1,IF(ISNUMBER(SEARCH($AK$428,'Hide this - Workings'!D61)),1,0),\"\")","v":""},{"$f":"IF($AL$429=1,IF(ISNUMBER(SEARCH($AK$429,'Hide this - Workings'!D61)),1,0),\"\")","v":""},{"$f":"IF($AL$430=1,IF(ISNUMBER(SEARCH($AK$430,'Hide this - Workings'!D61)),1,0),\"\")","v":""},{"$f":"IF($AL$431=1,IF(ISNUMBER(SEARCH($AK$431,'Hide this - Workings'!D61)),1,0),\"\")","v":""},{"$f":"IF($AL$432=1,IF(ISNUMBER(SEARCH($AK$432,'Hide this - Workings'!D61)),1,0),\"\")","v":""},{"$f":"IF($AL$433=1,IF(ISNUMBER(SEARCH($AK$433,'Hide this - Workings'!D61)),1,0),\"\")","v":""},0,"A057",0,"Following review of a long term client in LTS001 the social worker arranges a residential care placement and this is recorded on our system however following financial assessment the client decides to pay privately for their placement and not to remain in contact with the local authority. Which of the following sequels should apply - All long term support ended or Change in setting – Move to residential care? [LTS002a, LTS002b] This client has become a self-funder, and therefore both the support setting and mechanism of service delivery will no longer be captured in any measure of the SALT return, because the local authority no longer provides, commissions or reviews that support. The change has taken place as part of the sequence of events used to determine the appropriate sequel to your review, so the correct sequel to use is 'All long term support ended'. Care should be taken in relation to clients who are placed in residential or nursing care subject to a 12 week disregard who after this period become self-funders, as all 12-week disregard arrangements must be reported as new long term admissions.\n","Following review of a long term client in LTS001 the social worker arranges a residential care placement and this is recorded on our system however following financial assessment the client decides to pay privately for their placement and not to remain in contact with the local authority. Which of the following sequels should apply - All long term support ended or Change in setting – Move to residential care? [LTS002a, LTS002b]","This client has become a self-funder, and therefore both the support setting and mechanism of service delivery will no longer be captured in any measure of the SALT return, because the local authority no longer provides, commissions or reviews that support. The change has taken place as part of the sequence of events used to determine the appropriate sequel to your review, so the correct sequel to use is 'All long term support ended'. Care should be taken in relation to clients who are placed in residential or nursing care subject to a 12 week disregard who after this period become self-funders, as all 12-week disregard arrangements must be reported as new long term admissions.\n"]
[null,null,"","Does health-funded OT come under the 100% health funded sequel ? [STS001] The 100% NHS Funded Care category would include OT work funded 100% by Health when this was all of the care received (in other words, if there was no social services funding being used and the person is not a full cost client paying for social care themselves).\n\n",null,null,null,null,null,null,null,"Does health-funded OT come under the 100% health funded sequel ? [STS001]","The 100% NHS Funded Care category would include OT work funded 100% by Health when this was all of the care received (in other words, if there was no social services funding being used and the person is not a full cost client paying for social care themselves).\n\n",{"$f":"IF($AL$417=1,IF(ISNUMBER(SEARCH($AK$417,'Hide this - Workings'!D62)),1,0),\"\")","v":""},{"$f":"IF($AL$418=1,IF(ISNUMBER(SEARCH($AK$418,'Hide this - Workings'!D62)),1,0),\"\")","v":""},{"$f":"IF($AL$419=1,IF(ISNUMBER(SEARCH($AK$419,'Hide this - Workings'!D62)),1,0),\"\")","v":""},{"$f":"IF($AL$420=1,IF(ISNUMBER(SEARCH($AK$420,'Hide this - Workings'!D62)),1,0),\"\")","v":""},{"$f":"IF($AL$421=1,IF(ISNUMBER(SEARCH($AK$421,'Hide this - Workings'!D62)),1,0),\"\")","v":""},{"$f":"IF($AL$422=1,IF(ISNUMBER(SEARCH($AK$422,'Hide this - Workings'!D62)),1,0),\"\")","v":""},{"$f":"IF($AL$423=1,IF(ISNUMBER(SEARCH($AK$423,'Hide this - Workings'!D62)),1,0),\"\")","v":""},{"$f":"IF($AL$424=1,IF(ISNUMBER(SEARCH($AK$424,'Hide this - Workings'!D62)),1,0),\"\")","v":""},{"$f":"IF($AL$425=1,IF(ISNUMBER(SEARCH($AK$425,'Hide this - Workings'!D62)),1,0),\"\")","v":""},{"$f":"IF($AL$426=1,IF(ISNUMBER(SEARCH($AK$426,'Hide this - Workings'!D62)),1,0),\"\")","v":""},{"$f":"IF($AL$427=1,IF(ISNUMBER(SEARCH($AK$427,'Hide this - Workings'!D62)),1,0),\"\")","v":""},{"$f":"IF($AL$428=1,IF(ISNUMBER(SEARCH($AK$428,'Hide this - Workings'!D62)),1,0),\"\")","v":""},{"$f":"IF($AL$429=1,IF(ISNUMBER(SEARCH($AK$429,'Hide this - Workings'!D62)),1,0),\"\")","v":""},{"$f":"IF($AL$430=1,IF(ISNUMBER(SEARCH($AK$430,'Hide this - Workings'!D62)),1,0),\"\")","v":""},{"$f":"IF($AL$431=1,IF(ISNUMBER(SEARCH($AK$431,'Hide this - Workings'!D62)),1,0),\"\")","v":""},{"$f":"IF($AL$432=1,IF(ISNUMBER(SEARCH($AK$432,'Hide this - Workings'!D62)),1,0),\"\")","v":""},{"$f":"IF($AL$433=1,IF(ISNUMBER(SEARCH($AK$433,'Hide this - Workings'!D62)),1,0),\"\")","v":""},0,"A058",0,"Does health-funded OT come under the 100% health funded sequel ? [STS001] The 100% NHS Funded Care category would include OT work funded 100% by Health when this was all of the care received (in other words, if there was no social services funding being used and the person is not a full cost client paying for social care themselves).\n\n","Does health-funded OT come under the 100% health funded sequel ? [STS001]","The 100% NHS Funded Care category would include OT work funded 100% by Health when this was all of the care received (in other words, if there was no social services funding being used and the person is not a full cost client paying for social care themselves).\n\n"]
[null,null,"","If a client is given short term residential care after being a long term community based long term client, with the aim of them returning to the community after a set period of care, which sequel would you capture in the LTS002 measures? [LTS002a, LTS002b] The correct sequel would be ‘No Change in Long Term Support’. If you refer to the guidance for SALT measure STS001 you’ll note that the following advice is provided, “…Trial placements for a fixed period in order to assess suitability are included (as residential and nursing), as the expectation would be for clients to remain in long term care home support, but short term temporary stays in which the client has a planned return to a community setting are not, and should be counted in the ‘Community’ category.”\nThe highlighted section applies equally to the circumstances you describe so within LST002 the client is not judged to have been subject to a change in setting.\nCouncils are asked not to record these temporary changes in care as increases or decreases to the level of long term care. This is to ensure that data relating to the level of long term support increasing is not distorted by short term change and reflects the way that SALT seeks to record the direction of changes to packages.",null,null,null,null,null,null,null,"If a client is given short term residential care after being a long term community based long term client, with the aim of them returning to the community after a set period of care, which sequel would you capture in the LTS002 measures? [LTS002a, LTS002b]","The correct sequel would be ‘No Change in Long Term Support’. If you refer to the guidance for SALT measure STS001 you’ll note that the following advice is provided, “…Trial placements for a fixed period in order to assess suitability are included (as residential and nursing), as the expectation would be for clients to remain in long term care home support, but short term temporary stays in which the client has a planned return to a community setting are not, and should be counted in the ‘Community’ category.”\nThe highlighted section applies equally to the circumstances you describe so within LST002 the client is not judged to have been subject to a change in setting.\nCouncils are asked not to record these temporary changes in care as increases or decreases to the level of long term care. This is to ensure that data relating to the level of long term support increasing is not distorted by short term change and reflects the way that SALT seeks to record the direction of changes to packages.",{"$f":"IF($AL$417=1,IF(ISNUMBER(SEARCH($AK$417,'Hide this - Workings'!D63)),1,0),\"\")","v":""},{"$f":"IF($AL$418=1,IF(ISNUMBER(SEARCH($AK$418,'Hide this - Workings'!D63)),1,0),\"\")","v":""},{"$f":"IF($AL$419=1,IF(ISNUMBER(SEARCH($AK$419,'Hide this - Workings'!D63)),1,0),\"\")","v":""},{"$f":"IF($AL$420=1,IF(ISNUMBER(SEARCH($AK$420,'Hide this - Workings'!D63)),1,0),\"\")","v":""},{"$f":"IF($AL$421=1,IF(ISNUMBER(SEARCH($AK$421,'Hide this - Workings'!D63)),1,0),\"\")","v":""},{"$f":"IF($AL$422=1,IF(ISNUMBER(SEARCH($AK$422,'Hide this - Workings'!D63)),1,0),\"\")","v":""},{"$f":"IF($AL$423=1,IF(ISNUMBER(SEARCH($AK$423,'Hide this - Workings'!D63)),1,0),\"\")","v":""},{"$f":"IF($AL$424=1,IF(ISNUMBER(SEARCH($AK$424,'Hide this - Workings'!D63)),1,0),\"\")","v":""},{"$f":"IF($AL$425=1,IF(ISNUMBER(SEARCH($AK$425,'Hide this - Workings'!D63)),1,0),\"\")","v":""},{"$f":"IF($AL$426=1,IF(ISNUMBER(SEARCH($AK$426,'Hide this - Workings'!D63)),1,0),\"\")","v":""},{"$f":"IF($AL$427=1,IF(ISNUMBER(SEARCH($AK$427,'Hide this - Workings'!D63)),1,0),\"\")","v":""},{"$f":"IF($AL$428=1,IF(ISNUMBER(SEARCH($AK$428,'Hide this - Workings'!D63)),1,0),\"\")","v":""},{"$f":"IF($AL$429=1,IF(ISNUMBER(SEARCH($AK$429,'Hide this - Workings'!D63)),1,0),\"\")","v":""},{"$f":"IF($AL$430=1,IF(ISNUMBER(SEARCH($AK$430,'Hide this - Workings'!D63)),1,0),\"\")","v":""},{"$f":"IF($AL$431=1,IF(ISNUMBER(SEARCH($AK$431,'Hide this - Workings'!D63)),1,0),\"\")","v":""},{"$f":"IF($AL$432=1,IF(ISNUMBER(SEARCH($AK$432,'Hide this - Workings'!D63)),1,0),\"\")","v":""},{"$f":"IF($AL$433=1,IF(ISNUMBER(SEARCH($AK$433,'Hide this - Workings'!D63)),1,0),\"\")","v":""},0,"A059",0,"If a client is given short term residential care after being a long term community based long term client, with the aim of them returning to the community after a set period of care, which sequel would you capture in the LTS002 measures? [LTS002a, LTS002b] The correct sequel would be ‘No Change in Long Term Support’. If you refer to the guidance for SALT measure STS001 you’ll note that the following advice is provided, “…Trial placements for a fixed period in order to assess suitability are included (as residential and nursing), as the expectation would be for clients to remain in long term care home support, but short term temporary stays in which the client has a planned return to a community setting are not, and should be counted in the ‘Community’ category.”\nThe highlighted section applies equally to the circumstances you describe so within LST002 the client is not judged to have been subject to a change in setting.\nCouncils are asked not to record these temporary changes in care as increases or decreases to the level of long term care. This is to ensure that data relating to the level of long term support increasing is not distorted by short term change and reflects the way that SALT seeks to record the direction of changes to packages.","If a client is given short term residential care after being a long term community based long term client, with the aim of them returning to the community after a set period of care, which sequel would you capture in the LTS002 measures? [LTS002a, LTS002b]","The correct sequel would be ‘No Change in Long Term Support’. If you refer to the guidance for SALT measure STS001 you’ll note that the following advice is provided, “…Trial placements for a fixed period in order to assess suitability are included (as residential and nursing), as the expectation would be for clients to remain in long term care home support, but short term temporary stays in which the client has a planned return to a community setting are not, and should be counted in the ‘Community’ category.”\nThe highlighted section applies equally to the circumstances you describe so within LST002 the client is not judged to have been subject to a change in setting.\nCouncils are asked not to record these temporary changes in care as increases or decreases to the level of long term care. This is to ensure that data relating to the level of long term support increasing is not distorted by short term change and reflects the way that SALT seeks to record the direction of changes to packages."]
[null,null,"","As a local authority we commission third party organisations to provide support to carers. Carers can access these services directly. Should carers who do not contact the local authority but access carers’ support from these organisations directly be included in these tables? [LTS003] LTS003 is not concerned whether carers have contacted the local authority directly or whether a third party (e.g., a voluntary sector organisation) is providing assessment of eligibility for services. Although local arrangements for assessment of carer needs differ, all should involve direct contact with the carer. If carers are not being assessed by or on behalf of the local authority, the services provided can only be captured under the ‘Information, Advice and Other Universal Services / Signposting’ category. Authorities will have a range of differing funding arrangements with third party organisations. In some instances the organisation will be able to provide the relevant details of each carer (age, the person they care for etc.). These can be used to report the carer support in LTS003. In other instances the funding may be more general and the authority would have no expectation of the maintenance of carer by carer records. In such cases we would not expect that an authority would report these carers within LTS003.\nIf however the local authority commissions support (both by signposting and direct referrals) for carers who meet agreed assessment criteria and then pays for that support on a per- client basis, this activity could be part of LTS003 if the rest of the inclusion criteria are met.",null,null,null,null,null,null,null,"As a local authority we commission third party organisations to provide support to carers. Carers can access these services directly. Should carers who do not contact the local authority but access carers’ support from these organisations directly be included in these tables? [LTS003]","LTS003 is not concerned whether carers have contacted the local authority directly or whether a third party (e.g., a voluntary sector organisation) is providing assessment of eligibility for services. Although local arrangements for assessment of carer needs differ, all should involve direct contact with the carer. If carers are not being assessed by or on behalf of the local authority, the services provided can only be captured under the ‘Information, Advice and Other Universal Services / Signposting’ category. Authorities will have a range of differing funding arrangements with third party organisations. In some instances the organisation will be able to provide the relevant details of each carer (age, the person they care for etc.). These can be used to report the carer support in LTS003. In other instances the funding may be more general and the authority would have no expectation of the maintenance of carer by carer records. In such cases we would not expect that an authority would report these carers within LTS003.\nIf however the local authority commissions support (both by signposting and direct referrals) for carers who meet agreed assessment criteria and then pays for that support on a per- client basis, this activity could be part of LTS003 if the rest of the inclusion criteria are met.",{"$f":"IF($AL$417=1,IF(ISNUMBER(SEARCH($AK$417,'Hide this - Workings'!D64)),1,0),\"\")","v":""},{"$f":"IF($AL$418=1,IF(ISNUMBER(SEARCH($AK$418,'Hide this - Workings'!D64)),1,0),\"\")","v":""},{"$f":"IF($AL$419=1,IF(ISNUMBER(SEARCH($AK$419,'Hide this - Workings'!D64)),1,0),\"\")","v":""},{"$f":"IF($AL$420=1,IF(ISNUMBER(SEARCH($AK$420,'Hide this - Workings'!D64)),1,0),\"\")","v":""},{"$f":"IF($AL$421=1,IF(ISNUMBER(SEARCH($AK$421,'Hide this - Workings'!D64)),1,0),\"\")","v":""},{"$f":"IF($AL$422=1,IF(ISNUMBER(SEARCH($AK$422,'Hide this - Workings'!D64)),1,0),\"\")","v":""},{"$f":"IF($AL$423=1,IF(ISNUMBER(SEARCH($AK$423,'Hide this - Workings'!D64)),1,0),\"\")","v":""},{"$f":"IF($AL$424=1,IF(ISNUMBER(SEARCH($AK$424,'Hide this - Workings'!D64)),1,0),\"\")","v":""},{"$f":"IF($AL$425=1,IF(ISNUMBER(SEARCH($AK$425,'Hide this - Workings'!D64)),1,0),\"\")","v":""},{"$f":"IF($AL$426=1,IF(ISNUMBER(SEARCH($AK$426,'Hide this - Workings'!D64)),1,0),\"\")","v":""},{"$f":"IF($AL$427=1,IF(ISNUMBER(SEARCH($AK$427,'Hide this - Workings'!D64)),1,0),\"\")","v":""},{"$f":"IF($AL$428=1,IF(ISNUMBER(SEARCH($AK$428,'Hide this - Workings'!D64)),1,0),\"\")","v":""},{"$f":"IF($AL$429=1,IF(ISNUMBER(SEARCH($AK$429,'Hide this - Workings'!D64)),1,0),\"\")","v":""},{"$f":"IF($AL$430=1,IF(ISNUMBER(SEARCH($AK$430,'Hide this - Workings'!D64)),1,0),\"\")","v":""},{"$f":"IF($AL$431=1,IF(ISNUMBER(SEARCH($AK$431,'Hide this - Workings'!D64)),1,0),\"\")","v":""},{"$f":"IF($AL$432=1,IF(ISNUMBER(SEARCH($AK$432,'Hide this - Workings'!D64)),1,0),\"\")","v":""},{"$f":"IF($AL$433=1,IF(ISNUMBER(SEARCH($AK$433,'Hide this - Workings'!D64)),1,0),\"\")","v":""},0,"A060",0,"As a local authority we commission third party organisations to provide support to carers. Carers can access these services directly. Should carers who do not contact the local authority but access carers’ support from these organisations directly be included in these tables? [LTS003] LTS003 is not concerned whether carers have contacted the local authority directly or whether a third party (e.g., a voluntary sector organisation) is providing assessment of eligibility for services. Although local arrangements for assessment of carer needs differ, all should involve direct contact with the carer. If carers are not being assessed by or on behalf of the local authority, the services provided can only be captured under the ‘Information, Advice and Other Universal Services / Signposting’ category. Authorities will have a range of differing funding arrangements with third party organisations. In some instances the organisation will be able to provide the relevant details of each carer (age, the person they care for etc.). These can be used to report the carer support in LTS003. In other instances the funding may be more general and the authority would have no expectation of the maintenance of carer by carer records. In such cases we would not expect that an authority would report these carers within LTS003.\nIf however the local authority commissions support (both by signposting and direct referrals) for carers who meet agreed assessment criteria and then pays for that support on a per- client basis, this activity could be part of LTS003 if the rest of the inclusion criteria are met.","As a local authority we commission third party organisations to provide support to carers. Carers can access these services directly. Should carers who do not contact the local authority but access carers’ support from these organisations directly be included in these tables? [LTS003]","LTS003 is not concerned whether carers have contacted the local authority directly or whether a third party (e.g., a voluntary sector organisation) is providing assessment of eligibility for services. Although local arrangements for assessment of carer needs differ, all should involve direct contact with the carer. If carers are not being assessed by or on behalf of the local authority, the services provided can only be captured under the ‘Information, Advice and Other Universal Services / Signposting’ category. Authorities will have a range of differing funding arrangements with third party organisations. In some instances the organisation will be able to provide the relevant details of each carer (age, the person they care for etc.). These can be used to report the carer support in LTS003. In other instances the funding may be more general and the authority would have no expectation of the maintenance of carer by carer records. In such cases we would not expect that an authority would report these carers within LTS003.\nIf however the local authority commissions support (both by signposting and direct referrals) for carers who meet agreed assessment criteria and then pays for that support on a per- client basis, this activity could be part of LTS003 if the rest of the inclusion criteria are met."]
[null,null,"","We provide funding to a carers centre that produces a quarterly newsletter for carers. Could you let me know if the newsletter should be reported as provision of information and advice within LTS003? The answer of whether a carers’ newsletter would constitute ‘Information, Advice and Other Universal Services / Signposting’ depends on whether it can be considered as a 'service' or 'support' to the carer and whether any consideration of their needs was made.\nSALT does not require support to be 'tailored' to the needs of the individual - accepting that some standardised forms of advice / information can be useful. There is still a need to understand what the carer’s circumstances are though the depth of any screening / assessment needs to be proportionate, depending on the scenario. Some cases would require just a 'screening' over the phone, without a full carer eligibility assessment. The SALT Guidance states that “LTS003 does distinguish whether support for carers is provided through an ‘assessment’ or ‘review' although this is not a requirement for the provision of services. Local authorities will have different systems in place for determining the needs of carers and allocating support.”\nThe following should assist in determining whether the newsletter would appear in SALT:\n if the person receiving the newsletter has been confirmed to remain a carer, and had some form of (perhaps very brief) screening / assessment to confirm they do not have more serious caring needs but might find the newsletter informative, then this would count (as information & advice). The carer details (age, etc.) would of course need to be known.\n if the person is sent a newsletter in response to a specific request for information, this would also count as information and advice (providing details were logged of course).\n if the person did not ask for the newsletter and / or has not been in contact with the Council in their capacity as a carer and / or has not had their carer’s needs screened or assessed, then this would not count. An example would be if a carers’ newsletter / leaflet was sent out on its own or with other publications as part of a general 'mailshot' (e.g., “Are You a Carer? We can Help!\"), perhaps to raise awareness etc. This is not in response to any identified need, so would not be relevant to SALT. [LTS003]",null,null,null,null,null,null,null,"We provide funding to a carers centre that produces a quarterly newsletter for carers. Could you let me know if the newsletter should be reported as provision of information and advice within LTS003?","The answer of whether a carers’ newsletter would constitute ‘Information, Advice and Other Universal Services / Signposting’ depends on whether it can be considered as a 'service' or 'support' to the carer and whether any consideration of their needs was made.\nSALT does not require support to be 'tailored' to the needs of the individual - accepting that some standardised forms of advice / information can be useful. There is still a need to understand what the carer’s circumstances are though the depth of any screening / assessment needs to be proportionate, depending on the scenario. Some cases would require just a 'screening' over the phone, without a full carer eligibility assessment. The SALT Guidance states that “LTS003 does distinguish whether support for carers is provided through an ‘assessment’ or ‘review' although this is not a requirement for the provision of services. Local authorities will have different systems in place for determining the needs of carers and allocating support.”\nThe following should assist in determining whether the newsletter would appear in SALT:\n if the person receiving the newsletter has been confirmed to remain a carer, and had some form of (perhaps very brief) screening / assessment to confirm they do not have more serious caring needs but might find the newsletter informative, then this would count (as information & advice). The carer details (age, etc.) would of course need to be known.\n if the person is sent a newsletter in response to a specific request for information, this would also count as information and advice (providing details were logged of course).\n if the person did not ask for the newsletter and / or has not been in contact with the Council in their capacity as a carer and / or has not had their carer’s needs screened or assessed, then this would not count. An example would be if a carers’ newsletter / leaflet was sent out on its own or with other publications as part of a general 'mailshot' (e.g., “Are You a Carer? We can Help!\"), perhaps to raise awareness etc. This is not in response to any identified need, so would not be relevant to SALT. [LTS003]",{"$f":"IF($AL$417=1,IF(ISNUMBER(SEARCH($AK$417,'Hide this - Workings'!D65)),1,0),\"\")","v":""},{"$f":"IF($AL$418=1,IF(ISNUMBER(SEARCH($AK$418,'Hide this - Workings'!D65)),1,0),\"\")","v":""},{"$f":"IF($AL$419=1,IF(ISNUMBER(SEARCH($AK$419,'Hide this - Workings'!D65)),1,0),\"\")","v":""},{"$f":"IF($AL$420=1,IF(ISNUMBER(SEARCH($AK$420,'Hide this - Workings'!D65)),1,0),\"\")","v":""},{"$f":"IF($AL$421=1,IF(ISNUMBER(SEARCH($AK$421,'Hide this - Workings'!D65)),1,0),\"\")","v":""},{"$f":"IF($AL$422=1,IF(ISNUMBER(SEARCH($AK$422,'Hide this - Workings'!D65)),1,0),\"\")","v":""},{"$f":"IF($AL$423=1,IF(ISNUMBER(SEARCH($AK$423,'Hide this - Workings'!D65)),1,0),\"\")","v":""},{"$f":"IF($AL$424=1,IF(ISNUMBER(SEARCH($AK$424,'Hide this - Workings'!D65)),1,0),\"\")","v":""},{"$f":"IF($AL$425=1,IF(ISNUMBER(SEARCH($AK$425,'Hide this - Workings'!D65)),1,0),\"\")","v":""},{"$f":"IF($AL$426=1,IF(ISNUMBER(SEARCH($AK$426,'Hide this - Workings'!D65)),1,0),\"\")","v":""},{"$f":"IF($AL$427=1,IF(ISNUMBER(SEARCH($AK$427,'Hide this - Workings'!D65)),1,0),\"\")","v":""},{"$f":"IF($AL$428=1,IF(ISNUMBER(SEARCH($AK$428,'Hide this - Workings'!D65)),1,0),\"\")","v":""},{"$f":"IF($AL$429=1,IF(ISNUMBER(SEARCH($AK$429,'Hide this - Workings'!D65)),1,0),\"\")","v":""},{"$f":"IF($AL$430=1,IF(ISNUMBER(SEARCH($AK$430,'Hide this - Workings'!D65)),1,0),\"\")","v":""},{"$f":"IF($AL$431=1,IF(ISNUMBER(SEARCH($AK$431,'Hide this - Workings'!D65)),1,0),\"\")","v":""},{"$f":"IF($AL$432=1,IF(ISNUMBER(SEARCH($AK$432,'Hide this - Workings'!D65)),1,0),\"\")","v":""},{"$f":"IF($AL$433=1,IF(ISNUMBER(SEARCH($AK$433,'Hide this - Workings'!D65)),1,0),\"\")","v":""},0,"A061",0,"We provide funding to a carers centre that produces a quarterly newsletter for carers. Could you let me know if the newsletter should be reported as provision of information and advice within LTS003? The answer of whether a carers’ newsletter would constitute ‘Information, Advice and Other Universal Services / Signposting’ depends on whether it can be considered as a 'service' or 'support' to the carer and whether any consideration of their needs was made.\nSALT does not require support to be 'tailored' to the needs of the individual - accepting that some standardised forms of advice / information can be useful. There is still a need to understand what the carer’s circumstances are though the depth of any screening / assessment needs to be proportionate, depending on the scenario. Some cases would require just a 'screening' over the phone, without a full carer eligibility assessment. The SALT Guidance states that “LTS003 does distinguish whether support for carers is provided through an ‘assessment’ or ‘review' although this is not a requirement for the provision of services. Local authorities will have different systems in place for determining the needs of carers and allocating support.”\nThe following should assist in determining whether the newsletter would appear in SALT:\n if the person receiving the newsletter has been confirmed to remain a carer, and had some form of (perhaps very brief) screening / assessment to confirm they do not have more serious caring needs but might find the newsletter informative, then this would count (as information & advice). The carer details (age, etc.) would of course need to be known.\n if the person is sent a newsletter in response to a specific request for information, this would also count as information and advice (providing details were logged of course).\n if the person did not ask for the newsletter and / or has not been in contact with the Council in their capacity as a carer and / or has not had their carer’s needs screened or assessed, then this would not count. An example would be if a carers’ newsletter / leaflet was sent out on its own or with other publications as part of a general 'mailshot' (e.g., “Are You a Carer? We can Help!\"), perhaps to raise awareness etc. This is not in response to any identified need, so would not be relevant to SALT. [LTS003]","We provide funding to a carers centre that produces a quarterly newsletter for carers. Could you let me know if the newsletter should be reported as provision of information and advice within LTS003?","The answer of whether a carers’ newsletter would constitute ‘Information, Advice and Other Universal Services / Signposting’ depends on whether it can be considered as a 'service' or 'support' to the carer and whether any consideration of their needs was made.\nSALT does not require support to be 'tailored' to the needs of the individual - accepting that some standardised forms of advice / information can be useful. There is still a need to understand what the carer’s circumstances are though the depth of any screening / assessment needs to be proportionate, depending on the scenario. Some cases would require just a 'screening' over the phone, without a full carer eligibility assessment. The SALT Guidance states that “LTS003 does distinguish whether support for carers is provided through an ‘assessment’ or ‘review' although this is not a requirement for the provision of services. Local authorities will have different systems in place for determining the needs of carers and allocating support.”\nThe following should assist in determining whether the newsletter would appear in SALT:\n if the person receiving the newsletter has been confirmed to remain a carer, and had some form of (perhaps very brief) screening / assessment to confirm they do not have more serious caring needs but might find the newsletter informative, then this would count (as information & advice). The carer details (age, etc.) would of course need to be known.\n if the person is sent a newsletter in response to a specific request for information, this would also count as information and advice (providing details were logged of course).\n if the person did not ask for the newsletter and / or has not been in contact with the Council in their capacity as a carer and / or has not had their carer’s needs screened or assessed, then this would not count. An example would be if a carers’ newsletter / leaflet was sent out on its own or with other publications as part of a general 'mailshot' (e.g., “Are You a Carer? We can Help!\"), perhaps to raise awareness etc. This is not in response to any identified need, so would not be relevant to SALT. [LTS003]"]
[null,null,"","Could you provide some detail on how to report the primary support reason for following cared for individuals in SALT measure LTS003? If you have a PSR for a cared-for individual that was collected/confirmed during the reporting year, then use this PSR. If the cared-for person doesn't have a confirmed PSR during the current reporting year, then report them as 'No PSR - Cared for person not recorded or details not current'. This is a simplification of prior advice and supersedes that advice.\n",null,null,null,null,null,null,null,"Could you provide some detail on how to report the primary support reason for following cared for individuals in SALT measure LTS003?","If you have a PSR for a cared-for individual that was collected/confirmed during the reporting year, then use this PSR. If the cared-for person doesn't have a confirmed PSR during the current reporting year, then report them as 'No PSR - Cared for person not recorded or details not current'. This is a simplification of prior advice and supersedes that advice.\n",{"$f":"IF($AL$417=1,IF(ISNUMBER(SEARCH($AK$417,'Hide this - Workings'!D66)),1,0),\"\")","v":""},{"$f":"IF($AL$418=1,IF(ISNUMBER(SEARCH($AK$418,'Hide this - Workings'!D66)),1,0),\"\")","v":""},{"$f":"IF($AL$419=1,IF(ISNUMBER(SEARCH($AK$419,'Hide this - Workings'!D66)),1,0),\"\")","v":""},{"$f":"IF($AL$420=1,IF(ISNUMBER(SEARCH($AK$420,'Hide this - Workings'!D66)),1,0),\"\")","v":""},{"$f":"IF($AL$421=1,IF(ISNUMBER(SEARCH($AK$421,'Hide this - Workings'!D66)),1,0),\"\")","v":""},{"$f":"IF($AL$422=1,IF(ISNUMBER(SEARCH($AK$422,'Hide this - Workings'!D66)),1,0),\"\")","v":""},{"$f":"IF($AL$423=1,IF(ISNUMBER(SEARCH($AK$423,'Hide this - Workings'!D66)),1,0),\"\")","v":""},{"$f":"IF($AL$424=1,IF(ISNUMBER(SEARCH($AK$424,'Hide this - Workings'!D66)),1,0),\"\")","v":""},{"$f":"IF($AL$425=1,IF(ISNUMBER(SEARCH($AK$425,'Hide this - Workings'!D66)),1,0),\"\")","v":""},{"$f":"IF($AL$426=1,IF(ISNUMBER(SEARCH($AK$426,'Hide this - Workings'!D66)),1,0),\"\")","v":""},{"$f":"IF($AL$427=1,IF(ISNUMBER(SEARCH($AK$427,'Hide this - Workings'!D66)),1,0),\"\")","v":""},{"$f":"IF($AL$428=1,IF(ISNUMBER(SEARCH($AK$428,'Hide this - Workings'!D66)),1,0),\"\")","v":""},{"$f":"IF($AL$429=1,IF(ISNUMBER(SEARCH($AK$429,'Hide this - Workings'!D66)),1,0),\"\")","v":""},{"$f":"IF($AL$430=1,IF(ISNUMBER(SEARCH($AK$430,'Hide this - Workings'!D66)),1,0),\"\")","v":""},{"$f":"IF($AL$431=1,IF(ISNUMBER(SEARCH($AK$431,'Hide this - Workings'!D66)),1,0),\"\")","v":""},{"$f":"IF($AL$432=1,IF(ISNUMBER(SEARCH($AK$432,'Hide this - Workings'!D66)),1,0),\"\")","v":""},{"$f":"IF($AL$433=1,IF(ISNUMBER(SEARCH($AK$433,'Hide this - Workings'!D66)),1,0),\"\")","v":""},0,"A062",0,"Could you provide some detail on how to report the primary support reason for following cared for individuals in SALT measure LTS003? If you have a PSR for a cared-for individual that was collected/confirmed during the reporting year, then use this PSR. If the cared-for person doesn't have a confirmed PSR during the current reporting year, then report them as 'No PSR - Cared for person not recorded or details not current'. This is a simplification of prior advice and supersedes that advice.\n","Could you provide some detail on how to report the primary support reason for following cared for individuals in SALT measure LTS003?","If you have a PSR for a cared-for individual that was collected/confirmed during the reporting year, then use this PSR. If the cared-for person doesn't have a confirmed PSR during the current reporting year, then report them as 'No PSR - Cared for person not recorded or details not current'. This is a simplification of prior advice and supersedes that advice.\n"]
[null,null,"","In Tables 2a and 2b we have some clients who attend residential college and stay there during term time and after term is finished they go back to stay with their family. Would this count as living with their family or unsettled accommodation? Given the client has a home base with parents, this is their substantial accommodation and this is what should be considered for the purposes of LTS004 (i.e., Table 2a - Settled mainstream housing with family / friends (including flat-sharing)).\n",null,null,null,null,null,null,null,"In Tables 2a and 2b we have some clients who attend residential college and stay there during term time and after term is finished they go back to stay with their family. Would this count as living with their family or unsettled accommodation?","Given the client has a home base with parents, this is their substantial accommodation and this is what should be considered for the purposes of LTS004 (i.e., Table 2a - Settled mainstream housing with family / friends (including flat-sharing)).\n",{"$f":"IF($AL$417=1,IF(ISNUMBER(SEARCH($AK$417,'Hide this - Workings'!D67)),1,0),\"\")","v":""},{"$f":"IF($AL$418=1,IF(ISNUMBER(SEARCH($AK$418,'Hide this - Workings'!D67)),1,0),\"\")","v":""},{"$f":"IF($AL$419=1,IF(ISNUMBER(SEARCH($AK$419,'Hide this - Workings'!D67)),1,0),\"\")","v":""},{"$f":"IF($AL$420=1,IF(ISNUMBER(SEARCH($AK$420,'Hide this - Workings'!D67)),1,0),\"\")","v":""},{"$f":"IF($AL$421=1,IF(ISNUMBER(SEARCH($AK$421,'Hide this - Workings'!D67)),1,0),\"\")","v":""},{"$f":"IF($AL$422=1,IF(ISNUMBER(SEARCH($AK$422,'Hide this - Workings'!D67)),1,0),\"\")","v":""},{"$f":"IF($AL$423=1,IF(ISNUMBER(SEARCH($AK$423,'Hide this - Workings'!D67)),1,0),\"\")","v":""},{"$f":"IF($AL$424=1,IF(ISNUMBER(SEARCH($AK$424,'Hide this - Workings'!D67)),1,0),\"\")","v":""},{"$f":"IF($AL$425=1,IF(ISNUMBER(SEARCH($AK$425,'Hide this - Workings'!D67)),1,0),\"\")","v":""},{"$f":"IF($AL$426=1,IF(ISNUMBER(SEARCH($AK$426,'Hide this - Workings'!D67)),1,0),\"\")","v":""},{"$f":"IF($AL$427=1,IF(ISNUMBER(SEARCH($AK$427,'Hide this - Workings'!D67)),1,0),\"\")","v":""},{"$f":"IF($AL$428=1,IF(ISNUMBER(SEARCH($AK$428,'Hide this - Workings'!D67)),1,0),\"\")","v":""},{"$f":"IF($AL$429=1,IF(ISNUMBER(SEARCH($AK$429,'Hide this - Workings'!D67)),1,0),\"\")","v":""},{"$f":"IF($AL$430=1,IF(ISNUMBER(SEARCH($AK$430,'Hide this - Workings'!D67)),1,0),\"\")","v":""},{"$f":"IF($AL$431=1,IF(ISNUMBER(SEARCH($AK$431,'Hide this - Workings'!D67)),1,0),\"\")","v":""},{"$f":"IF($AL$432=1,IF(ISNUMBER(SEARCH($AK$432,'Hide this - Workings'!D67)),1,0),\"\")","v":""},{"$f":"IF($AL$433=1,IF(ISNUMBER(SEARCH($AK$433,'Hide this - Workings'!D67)),1,0),\"\")","v":""},0,"A063",0,"In Tables 2a and 2b we have some clients who attend residential college and stay there during term time and after term is finished they go back to stay with their family. Would this count as living with their family or unsettled accommodation? Given the client has a home base with parents, this is their substantial accommodation and this is what should be considered for the purposes of LTS004 (i.e., Table 2a - Settled mainstream housing with family / friends (including flat-sharing)).\n","In Tables 2a and 2b we have some clients who attend residential college and stay there during term time and after term is finished they go back to stay with their family. Would this count as living with their family or unsettled accommodation?","Given the client has a home base with parents, this is their substantial accommodation and this is what should be considered for the purposes of LTS004 (i.e., Table 2a - Settled mainstream housing with family / friends (including flat-sharing)).\n"]
[null,null,"","When the existing clients reported in STS002b receive ST-MAX their long term packages of care may either continue or in some instances be suspended during the period of ST-MAX. Please could you give some advice on how the outcomes of ST-MAX for these clients should be reported in STS002b? You are correct in assuming that it is possible for long term support services to continue while the short term support to maximise independence (ST-Max) is being provided. If the outcome of the ST-Max is to return to the same long term support package, then you would choose the sequel 'No Change in Setting' - 'No Change in Long Term Support', whether or not the long term support was suspended while the ST-Max was ongoing.",null,null,null,null,null,null,null,"When the existing clients reported in STS002b receive ST-MAX their long term packages of care may either continue or in some instances be suspended during the period of ST-MAX. Please could you give some advice on how the outcomes of ST-MAX for these clients should be reported in STS002b?","You are correct in assuming that it is possible for long term support services to continue while the short term support to maximise independence (ST-Max) is being provided. If the outcome of the ST-Max is to return to the same long term support package, then you would choose the sequel 'No Change in Setting' - 'No Change in Long Term Support', whether or not the long term support was suspended while the ST-Max was ongoing.",{"$f":"IF($AL$417=1,IF(ISNUMBER(SEARCH($AK$417,'Hide this - Workings'!D68)),1,0),\"\")","v":""},{"$f":"IF($AL$418=1,IF(ISNUMBER(SEARCH($AK$418,'Hide this - Workings'!D68)),1,0),\"\")","v":""},{"$f":"IF($AL$419=1,IF(ISNUMBER(SEARCH($AK$419,'Hide this - Workings'!D68)),1,0),\"\")","v":""},{"$f":"IF($AL$420=1,IF(ISNUMBER(SEARCH($AK$420,'Hide this - Workings'!D68)),1,0),\"\")","v":""},{"$f":"IF($AL$421=1,IF(ISNUMBER(SEARCH($AK$421,'Hide this - Workings'!D68)),1,0),\"\")","v":""},{"$f":"IF($AL$422=1,IF(ISNUMBER(SEARCH($AK$422,'Hide this - Workings'!D68)),1,0),\"\")","v":""},{"$f":"IF($AL$423=1,IF(ISNUMBER(SEARCH($AK$423,'Hide this - Workings'!D68)),1,0),\"\")","v":""},{"$f":"IF($AL$424=1,IF(ISNUMBER(SEARCH($AK$424,'Hide this - Workings'!D68)),1,0),\"\")","v":""},{"$f":"IF($AL$425=1,IF(ISNUMBER(SEARCH($AK$425,'Hide this - Workings'!D68)),1,0),\"\")","v":""},{"$f":"IF($AL$426=1,IF(ISNUMBER(SEARCH($AK$426,'Hide this - Workings'!D68)),1,0),\"\")","v":""},{"$f":"IF($AL$427=1,IF(ISNUMBER(SEARCH($AK$427,'Hide this - Workings'!D68)),1,0),\"\")","v":""},{"$f":"IF($AL$428=1,IF(ISNUMBER(SEARCH($AK$428,'Hide this - Workings'!D68)),1,0),\"\")","v":""},{"$f":"IF($AL$429=1,IF(ISNUMBER(SEARCH($AK$429,'Hide this - Workings'!D68)),1,0),\"\")","v":""},{"$f":"IF($AL$430=1,IF(ISNUMBER(SEARCH($AK$430,'Hide this - Workings'!D68)),1,0),\"\")","v":""},{"$f":"IF($AL$431=1,IF(ISNUMBER(SEARCH($AK$431,'Hide this - Workings'!D68)),1,0),\"\")","v":""},{"$f":"IF($AL$432=1,IF(ISNUMBER(SEARCH($AK$432,'Hide this - Workings'!D68)),1,0),\"\")","v":""},{"$f":"IF($AL$433=1,IF(ISNUMBER(SEARCH($AK$433,'Hide this - Workings'!D68)),1,0),\"\")","v":""},0,"A064",0,"When the existing clients reported in STS002b receive ST-MAX their long term packages of care may either continue or in some instances be suspended during the period of ST-MAX. Please could you give some advice on how the outcomes of ST-MAX for these clients should be reported in STS002b? You are correct in assuming that it is possible for long term support services to continue while the short term support to maximise independence (ST-Max) is being provided. If the outcome of the ST-Max is to return to the same long term support package, then you would choose the sequel 'No Change in Setting' - 'No Change in Long Term Support', whether or not the long term support was suspended while the ST-Max was ongoing.","When the existing clients reported in STS002b receive ST-MAX their long term packages of care may either continue or in some instances be suspended during the period of ST-MAX. Please could you give some advice on how the outcomes of ST-MAX for these clients should be reported in STS002b?","You are correct in assuming that it is possible for long term support services to continue while the short term support to maximise independence (ST-Max) is being provided. If the outcome of the ST-Max is to return to the same long term support package, then you would choose the sequel 'No Change in Setting' - 'No Change in Long Term Support', whether or not the long term support was suspended while the ST-Max was ongoing."]
[null,null,"",{"$f":"L69&\" \"&M69","v":"Sometimes we make long term admissions to residential care without any ‘event’ (such as a review or assessment) being recorded on our client database. How should the following scenarios be captured in the SALT return?\nScenario 1\nAn emergency admission to nursing care is made unexpectedly for someone living in the community, following an urgent phone call handled by the out of hour’s duty team. This placement is confirmed as long term within the next two weeks.\nScenario 2\nA temporary admission to a care home is extended several times. Eventually the decision is confirmed to make the placement long term.\nScenario 3\nA new client is assessed and the decision made to support them to live in the community with long term services. After less than a week these arrangements break down and the person moves into long term residential care. Important for All Scenarios\nIf you discover that placements to registered care homes or substantial changes to any care packages are made without being recorded on your client database in a way that can be counted, this is a data quality issue. Such issues relating to non-recording of key decisions about a service user’s care should be treated very seriously and addressed as soon as possible. For any remaining issues that cannot be addressed you should discuss how the interpretation of your data will be affected with NHS-Digital as early as possible and ensure that you also record the details of any problems via the end sheet of the SALT return.\nScenario 1\nIt is recognised that people’s support needs can change rapidly and that recording of changes to care arrangements and circumstances will in some circumstances be delayed. In order for your SALT return to accurately represent the decisions and care provision made by your local authority any such emergency or unplanned admissions to residential and nursing care should be captured in SALT.\nIf the client is new for SALT purposes;\nThe placement will need to be recorded in STS001, with a sequel of ‘Long Term Support (eligible services) NURSING CARE’. If the placement has been made as a result of or during ST-Max provision, the placement should appear in STS002a with the relevant sequel ‘Long Term Support (any setting)’ or ‘Early Cessation of Service (leading to long term support)’ in Table 1 would apply. Consideration needs to be made as to whether the placement occurred as an early cessation of ST-Max, or following completion of ST-Max.\nIf the client was already in long-term support;\nThe placement will probably need to be recorded in LTS002 (a and possibly b, depending on how long the person has been supported for) as an unscheduled review. The sequel will be ‘Move to Nursing Care’.  The only other place it could be recorded is STS002b if the placement was made while ST-Max was ongoing, or had just ended. The relevant sequels ‘Move to Nursing Care (from community)’ or ‘Early Cessation of Service (return to long term support) - any setting’ in Table 1 would apply, depending on whether the placement occurred as an early cessation of ST-Max, or following completion of ST-Max.\nTaking these steps will ensure your SALT return gives an accurate account of activity in relation to residential and nursing placements. You may need to create an appropriate episode or event on your client database to allow these decisions to be documented even after a placement has been commissioned.\nScenario 2\nIn some cases long term residential and nursing placements may be made with no SALT event (request for support, ST-Max or review) recorded on the client database, preventing these being counted. This sometimes happens when a short term placement is extended, eventually becoming confirmed as long term. The work may be recorded in the file’s case notes or in some other way, or not at all. As the person is (for SALT purposes) still a new client, the placement should be recorded in STS001. Your authority may have a review process for considering the needs of those in short term placements but these reviews should be counted as Requests for Support in SALT. This may mean mapping these ‘system reviews’ to count as new Requests for Support.\nScenario 3\nThe initial Request for Support would result in a sequel of Long Term Support (Community setting). It would be reasonable to expect that a local authority might have closed the record already, such that the sequel could no longer be changed. Because the long term care arrangements were already in place, the sudden change of circumstances could be expected to lead to an unscheduled review of the care arrangements in order to reach the decision to move the client into residential care. If there was no time to document this before the move took place, we would nevertheless expect an unscheduled review to appear in SALT with the appropriate sequel ‘Move to residential care’. You may need to create an unscheduled review ‘episode’ or ‘event’ on your client database to allow these decisions to be documented after a placement has been commissioned.\n"},null,null,null,null,null,null,null,"Sometimes we make long term admissions to residential care without any ‘event’ (such as a review or assessment) being recorded on our client database. How should the following scenarios be captured in the SALT return?\nScenario 1\nAn emergency admission to nursing care is made unexpectedly for someone living in the community, following an urgent phone call handled by the out of hour’s duty team. This placement is confirmed as long term within the next two weeks.\nScenario 2\nA temporary admission to a care home is extended several times. Eventually the decision is confirmed to make the placement long term.\nScenario 3\nA new client is assessed and the decision made to support them to live in the community with long term services. After less than a week these arrangements break down and the person moves into long term residential care.","Important for All Scenarios\nIf you discover that placements to registered care homes or substantial changes to any care packages are made without being recorded on your client database in a way that can be counted, this is a data quality issue. Such issues relating to non-recording of key decisions about a service user’s care should be treated very seriously and addressed as soon as possible. For any remaining issues that cannot be addressed you should discuss how the interpretation of your data will be affected with NHS-Digital as early as possible and ensure that you also record the details of any problems via the end sheet of the SALT return.\nScenario 1\nIt is recognised that people’s support needs can change rapidly and that recording of changes to care arrangements and circumstances will in some circumstances be delayed. In order for your SALT return to accurately represent the decisions and care provision made by your local authority any such emergency or unplanned admissions to residential and nursing care should be captured in SALT.\nIf the client is new for SALT purposes;\nThe placement will need to be recorded in STS001, with a sequel of ‘Long Term Support (eligible services) NURSING CARE’. If the placement has been made as a result of or during ST-Max provision, the placement should appear in STS002a with the relevant sequel ‘Long Term Support (any setting)’ or ‘Early Cessation of Service (leading to long term support)’ in Table 1 would apply. Consideration needs to be made as to whether the placement occurred as an early cessation of ST-Max, or following completion of ST-Max.\nIf the client was already in long-term support;\nThe placement will probably need to be recorded in LTS002 (a and possibly b, depending on how long the person has been supported for) as an unscheduled review. The sequel will be ‘Move to Nursing Care’.  The only other place it could be recorded is STS002b if the placement was made while ST-Max was ongoing, or had just ended. The relevant sequels ‘Move to Nursing Care (from community)’ or ‘Early Cessation of Service (return to long term support) - any setting’ in Table 1 would apply, depending on whether the placement occurred as an early cessation of ST-Max, or following completion of ST-Max.\nTaking these steps will ensure your SALT return gives an accurate account of activity in relation to residential and nursing placements. You may need to create an appropriate episode or event on your client database to allow these decisions to be documented even after a placement has been commissioned.\nScenario 2\nIn some cases long term residential and nursing placements may be made with no SALT event (request for support, ST-Max or review) recorded on the client database, preventing these being counted. This sometimes happens when a short term placement is extended, eventually becoming confirmed as long term. The work may be recorded in the file’s case notes or in some other way, or not at all. As the person is (for SALT purposes) still a new client, the placement should be recorded in STS001. Your authority may have a review process for considering the needs of those in short term placements but these reviews should be counted as Requests for Support in SALT. This may mean mapping these ‘system reviews’ to count as new Requests for Support.\nScenario 3\nThe initial Request for Support would result in a sequel of Long Term Support (Community setting). It would be reasonable to expect that a local authority might have closed the record already, such that the sequel could no longer be changed. Because the long term care arrangements were already in place, the sudden change of circumstances could be expected to lead to an unscheduled review of the care arrangements in order to reach the decision to move the client into residential care. If there was no time to document this before the move took place, we would nevertheless expect an unscheduled review to appear in SALT with the appropriate sequel ‘Move to residential care’. You may need to create an unscheduled review ‘episode’ or ‘event’ on your client database to allow these decisions to be documented after a placement has been commissioned.\n",{"$f":"IF($AL$417=1,IF(ISNUMBER(SEARCH($AK$417,'Hide this - Workings'!D69)),1,0),\"\")","v":""},{"$f":"IF($AL$418=1,IF(ISNUMBER(SEARCH($AK$418,'Hide this - Workings'!D69)),1,0),\"\")","v":""},{"$f":"IF($AL$419=1,IF(ISNUMBER(SEARCH($AK$419,'Hide this - Workings'!D69)),1,0),\"\")","v":""},{"$f":"IF($AL$420=1,IF(ISNUMBER(SEARCH($AK$420,'Hide this - Workings'!D69)),1,0),\"\")","v":""},{"$f":"IF($AL$421=1,IF(ISNUMBER(SEARCH($AK$421,'Hide this - Workings'!D69)),1,0),\"\")","v":""},{"$f":"IF($AL$422=1,IF(ISNUMBER(SEARCH($AK$422,'Hide this - Workings'!D69)),1,0),\"\")","v":""},{"$f":"IF($AL$423=1,IF(ISNUMBER(SEARCH($AK$423,'Hide this - Workings'!D69)),1,0),\"\")","v":""},{"$f":"IF($AL$424=1,IF(ISNUMBER(SEARCH($AK$424,'Hide this - Workings'!D69)),1,0),\"\")","v":""},{"$f":"IF($AL$425=1,IF(ISNUMBER(SEARCH($AK$425,'Hide this - Workings'!D69)),1,0),\"\")","v":""},{"$f":"IF($AL$426=1,IF(ISNUMBER(SEARCH($AK$426,'Hide this - Workings'!D69)),1,0),\"\")","v":""},{"$f":"IF($AL$427=1,IF(ISNUMBER(SEARCH($AK$427,'Hide this - Workings'!D69)),1,0),\"\")","v":""},{"$f":"IF($AL$428=1,IF(ISNUMBER(SEARCH($AK$428,'Hide this - Workings'!D69)),1,0),\"\")","v":""},{"$f":"IF($AL$429=1,IF(ISNUMBER(SEARCH($AK$429,'Hide this - Workings'!D69)),1,0),\"\")","v":""},{"$f":"IF($AL$430=1,IF(ISNUMBER(SEARCH($AK$430,'Hide this - Workings'!D69)),1,0),\"\")","v":""},{"$f":"IF($AL$431=1,IF(ISNUMBER(SEARCH($AK$431,'Hide this - Workings'!D69)),1,0),\"\")","v":""},{"$f":"IF($AL$432=1,IF(ISNUMBER(SEARCH($AK$432,'Hide this - Workings'!D69)),1,0),\"\")","v":""},{"$f":"IF($AL$433=1,IF(ISNUMBER(SEARCH($AK$433,'Hide this - Workings'!D69)),1,0),\"\")","v":""},0,"A065",0,"Sometimes we make long term admissions to residential care without any ‘event’ (such as a review or assessment) being recorded on our client database. How should the following scenarios be captured in the SALT return?\nScenario 1\nAn emergency admission to nursing care is made unexpectedly for someone living in the community, following an urgent phone call handled by the out of hour’s duty team. This placement is confirmed as long term within the next two weeks.\nScenario 2\nA temporary admission to a care home is extended several times. Eventually the decision is confirmed to make the placement long term.\nScenario 3\nA new client is assessed and the decision made to support them to live in the community with long term services. After less than a week these arrangements break down and the person moves into long term residential care. Important for All Scenarios\nIf you discover that placements to registered care homes or substantial changes to any care packages are made without being recorded on your client database in a way that can be counted, this is a data quality issue. Such issues relating to non-recording of key decisions about a service user’s care should be treated very seriously and addressed as soon as possible. For any remaining issues that cannot be addressed you should discuss how the interpretation of your data will be affected with NHS-Digital as early as possible and ensure that you also record the details of any problems via the end sheet of the SALT return.\nScenario 1\nIt is recognised that people’s support needs can change rapidly and that recording of changes to care arrangements and circumstances will in some circumstances be delayed. In order for your SALT return to accurately represent the decisions and care provision made by your local authority any such emergency or unplanned admissions to residential and nursing care should be captured in SALT.\nIf the client is new for SALT purposes;\nThe placement will need to be recorded in STS001, with a sequel of ‘Long Term Support (eligible services) NURSING CARE’. If the placement has been made as a result of or during ST-Max provision, the placement should appear in STS002a with the relevant sequel ‘Long Term Support (any setting)’ or ‘Early Cessation of Service (leading to long term support)’ in Table 1 would apply. Consideration needs to be made as to whether the placement occurred as an early cessation of ST-Max, or following completion of ST-Max.\nIf the client was already in long-term support;\nThe placement will probably need to be recorded in LTS002 (a and possibly b, depending on how long the person has been supported for) as an unscheduled review. The sequel will be ‘Move to Nursing Care’.  The only other place it could be recorded is STS002b if the placement was made while ST-Max was ongoing, or had just ended. The relevant sequels ‘Move to Nursing Care (from community)’ or ‘Early Cessation of Service (return to long term support) - any setting’ in Table 1 would apply, depending on whether the placement occurred as an early cessation of ST-Max, or following completion of ST-Max.\nTaking these steps will ensure your SALT return gives an accurate account of activity in relation to residential and nursing placements. You may need to create an appropriate episode or event on your client database to allow these decisions to be documented even after a placement has been commissioned.\nScenario 2\nIn some cases long term residential and nursing placements may be made with no SALT event (request for support, ST-Max or review) recorded on the client database, preventing these being counted. This sometimes happens when a short term placement is extended, eventually becoming confirmed as long term. The work may be recorded in the file’s case notes or in some other way, or not at all. As the person is (for SALT purposes) still a new client, the placement should be recorded in STS001. Your authority may have a review process for considering the needs of those in short term placements but these reviews should be counted as Requests for Support in SALT. This may mean mapping these ‘system reviews’ to count as new Requests for Support.\nScenario 3\nThe initial Request for Support would result in a sequel of Long Term Support (Community setting). It would be reasonable to expect that a local authority might have closed the record already, such that the sequel could no longer be changed. Because the long term care arrangements were already in place, the sudden change of circumstances could be expected to lead to an unscheduled review of the care arrangements in order to reach the decision to move the client into residential care. If there was no time to document this before the move took place, we would nevertheless expect an unscheduled review to appear in SALT with the appropriate sequel ‘Move to residential care’. You may need to create an unscheduled review ‘episode’ or ‘event’ on your client database to allow these decisions to be documented after a placement has been commissioned.\n","Sometimes we make long term admissions to residential care without any ‘event’ (such as a review or assessment) being recorded on our client database. How should the following scenarios be captured in the SALT return?\nScenario 1\nAn emergency admission to nursing care is made unexpectedly for someone living in the community, following an urgent phone call handled by the out of hour’s duty team. This placement is confirmed as long term within the next two weeks.\nScenario 2\nA temporary admission to a care home is extended several times. Eventually the decision is confirmed to make the placement long term.\nScenario 3\nA new client is assessed and the decision made to support them to live in the community with long term services. After less than a week these arrangements break down and the person moves into long term residential care.","Important for All Scenarios\nIf you discover that placements to registered care homes or substantial changes to any care packages are made without being recorded on your client database in a way that can be counted, this is a data quality issue. Such issues relating to non-recording of key decisions about a service user’s care should be treated very seriously and addressed as soon as possible. For any remaining issues that cannot be addressed you should discuss how the interpretation of your data will be affected with NHS-Digital as early as possible and ensure that you also record the details of any problems via the end sheet of the SALT return.\nScenario 1\nIt is recognised that people’s support needs can change rapidly and that recording of changes to care arrangements and circumstances will in some circumstances be delayed. In order for your SALT return to accurately represent the decisions and care provision made by your local authority any such emergency or unplanned admissions to residential and nursing care should be captured in SALT.\nIf the client is new for SALT purposes;\nThe placement will need to be recorded in STS001, with a sequel of ‘Long Term Support (eligible services) NURSING CARE’. If the placement has been made as a result of or during ST-Max provision, the placement should appear in STS002a with the relevant sequel ‘Long Term Support (any setting)’ or ‘Early Cessation of Service (leading to long term support)’ in Table 1 would apply. Consideration needs to be made as to whether the placement occurred as an early cessation of ST-Max, or following completion of ST-Max.\nIf the client was already in long-term support;\nThe placement will probably need to be recorded in LTS002 (a and possibly b, depending on how long the person has been supported for) as an unscheduled review. The sequel will be ‘Move to Nursing Care’.  The only other place it could be recorded is STS002b if the placement was made while ST-Max was ongoing, or had just ended. The relevant sequels ‘Move to Nursing Care (from community)’ or ‘Early Cessation of Service (return to long term support) - any setting’ in Table 1 would apply, depending on whether the placement occurred as an early cessation of ST-Max, or following completion of ST-Max.\nTaking these steps will ensure your SALT return gives an accurate account of activity in relation to residential and nursing placements. You may need to create an appropriate episode or event on your client database to allow these decisions to be documented even after a placement has been commissioned.\nScenario 2\nIn some cases long term residential and nursing placements may be made with no SALT event (request for support, ST-Max or review) recorded on the client database, preventing these being counted. This sometimes happens when a short term placement is extended, eventually becoming confirmed as long term. The work may be recorded in the file’s case notes or in some other way, or not at all. As the person is (for SALT purposes) still a new client, the placement should be recorded in STS001. Your authority may have a review process for considering the needs of those in short term placements but these reviews should be counted as Requests for Support in SALT. This may mean mapping these ‘system reviews’ to count as new Requests for Support.\nScenario 3\nThe initial Request for Support would result in a sequel of Long Term Support (Community setting). It would be reasonable to expect that a local authority might have closed the record already, such that the sequel could no longer be changed. Because the long term care arrangements were already in place, the sudden change of circumstances could be expected to lead to an unscheduled review of the care arrangements in order to reach the decision to move the client into residential care. If there was no time to document this before the move took place, we would nevertheless expect an unscheduled review to appear in SALT with the appropriate sequel ‘Move to residential care’. You may need to create an unscheduled review ‘episode’ or ‘event’ on your client database to allow these decisions to be documented after a placement has been commissioned.\n"]
[null,null,{"$f":"IF((IFERROR(AE70,0))>$B$5,AF70,\"\")","v":""},"What changes have been made to the number of LAs since the 2018-19 release of the SALT/ASC-FR datasets? The following changes have occurred:\n- Bournemouth and Poole merged on 1st April 2019 to create a new authority, Bournemouth Christchurch and Poole. For the 19/20 annual collections, covering 1st April 2019 to 31st March 2020, there were 151 authorities rather than 152. Neighbouring Dorset, whilst retaining its name, now covers a reduced area.\n- Northamptonshire split on 1st April 2021 to create two new authorities, West Northamptonshire and North Northamptonshire.  For the 21/22 annual collections, covering 1st April 2021 to 31st March 2022, there were 152 authorities rather than 151.",null,null,null,null,null,null,null,"What changes have been made to the number of LAs since the 2018-19 release of the SALT/ASC-FR datasets?","The following changes have occurred:\n- Bournemouth and Poole merged on 1st April 2019 to create a new authority, Bournemouth Christchurch and Poole. For the 19/20 annual collections, covering 1st April 2019 to 31st March 2020, there were 151 authorities rather than 152. Neighbouring Dorset, whilst retaining its name, now covers a reduced area.\n- Northamptonshire split on 1st April 2021 to create two new authorities, West Northamptonshire and North Northamptonshire.  For the 21/22 annual collections, covering 1st April 2021 to 31st March 2022, there were 152 authorities rather than 151.",{"$f":"IF($AL$417=1,IF(ISNUMBER(SEARCH($AK$417,'Hide this - Workings'!D70)),1,0),\"\")","v":""},{"$f":"IF($AL$418=1,IF(ISNUMBER(SEARCH($AK$418,'Hide this - Workings'!D70)),1,0),\"\")","v":""},{"$f":"IF($AL$419=1,IF(ISNUMBER(SEARCH($AK$419,'Hide this - Workings'!D70)),1,0),\"\")","v":""},{"$f":"IF($AL$420=1,IF(ISNUMBER(SEARCH($AK$420,'Hide this - Workings'!D70)),1,0),\"\")","v":""},{"$f":"IF($AL$421=1,IF(ISNUMBER(SEARCH($AK$421,'Hide this - Workings'!D70)),1,0),\"\")","v":""},{"$f":"IF($AL$422=1,IF(ISNUMBER(SEARCH($AK$422,'Hide this - Workings'!D70)),1,0),\"\")","v":""},{"$f":"IF($AL$423=1,IF(ISNUMBER(SEARCH($AK$423,'Hide this - Workings'!D70)),1,0),\"\")","v":""},{"$f":"IF($AL$424=1,IF(ISNUMBER(SEARCH($AK$424,'Hide this - Workings'!D70)),1,0),\"\")","v":""},{"$f":"IF($AL$425=1,IF(ISNUMBER(SEARCH($AK$425,'Hide this - Workings'!D70)),1,0),\"\")","v":""},{"$f":"IF($AL$426=1,IF(ISNUMBER(SEARCH($AK$426,'Hide this - Workings'!D70)),1,0),\"\")","v":""},{"$f":"IF($AL$427=1,IF(ISNUMBER(SEARCH($AK$427,'Hide this - Workings'!D70)),1,0),\"\")","v":""},{"$f":"IF($AL$428=1,IF(ISNUMBER(SEARCH($AK$428,'Hide this - Workings'!D70)),1,0),\"\")","v":""},{"$f":"IF($AL$429=1,IF(ISNUMBER(SEARCH($AK$429,'Hide this - Workings'!D70)),1,0),\"\")","v":""},{"$f":"IF($AL$430=1,IF(ISNUMBER(SEARCH($AK$430,'Hide this - Workings'!D70)),1,0),\"\")","v":""},{"$f":"IF($AL$431=1,IF(ISNUMBER(SEARCH($AK$431,'Hide this - Workings'!D70)),1,0),\"\")","v":""},{"$f":"IF($AL$432=1,IF(ISNUMBER(SEARCH($AK$432,'Hide this - Workings'!D70)),1,0),\"\")","v":""},{"$f":"IF($AL$433=1,IF(ISNUMBER(SEARCH($AK$433,'Hide this - Workings'!D70)),1,0),\"\")","v":""},0,"A066",0,"What changes have been made to the number of LAs since the 2018-19 release of the SALT/ASC-FR datasets? The following changes have occurred:\n- Bournemouth and Poole merged on 1st April 2019 to create a new authority, Bournemouth Christchurch and Poole. For the 19/20 annual collections, covering 1st April 2019 to 31st March 2020, there were 151 authorities rather than 152. Neighbouring Dorset, whilst retaining its name, now covers a reduced area.\n- Northamptonshire split on 1st April 2021 to create two new authorities, West Northamptonshire and North Northamptonshire.  For the 21/22 annual collections, covering 1st April 2021 to 31st March 2022, there were 152 authorities rather than 151.","What changes have been made to the number of LAs since the 2018-19 release of the SALT/ASC-FR datasets?","The following changes have occurred:\n- Bournemouth and Poole merged on 1st April 2019 to create a new authority, Bournemouth Christchurch and Poole. For the 19/20 annual collections, covering 1st April 2019 to 31st March 2020, there were 151 authorities rather than 152. Neighbouring Dorset, whilst retaining its name, now covers a reduced area.\n- Northamptonshire split on 1st April 2021 to create two new authorities, West Northamptonshire and North Northamptonshire.  For the 21/22 annual collections, covering 1st April 2021 to 31st March 2022, there were 152 authorities rather than 151."]
[null,null,"","In SALT, please can you confirm how residential admissions should be dealt with where there is a break in funding due to a hospital admission? We would regard this as one admission. When completing the return please feel free to provide any additional information in the relevant comments boxes.",null,null,null,null,null,null,null,"In SALT, please can you confirm how residential admissions should be dealt with where there is a break in funding due to a hospital admission?","We would regard this as one admission. When completing the return please feel free to provide any additional information in the relevant comments boxes.",{"$f":"IF($AL$417=1,IF(ISNUMBER(SEARCH($AK$417,'Hide this - Workings'!D71)),1,0),\"\")","v":""},{"$f":"IF($AL$418=1,IF(ISNUMBER(SEARCH($AK$418,'Hide this - Workings'!D71)),1,0),\"\")","v":""},{"$f":"IF($AL$419=1,IF(ISNUMBER(SEARCH($AK$419,'Hide this - Workings'!D71)),1,0),\"\")","v":""},{"$f":"IF($AL$420=1,IF(ISNUMBER(SEARCH($AK$420,'Hide this - Workings'!D71)),1,0),\"\")","v":""},{"$f":"IF($AL$421=1,IF(ISNUMBER(SEARCH($AK$421,'Hide this - Workings'!D71)),1,0),\"\")","v":""},{"$f":"IF($AL$422=1,IF(ISNUMBER(SEARCH($AK$422,'Hide this - Workings'!D71)),1,0),\"\")","v":""},{"$f":"IF($AL$423=1,IF(ISNUMBER(SEARCH($AK$423,'Hide this - Workings'!D71)),1,0),\"\")","v":""},{"$f":"IF($AL$424=1,IF(ISNUMBER(SEARCH($AK$424,'Hide this - Workings'!D71)),1,0),\"\")","v":""},{"$f":"IF($AL$425=1,IF(ISNUMBER(SEARCH($AK$425,'Hide this - Workings'!D71)),1,0),\"\")","v":""},{"$f":"IF($AL$426=1,IF(ISNUMBER(SEARCH($AK$426,'Hide this - Workings'!D71)),1,0),\"\")","v":""},{"$f":"IF($AL$427=1,IF(ISNUMBER(SEARCH($AK$427,'Hide this - Workings'!D71)),1,0),\"\")","v":""},{"$f":"IF($AL$428=1,IF(ISNUMBER(SEARCH($AK$428,'Hide this - Workings'!D71)),1,0),\"\")","v":""},{"$f":"IF($AL$429=1,IF(ISNUMBER(SEARCH($AK$429,'Hide this - Workings'!D71)),1,0),\"\")","v":""},{"$f":"IF($AL$430=1,IF(ISNUMBER(SEARCH($AK$430,'Hide this - Workings'!D71)),1,0),\"\")","v":""},{"$f":"IF($AL$431=1,IF(ISNUMBER(SEARCH($AK$431,'Hide this - Workings'!D71)),1,0),\"\")","v":""},{"$f":"IF($AL$432=1,IF(ISNUMBER(SEARCH($AK$432,'Hide this - Workings'!D71)),1,0),\"\")","v":""},{"$f":"IF($AL$433=1,IF(ISNUMBER(SEARCH($AK$433,'Hide this - Workings'!D71)),1,0),\"\")","v":""},0,"A067",0,"In SALT, please can you confirm how residential admissions should be dealt with where there is a break in funding due to a hospital admission? We would regard this as one admission. When completing the return please feel free to provide any additional information in the relevant comments boxes.","In SALT, please can you confirm how residential admissions should be dealt with where there is a break in funding due to a hospital admission?","We would regard this as one admission. When completing the return please feel free to provide any additional information in the relevant comments boxes."]
[null,null,"","Are there any official guidelines regarding how long a placement can be before it should be considered “long term” rather than “short term?” In short there is no definitive answer to this- There is not a specific time duration for the definition of Short-Term care, it is more regarding what form the care takes.  The SALT guidance can be regarded as prescriptive and open to interpretation so in some respect there is no right/wrong way to answer this.",null,null,null,null,null,null,null,"Are there any official guidelines regarding how long a placement can be before it should be considered “long term” rather than “short term?”","In short there is no definitive answer to this- There is not a specific time duration for the definition of Short-Term care, it is more regarding what form the care takes.  The SALT guidance can be regarded as prescriptive and open to interpretation so in some respect there is no right/wrong way to answer this.",{"$f":"IF($AL$417=1,IF(ISNUMBER(SEARCH($AK$417,'Hide this - Workings'!D72)),1,0),\"\")","v":""},{"$f":"IF($AL$418=1,IF(ISNUMBER(SEARCH($AK$418,'Hide this - Workings'!D72)),1,0),\"\")","v":""},{"$f":"IF($AL$419=1,IF(ISNUMBER(SEARCH($AK$419,'Hide this - Workings'!D72)),1,0),\"\")","v":""},{"$f":"IF($AL$420=1,IF(ISNUMBER(SEARCH($AK$420,'Hide this - Workings'!D72)),1,0),\"\")","v":""},{"$f":"IF($AL$421=1,IF(ISNUMBER(SEARCH($AK$421,'Hide this - Workings'!D72)),1,0),\"\")","v":""},{"$f":"IF($AL$422=1,IF(ISNUMBER(SEARCH($AK$422,'Hide this - Workings'!D72)),1,0),\"\")","v":""},{"$f":"IF($AL$423=1,IF(ISNUMBER(SEARCH($AK$423,'Hide this - Workings'!D72)),1,0),\"\")","v":""},{"$f":"IF($AL$424=1,IF(ISNUMBER(SEARCH($AK$424,'Hide this - Workings'!D72)),1,0),\"\")","v":""},{"$f":"IF($AL$425=1,IF(ISNUMBER(SEARCH($AK$425,'Hide this - Workings'!D72)),1,0),\"\")","v":""},{"$f":"IF($AL$426=1,IF(ISNUMBER(SEARCH($AK$426,'Hide this - Workings'!D72)),1,0),\"\")","v":""},{"$f":"IF($AL$427=1,IF(ISNUMBER(SEARCH($AK$427,'Hide this - Workings'!D72)),1,0),\"\")","v":""},{"$f":"IF($AL$428=1,IF(ISNUMBER(SEARCH($AK$428,'Hide this - Workings'!D72)),1,0),\"\")","v":""},{"$f":"IF($AL$429=1,IF(ISNUMBER(SEARCH($AK$429,'Hide this - Workings'!D72)),1,0),\"\")","v":""},{"$f":"IF($AL$430=1,IF(ISNUMBER(SEARCH($AK$430,'Hide this - Workings'!D72)),1,0),\"\")","v":""},{"$f":"IF($AL$431=1,IF(ISNUMBER(SEARCH($AK$431,'Hide this - Workings'!D72)),1,0),\"\")","v":""},{"$f":"IF($AL$432=1,IF(ISNUMBER(SEARCH($AK$432,'Hide this - Workings'!D72)),1,0),\"\")","v":""},{"$f":"IF($AL$433=1,IF(ISNUMBER(SEARCH($AK$433,'Hide this - Workings'!D72)),1,0),\"\")","v":""},0,"A068",0,"Are there any official guidelines regarding how long a placement can be before it should be considered “long term” rather than “short term?” In short there is no definitive answer to this- There is not a specific time duration for the definition of Short-Term care, it is more regarding what form the care takes.  The SALT guidance can be regarded as prescriptive and open to interpretation so in some respect there is no right/wrong way to answer this.","Are there any official guidelines regarding how long a placement can be before it should be considered “long term” rather than “short term?”","In short there is no definitive answer to this- There is not a specific time duration for the definition of Short-Term care, it is more regarding what form the care takes.  The SALT guidance can be regarded as prescriptive and open to interpretation so in some respect there is no right/wrong way to answer this."]
[null,null,"","Can data be resubmitted if incorrect? Data can be resubmitted up until the final deadline, at which point changes to the data can no longer be accepted. ",null,null,null,null,null,null,null,"Can data be resubmitted if incorrect?","Data can be resubmitted up until the final deadline, at which point changes to the data can no longer be accepted. ",{"$f":"IF($AL$417=1,IF(ISNUMBER(SEARCH($AK$417,'Hide this - Workings'!D73)),1,0),\"\")","v":""},{"$f":"IF($AL$418=1,IF(ISNUMBER(SEARCH($AK$418,'Hide this - Workings'!D73)),1,0),\"\")","v":""},{"$f":"IF($AL$419=1,IF(ISNUMBER(SEARCH($AK$419,'Hide this - Workings'!D73)),1,0),\"\")","v":""},{"$f":"IF($AL$420=1,IF(ISNUMBER(SEARCH($AK$420,'Hide this - Workings'!D73)),1,0),\"\")","v":""},{"$f":"IF($AL$421=1,IF(ISNUMBER(SEARCH($AK$421,'Hide this - Workings'!D73)),1,0),\"\")","v":""},{"$f":"IF($AL$422=1,IF(ISNUMBER(SEARCH($AK$422,'Hide this - Workings'!D73)),1,0),\"\")","v":""},{"$f":"IF($AL$423=1,IF(ISNUMBER(SEARCH($AK$423,'Hide this - Workings'!D73)),1,0),\"\")","v":""},{"$f":"IF($AL$424=1,IF(ISNUMBER(SEARCH($AK$424,'Hide this - Workings'!D73)),1,0),\"\")","v":""},{"$f":"IF($AL$425=1,IF(ISNUMBER(SEARCH($AK$425,'Hide this - Workings'!D73)),1,0),\"\")","v":""},{"$f":"IF($AL$426=1,IF(ISNUMBER(SEARCH($AK$426,'Hide this - Workings'!D73)),1,0),\"\")","v":""},{"$f":"IF($AL$427=1,IF(ISNUMBER(SEARCH($AK$427,'Hide this - Workings'!D73)),1,0),\"\")","v":""},{"$f":"IF($AL$428=1,IF(ISNUMBER(SEARCH($AK$428,'Hide this - Workings'!D73)),1,0),\"\")","v":""},{"$f":"IF($AL$429=1,IF(ISNUMBER(SEARCH($AK$429,'Hide this - Workings'!D73)),1,0),\"\")","v":""},{"$f":"IF($AL$430=1,IF(ISNUMBER(SEARCH($AK$430,'Hide this - Workings'!D73)),1,0),\"\")","v":""},{"$f":"IF($AL$431=1,IF(ISNUMBER(SEARCH($AK$431,'Hide this - Workings'!D73)),1,0),\"\")","v":""},{"$f":"IF($AL$432=1,IF(ISNUMBER(SEARCH($AK$432,'Hide this - Workings'!D73)),1,0),\"\")","v":""},{"$f":"IF($AL$433=1,IF(ISNUMBER(SEARCH($AK$433,'Hide this - Workings'!D73)),1,0),\"\")","v":""},0,"A069",0,"Can data be resubmitted if incorrect? Data can be resubmitted up until the final deadline, at which point changes to the data can no longer be accepted. ","Can data be resubmitted if incorrect?","Data can be resubmitted up until the final deadline, at which point changes to the data can no longer be accepted. "]
[null,null,"","Can Shared Lives carers be counted in LTS003? No. Exclude",null,null,null,null,null,null,null,"Can Shared Lives carers be counted in LTS003?","No. Exclude",{"$f":"IF($AL$417=1,IF(ISNUMBER(SEARCH($AK$417,'Hide this - Workings'!D74)),1,0),\"\")","v":""},{"$f":"IF($AL$418=1,IF(ISNUMBER(SEARCH($AK$418,'Hide this - Workings'!D74)),1,0),\"\")","v":""},{"$f":"IF($AL$419=1,IF(ISNUMBER(SEARCH($AK$419,'Hide this - Workings'!D74)),1,0),\"\")","v":""},{"$f":"IF($AL$420=1,IF(ISNUMBER(SEARCH($AK$420,'Hide this - Workings'!D74)),1,0),\"\")","v":""},{"$f":"IF($AL$421=1,IF(ISNUMBER(SEARCH($AK$421,'Hide this - Workings'!D74)),1,0),\"\")","v":""},{"$f":"IF($AL$422=1,IF(ISNUMBER(SEARCH($AK$422,'Hide this - Workings'!D74)),1,0),\"\")","v":""},{"$f":"IF($AL$423=1,IF(ISNUMBER(SEARCH($AK$423,'Hide this - Workings'!D74)),1,0),\"\")","v":""},{"$f":"IF($AL$424=1,IF(ISNUMBER(SEARCH($AK$424,'Hide this - Workings'!D74)),1,0),\"\")","v":""},{"$f":"IF($AL$425=1,IF(ISNUMBER(SEARCH($AK$425,'Hide this - Workings'!D74)),1,0),\"\")","v":""},{"$f":"IF($AL$426=1,IF(ISNUMBER(SEARCH($AK$426,'Hide this - Workings'!D74)),1,0),\"\")","v":""},{"$f":"IF($AL$427=1,IF(ISNUMBER(SEARCH($AK$427,'Hide this - Workings'!D74)),1,0),\"\")","v":""},{"$f":"IF($AL$428=1,IF(ISNUMBER(SEARCH($AK$428,'Hide this - Workings'!D74)),1,0),\"\")","v":""},{"$f":"IF($AL$429=1,IF(ISNUMBER(SEARCH($AK$429,'Hide this - Workings'!D74)),1,0),\"\")","v":""},{"$f":"IF($AL$430=1,IF(ISNUMBER(SEARCH($AK$430,'Hide this - Workings'!D74)),1,0),\"\")","v":""},{"$f":"IF($AL$431=1,IF(ISNUMBER(SEARCH($AK$431,'Hide this - Workings'!D74)),1,0),\"\")","v":""},{"$f":"IF($AL$432=1,IF(ISNUMBER(SEARCH($AK$432,'Hide this - Workings'!D74)),1,0),\"\")","v":""},{"$f":"IF($AL$433=1,IF(ISNUMBER(SEARCH($AK$433,'Hide this - Workings'!D74)),1,0),\"\")","v":""},0,"A070",0,"Can Shared Lives carers be counted in LTS003? No. Exclude","Can Shared Lives carers be counted in LTS003?","No. Exclude"]
[null,null,"","Can Supported Living carers be counted in LTS003? No. Exclude",null,null,null,null,null,null,null,"Can Supported Living carers be counted in LTS003?","No. Exclude",{"$f":"IF($AL$417=1,IF(ISNUMBER(SEARCH($AK$417,'Hide this - Workings'!D75)),1,0),\"\")","v":""},{"$f":"IF($AL$418=1,IF(ISNUMBER(SEARCH($AK$418,'Hide this - Workings'!D75)),1,0),\"\")","v":""},{"$f":"IF($AL$419=1,IF(ISNUMBER(SEARCH($AK$419,'Hide this - Workings'!D75)),1,0),\"\")","v":""},{"$f":"IF($AL$420=1,IF(ISNUMBER(SEARCH($AK$420,'Hide this - Workings'!D75)),1,0),\"\")","v":""},{"$f":"IF($AL$421=1,IF(ISNUMBER(SEARCH($AK$421,'Hide this - Workings'!D75)),1,0),\"\")","v":""},{"$f":"IF($AL$422=1,IF(ISNUMBER(SEARCH($AK$422,'Hide this - Workings'!D75)),1,0),\"\")","v":""},{"$f":"IF($AL$423=1,IF(ISNUMBER(SEARCH($AK$423,'Hide this - Workings'!D75)),1,0),\"\")","v":""},{"$f":"IF($AL$424=1,IF(ISNUMBER(SEARCH($AK$424,'Hide this - Workings'!D75)),1,0),\"\")","v":""},{"$f":"IF($AL$425=1,IF(ISNUMBER(SEARCH($AK$425,'Hide this - Workings'!D75)),1,0),\"\")","v":""},{"$f":"IF($AL$426=1,IF(ISNUMBER(SEARCH($AK$426,'Hide this - Workings'!D75)),1,0),\"\")","v":""},{"$f":"IF($AL$427=1,IF(ISNUMBER(SEARCH($AK$427,'Hide this - Workings'!D75)),1,0),\"\")","v":""},{"$f":"IF($AL$428=1,IF(ISNUMBER(SEARCH($AK$428,'Hide this - Workings'!D75)),1,0),\"\")","v":""},{"$f":"IF($AL$429=1,IF(ISNUMBER(SEARCH($AK$429,'Hide this - Workings'!D75)),1,0),\"\")","v":""},{"$f":"IF($AL$430=1,IF(ISNUMBER(SEARCH($AK$430,'Hide this - Workings'!D75)),1,0),\"\")","v":""},{"$f":"IF($AL$431=1,IF(ISNUMBER(SEARCH($AK$431,'Hide this - Workings'!D75)),1,0),\"\")","v":""},{"$f":"IF($AL$432=1,IF(ISNUMBER(SEARCH($AK$432,'Hide this - Workings'!D75)),1,0),\"\")","v":""},{"$f":"IF($AL$433=1,IF(ISNUMBER(SEARCH($AK$433,'Hide this - Workings'!D75)),1,0),\"\")","v":""},0,"A071",0,"Can Supported Living carers be counted in LTS003? No. Exclude","Can Supported Living carers be counted in LTS003?","No. Exclude"]
[null,null,"","Can Informal Carers be counted in LTS003? Yes. Include",null,null,null,null,null,null,null,"Can Informal Carers be counted in LTS003?","Yes. Include",{"$f":"IF($AL$417=1,IF(ISNUMBER(SEARCH($AK$417,'Hide this - Workings'!D76)),1,0),\"\")","v":""},{"$f":"IF($AL$418=1,IF(ISNUMBER(SEARCH($AK$418,'Hide this - Workings'!D76)),1,0),\"\")","v":""},{"$f":"IF($AL$419=1,IF(ISNUMBER(SEARCH($AK$419,'Hide this - Workings'!D76)),1,0),\"\")","v":""},{"$f":"IF($AL$420=1,IF(ISNUMBER(SEARCH($AK$420,'Hide this - Workings'!D76)),1,0),\"\")","v":""},{"$f":"IF($AL$421=1,IF(ISNUMBER(SEARCH($AK$421,'Hide this - Workings'!D76)),1,0),\"\")","v":""},{"$f":"IF($AL$422=1,IF(ISNUMBER(SEARCH($AK$422,'Hide this - Workings'!D76)),1,0),\"\")","v":""},{"$f":"IF($AL$423=1,IF(ISNUMBER(SEARCH($AK$423,'Hide this - Workings'!D76)),1,0),\"\")","v":""},{"$f":"IF($AL$424=1,IF(ISNUMBER(SEARCH($AK$424,'Hide this - Workings'!D76)),1,0),\"\")","v":""},{"$f":"IF($AL$425=1,IF(ISNUMBER(SEARCH($AK$425,'Hide this - Workings'!D76)),1,0),\"\")","v":""},{"$f":"IF($AL$426=1,IF(ISNUMBER(SEARCH($AK$426,'Hide this - Workings'!D76)),1,0),\"\")","v":""},{"$f":"IF($AL$427=1,IF(ISNUMBER(SEARCH($AK$427,'Hide this - Workings'!D76)),1,0),\"\")","v":""},{"$f":"IF($AL$428=1,IF(ISNUMBER(SEARCH($AK$428,'Hide this - Workings'!D76)),1,0),\"\")","v":""},{"$f":"IF($AL$429=1,IF(ISNUMBER(SEARCH($AK$429,'Hide this - Workings'!D76)),1,0),\"\")","v":""},{"$f":"IF($AL$430=1,IF(ISNUMBER(SEARCH($AK$430,'Hide this - Workings'!D76)),1,0),\"\")","v":""},{"$f":"IF($AL$431=1,IF(ISNUMBER(SEARCH($AK$431,'Hide this - Workings'!D76)),1,0),\"\")","v":""},{"$f":"IF($AL$432=1,IF(ISNUMBER(SEARCH($AK$432,'Hide this - Workings'!D76)),1,0),\"\")","v":""},{"$f":"IF($AL$433=1,IF(ISNUMBER(SEARCH($AK$433,'Hide this - Workings'!D76)),1,0),\"\")","v":""},0,"A072",0,"Can Informal Carers be counted in LTS003? Yes. Include","Can Informal Carers be counted in LTS003?","Yes. Include"]
[null,null,"","How should respite be included in SALT? While episodes of respite care may also be ‘time limited’, respite is usually provided as part of a longer-term support package and commissioned only due to the existence of a carer who needs that support. In SALT this is considered a carers’ service and not counted as ST-Max. Emergency support (i.e. a crisis support service) should be included in the Short Term Support (Other) category.",null,null,null,null,null,null,null,"How should respite be included in SALT?","While episodes of respite care may also be ‘time limited’, respite is usually provided as part of a longer-term support package and commissioned only due to the existence of a carer who needs that support. In SALT this is considered a carers’ service and not counted as ST-Max. Emergency support (i.e. a crisis support service) should be included in the Short Term Support (Other) category.",{"$f":"IF($AL$417=1,IF(ISNUMBER(SEARCH($AK$417,'Hide this - Workings'!D77)),1,0),\"\")","v":""},{"$f":"IF($AL$418=1,IF(ISNUMBER(SEARCH($AK$418,'Hide this - Workings'!D77)),1,0),\"\")","v":""},{"$f":"IF($AL$419=1,IF(ISNUMBER(SEARCH($AK$419,'Hide this - Workings'!D77)),1,0),\"\")","v":""},{"$f":"IF($AL$420=1,IF(ISNUMBER(SEARCH($AK$420,'Hide this - Workings'!D77)),1,0),\"\")","v":""},{"$f":"IF($AL$421=1,IF(ISNUMBER(SEARCH($AK$421,'Hide this - Workings'!D77)),1,0),\"\")","v":""},{"$f":"IF($AL$422=1,IF(ISNUMBER(SEARCH($AK$422,'Hide this - Workings'!D77)),1,0),\"\")","v":""},{"$f":"IF($AL$423=1,IF(ISNUMBER(SEARCH($AK$423,'Hide this - Workings'!D77)),1,0),\"\")","v":""},{"$f":"IF($AL$424=1,IF(ISNUMBER(SEARCH($AK$424,'Hide this - Workings'!D77)),1,0),\"\")","v":""},{"$f":"IF($AL$425=1,IF(ISNUMBER(SEARCH($AK$425,'Hide this - Workings'!D77)),1,0),\"\")","v":""},{"$f":"IF($AL$426=1,IF(ISNUMBER(SEARCH($AK$426,'Hide this - Workings'!D77)),1,0),\"\")","v":""},{"$f":"IF($AL$427=1,IF(ISNUMBER(SEARCH($AK$427,'Hide this - Workings'!D77)),1,0),\"\")","v":""},{"$f":"IF($AL$428=1,IF(ISNUMBER(SEARCH($AK$428,'Hide this - Workings'!D77)),1,0),\"\")","v":""},{"$f":"IF($AL$429=1,IF(ISNUMBER(SEARCH($AK$429,'Hide this - Workings'!D77)),1,0),\"\")","v":""},{"$f":"IF($AL$430=1,IF(ISNUMBER(SEARCH($AK$430,'Hide this - Workings'!D77)),1,0),\"\")","v":""},{"$f":"IF($AL$431=1,IF(ISNUMBER(SEARCH($AK$431,'Hide this - Workings'!D77)),1,0),\"\")","v":""},{"$f":"IF($AL$432=1,IF(ISNUMBER(SEARCH($AK$432,'Hide this - Workings'!D77)),1,0),\"\")","v":""},{"$f":"IF($AL$433=1,IF(ISNUMBER(SEARCH($AK$433,'Hide this - Workings'!D77)),1,0),\"\")","v":""},0,"A073",0,"How should respite be included in SALT? While episodes of respite care may also be ‘time limited’, respite is usually provided as part of a longer-term support package and commissioned only due to the existence of a carer who needs that support. In SALT this is considered a carers’ service and not counted as ST-Max. Emergency support (i.e. a crisis support service) should be included in the Short Term Support (Other) category.","How should respite be included in SALT?","While episodes of respite care may also be ‘time limited’, respite is usually provided as part of a longer-term support package and commissioned only due to the existence of a carer who needs that support. In SALT this is considered a carers’ service and not counted as ST-Max. Emergency support (i.e. a crisis support service) should be included in the Short Term Support (Other) category."]
[null,null,"","How should Asylum seekers be treated on the SALT return? Asylum seekers receive social support",null,null,null,null,null,null,null,"How should Asylum seekers be treated on the SALT return?","Asylum seekers receive social support",{"$f":"IF($AL$417=1,IF(ISNUMBER(SEARCH($AK$417,'Hide this - Workings'!D78)),1,0),\"\")","v":""},{"$f":"IF($AL$418=1,IF(ISNUMBER(SEARCH($AK$418,'Hide this - Workings'!D78)),1,0),\"\")","v":""},{"$f":"IF($AL$419=1,IF(ISNUMBER(SEARCH($AK$419,'Hide this - Workings'!D78)),1,0),\"\")","v":""},{"$f":"IF($AL$420=1,IF(ISNUMBER(SEARCH($AK$420,'Hide this - Workings'!D78)),1,0),\"\")","v":""},{"$f":"IF($AL$421=1,IF(ISNUMBER(SEARCH($AK$421,'Hide this - Workings'!D78)),1,0),\"\")","v":""},{"$f":"IF($AL$422=1,IF(ISNUMBER(SEARCH($AK$422,'Hide this - Workings'!D78)),1,0),\"\")","v":""},{"$f":"IF($AL$423=1,IF(ISNUMBER(SEARCH($AK$423,'Hide this - Workings'!D78)),1,0),\"\")","v":""},{"$f":"IF($AL$424=1,IF(ISNUMBER(SEARCH($AK$424,'Hide this - Workings'!D78)),1,0),\"\")","v":""},{"$f":"IF($AL$425=1,IF(ISNUMBER(SEARCH($AK$425,'Hide this - Workings'!D78)),1,0),\"\")","v":""},{"$f":"IF($AL$426=1,IF(ISNUMBER(SEARCH($AK$426,'Hide this - Workings'!D78)),1,0),\"\")","v":""},{"$f":"IF($AL$427=1,IF(ISNUMBER(SEARCH($AK$427,'Hide this - Workings'!D78)),1,0),\"\")","v":""},{"$f":"IF($AL$428=1,IF(ISNUMBER(SEARCH($AK$428,'Hide this - Workings'!D78)),1,0),\"\")","v":""},{"$f":"IF($AL$429=1,IF(ISNUMBER(SEARCH($AK$429,'Hide this - Workings'!D78)),1,0),\"\")","v":""},{"$f":"IF($AL$430=1,IF(ISNUMBER(SEARCH($AK$430,'Hide this - Workings'!D78)),1,0),\"\")","v":""},{"$f":"IF($AL$431=1,IF(ISNUMBER(SEARCH($AK$431,'Hide this - Workings'!D78)),1,0),\"\")","v":""},{"$f":"IF($AL$432=1,IF(ISNUMBER(SEARCH($AK$432,'Hide this - Workings'!D78)),1,0),\"\")","v":""},{"$f":"IF($AL$433=1,IF(ISNUMBER(SEARCH($AK$433,'Hide this - Workings'!D78)),1,0),\"\")","v":""},0,"A074",0,"How should Asylum seekers be treated on the SALT return? Asylum seekers receive social support","How should Asylum seekers be treated on the SALT return?","Asylum seekers receive social support"]
[null,null,"","How does one record information about a carer if their details (e.g. age band) are unknown? We would suggest looking at whether you are able to deduce by other means an assumption of the age band each of these carers falls into based on other available data.\nFor example, by looking at the relationship with the cared-for person / age of cared-for person, e.g. if they are married, you could estimate they are both in the same age band; if they are caring for a parent, subtract 20-25 years from the age of the cared-for person etc. You could also look at whether these carers appear elsewhere in the SALT tables, as they may also be a client in receipt of social care services themselves.\nIf you can obtain no details about the carer, there will be a validation breach. But if you record as much detail in the general comments (supplementary information) it will provide an explanation that we can refer to and use in the data quality report.",null,null,null,null,null,null,null,"How does one record information about a carer if their details (e.g. age band) are unknown?","We would suggest looking at whether you are able to deduce by other means an assumption of the age band each of these carers falls into based on other available data.\nFor example, by looking at the relationship with the cared-for person / age of cared-for person, e.g. if they are married, you could estimate they are both in the same age band; if they are caring for a parent, subtract 20-25 years from the age of the cared-for person etc. You could also look at whether these carers appear elsewhere in the SALT tables, as they may also be a client in receipt of social care services themselves.\nIf you can obtain no details about the carer, there will be a validation breach. But if you record as much detail in the general comments (supplementary information) it will provide an explanation that we can refer to and use in the data quality report.",{"$f":"IF($AL$417=1,IF(ISNUMBER(SEARCH($AK$417,'Hide this - Workings'!D79)),1,0),\"\")","v":""},{"$f":"IF($AL$418=1,IF(ISNUMBER(SEARCH($AK$418,'Hide this - Workings'!D79)),1,0),\"\")","v":""},{"$f":"IF($AL$419=1,IF(ISNUMBER(SEARCH($AK$419,'Hide this - Workings'!D79)),1,0),\"\")","v":""},{"$f":"IF($AL$420=1,IF(ISNUMBER(SEARCH($AK$420,'Hide this - Workings'!D79)),1,0),\"\")","v":""},{"$f":"IF($AL$421=1,IF(ISNUMBER(SEARCH($AK$421,'Hide this - Workings'!D79)),1,0),\"\")","v":""},{"$f":"IF($AL$422=1,IF(ISNUMBER(SEARCH($AK$422,'Hide this - Workings'!D79)),1,0),\"\")","v":""},{"$f":"IF($AL$423=1,IF(ISNUMBER(SEARCH($AK$423,'Hide this - Workings'!D79)),1,0),\"\")","v":""},{"$f":"IF($AL$424=1,IF(ISNUMBER(SEARCH($AK$424,'Hide this - Workings'!D79)),1,0),\"\")","v":""},{"$f":"IF($AL$425=1,IF(ISNUMBER(SEARCH($AK$425,'Hide this - Workings'!D79)),1,0),\"\")","v":""},{"$f":"IF($AL$426=1,IF(ISNUMBER(SEARCH($AK$426,'Hide this - Workings'!D79)),1,0),\"\")","v":""},{"$f":"IF($AL$427=1,IF(ISNUMBER(SEARCH($AK$427,'Hide this - Workings'!D79)),1,0),\"\")","v":""},{"$f":"IF($AL$428=1,IF(ISNUMBER(SEARCH($AK$428,'Hide this - Workings'!D79)),1,0),\"\")","v":""},{"$f":"IF($AL$429=1,IF(ISNUMBER(SEARCH($AK$429,'Hide this - Workings'!D79)),1,0),\"\")","v":""},{"$f":"IF($AL$430=1,IF(ISNUMBER(SEARCH($AK$430,'Hide this - Workings'!D79)),1,0),\"\")","v":""},{"$f":"IF($AL$431=1,IF(ISNUMBER(SEARCH($AK$431,'Hide this - Workings'!D79)),1,0),\"\")","v":""},{"$f":"IF($AL$432=1,IF(ISNUMBER(SEARCH($AK$432,'Hide this - Workings'!D79)),1,0),\"\")","v":""},{"$f":"IF($AL$433=1,IF(ISNUMBER(SEARCH($AK$433,'Hide this - Workings'!D79)),1,0),\"\")","v":""},0,"A075",0,"How does one record information about a carer if their details (e.g. age band) are unknown? We would suggest looking at whether you are able to deduce by other means an assumption of the age band each of these carers falls into based on other available data.\nFor example, by looking at the relationship with the cared-for person / age of cared-for person, e.g. if they are married, you could estimate they are both in the same age band; if they are caring for a parent, subtract 20-25 years from the age of the cared-for person etc. You could also look at whether these carers appear elsewhere in the SALT tables, as they may also be a client in receipt of social care services themselves.\nIf you can obtain no details about the carer, there will be a validation breach. But if you record as much detail in the general comments (supplementary information) it will provide an explanation that we can refer to and use in the data quality report.","How does one record information about a carer if their details (e.g. age band) are unknown?","We would suggest looking at whether you are able to deduce by other means an assumption of the age band each of these carers falls into based on other available data.\nFor example, by looking at the relationship with the cared-for person / age of cared-for person, e.g. if they are married, you could estimate they are both in the same age band; if they are caring for a parent, subtract 20-25 years from the age of the cared-for person etc. You could also look at whether these carers appear elsewhere in the SALT tables, as they may also be a client in receipt of social care services themselves.\nIf you can obtain no details about the carer, there will be a validation breach. But if you record as much detail in the general comments (supplementary information) it will provide an explanation that we can refer to and use in the data quality report."]
[null,null,"","How should we treat \"Other funded client\"? It is important to note that whilst this is an overarching principle of the SALT collection, it was agreed with DHSC that activity funded under How hospital discharge arrangements should be captured in SALT, so long as it meets the definition of care provided under the Care Act and is being commissioned by the LA.",null,null,null,null,null,null,null,"How should we treat \"Other funded client\"?","It is important to note that whilst this is an overarching principle of the SALT collection, it was agreed with DHSC that activity funded under How hospital discharge arrangements should be captured in SALT, so long as it meets the definition of care provided under the Care Act and is being commissioned by the LA.",{"$f":"IF($AL$417=1,IF(ISNUMBER(SEARCH($AK$417,'Hide this - Workings'!D80)),1,0),\"\")","v":""},{"$f":"IF($AL$418=1,IF(ISNUMBER(SEARCH($AK$418,'Hide this - Workings'!D80)),1,0),\"\")","v":""},{"$f":"IF($AL$419=1,IF(ISNUMBER(SEARCH($AK$419,'Hide this - Workings'!D80)),1,0),\"\")","v":""},{"$f":"IF($AL$420=1,IF(ISNUMBER(SEARCH($AK$420,'Hide this - Workings'!D80)),1,0),\"\")","v":""},{"$f":"IF($AL$421=1,IF(ISNUMBER(SEARCH($AK$421,'Hide this - Workings'!D80)),1,0),\"\")","v":""},{"$f":"IF($AL$422=1,IF(ISNUMBER(SEARCH($AK$422,'Hide this - Workings'!D80)),1,0),\"\")","v":""},{"$f":"IF($AL$423=1,IF(ISNUMBER(SEARCH($AK$423,'Hide this - Workings'!D80)),1,0),\"\")","v":""},{"$f":"IF($AL$424=1,IF(ISNUMBER(SEARCH($AK$424,'Hide this - Workings'!D80)),1,0),\"\")","v":""},{"$f":"IF($AL$425=1,IF(ISNUMBER(SEARCH($AK$425,'Hide this - Workings'!D80)),1,0),\"\")","v":""},{"$f":"IF($AL$426=1,IF(ISNUMBER(SEARCH($AK$426,'Hide this - Workings'!D80)),1,0),\"\")","v":""},{"$f":"IF($AL$427=1,IF(ISNUMBER(SEARCH($AK$427,'Hide this - Workings'!D80)),1,0),\"\")","v":""},{"$f":"IF($AL$428=1,IF(ISNUMBER(SEARCH($AK$428,'Hide this - Workings'!D80)),1,0),\"\")","v":""},{"$f":"IF($AL$429=1,IF(ISNUMBER(SEARCH($AK$429,'Hide this - Workings'!D80)),1,0),\"\")","v":""},{"$f":"IF($AL$430=1,IF(ISNUMBER(SEARCH($AK$430,'Hide this - Workings'!D80)),1,0),\"\")","v":""},{"$f":"IF($AL$431=1,IF(ISNUMBER(SEARCH($AK$431,'Hide this - Workings'!D80)),1,0),\"\")","v":""},{"$f":"IF($AL$432=1,IF(ISNUMBER(SEARCH($AK$432,'Hide this - Workings'!D80)),1,0),\"\")","v":""},{"$f":"IF($AL$433=1,IF(ISNUMBER(SEARCH($AK$433,'Hide this - Workings'!D80)),1,0),\"\")","v":""},0,"A076",0,"How should we treat \"Other funded client\"? It is important to note that whilst this is an overarching principle of the SALT collection, it was agreed with DHSC that activity funded under How hospital discharge arrangements should be captured in SALT, so long as it meets the definition of care provided under the Care Act and is being commissioned by the LA.","How should we treat \"Other funded client\"?","It is important to note that whilst this is an overarching principle of the SALT collection, it was agreed with DHSC that activity funded under How hospital discharge arrangements should be captured in SALT, so long as it meets the definition of care provided under the Care Act and is being commissioned by the LA."]
[null,null,"",{"$f":"L81&\" \"&M81","v":"Is there the option to capture non-binary / other gender? Within SALT, gender is defined as the gender the individual considers themselves to be. A new voluntary data item, ‘Other’, was added in 2020/21 for clients who do not identify as male or female."},null,null,null,null,null,null,null,"Is there the option to capture non-binary / other gender?","Within SALT, gender is defined as the gender the individual considers themselves to be. A new voluntary data item, ‘Other’, was added in 2020/21 for clients who do not identify as male or female.",{"$f":"IF($AL$417=1,IF(ISNUMBER(SEARCH($AK$417,'Hide this - Workings'!D81)),1,0),\"\")","v":""},{"$f":"IF($AL$418=1,IF(ISNUMBER(SEARCH($AK$418,'Hide this - Workings'!D81)),1,0),\"\")","v":""},{"$f":"IF($AL$419=1,IF(ISNUMBER(SEARCH($AK$419,'Hide this - Workings'!D81)),1,0),\"\")","v":""},{"$f":"IF($AL$420=1,IF(ISNUMBER(SEARCH($AK$420,'Hide this - Workings'!D81)),1,0),\"\")","v":""},{"$f":"IF($AL$421=1,IF(ISNUMBER(SEARCH($AK$421,'Hide this - Workings'!D81)),1,0),\"\")","v":""},{"$f":"IF($AL$422=1,IF(ISNUMBER(SEARCH($AK$422,'Hide this - Workings'!D81)),1,0),\"\")","v":""},{"$f":"IF($AL$423=1,IF(ISNUMBER(SEARCH($AK$423,'Hide this - Workings'!D81)),1,0),\"\")","v":""},{"$f":"IF($AL$424=1,IF(ISNUMBER(SEARCH($AK$424,'Hide this - Workings'!D81)),1,0),\"\")","v":""},{"$f":"IF($AL$425=1,IF(ISNUMBER(SEARCH($AK$425,'Hide this - Workings'!D81)),1,0),\"\")","v":""},{"$f":"IF($AL$426=1,IF(ISNUMBER(SEARCH($AK$426,'Hide this - Workings'!D81)),1,0),\"\")","v":""},{"$f":"IF($AL$427=1,IF(ISNUMBER(SEARCH($AK$427,'Hide this - Workings'!D81)),1,0),\"\")","v":""},{"$f":"IF($AL$428=1,IF(ISNUMBER(SEARCH($AK$428,'Hide this - Workings'!D81)),1,0),\"\")","v":""},{"$f":"IF($AL$429=1,IF(ISNUMBER(SEARCH($AK$429,'Hide this - Workings'!D81)),1,0),\"\")","v":""},{"$f":"IF($AL$430=1,IF(ISNUMBER(SEARCH($AK$430,'Hide this - Workings'!D81)),1,0),\"\")","v":""},{"$f":"IF($AL$431=1,IF(ISNUMBER(SEARCH($AK$431,'Hide this - Workings'!D81)),1,0),\"\")","v":""},{"$f":"IF($AL$432=1,IF(ISNUMBER(SEARCH($AK$432,'Hide this - Workings'!D81)),1,0),\"\")","v":""},{"$f":"IF($AL$433=1,IF(ISNUMBER(SEARCH($AK$433,'Hide this - Workings'!D81)),1,0),\"\")","v":""},0,"A077",0,"Is there the option to capture non-binary / other gender? Within SALT, gender is defined as the gender the individual considers themselves to be. A new voluntary data item, ‘Other’, was added in 2020/21 for clients who do not identify as male or female.","Is there the option to capture non-binary / other gender?","Within SALT, gender is defined as the gender the individual considers themselves to be. A new voluntary data item, ‘Other’, was added in 2020/21 for clients who do not identify as male or female."]
[null,null,"",{"$f":"L82&\" \"&M82","v":"I have a question around the sequel options for STS002A which I hope you can help to clarify please? I’ve looked at your FAQ’s and I’m still unsure of the correct sequel for the following scenario:\n\nA client was in receipt of a service to maximise their independence for 3 weeks or more. The client was making good progress and the family decided to take over the care – at this point we offered information and advice ( information about organisations in the community that can support and also gave them our front door contact details).\n\nAs the support had an impact, I don’t feel an early cessation sequel is the correct one so which of the following would you advise we use\n•\tNo services provided – Universal Services / Signposted to other services or\n•\tNo services provided – needs identified but declined service. We would agree that early cessation wouldn’t apply as the support had an impact but that our guidance specifically references where relatives take over the care, with regard to using early cessation. However, as you mention impact/making good progress this part of the guidance may be of use: Hierarchy of Sequels, Early Cessation of ST-Max , Early Cessation of Service (not leading to long term support) – other reason. This sequel should be used for all other instances of ST-Max ending early where long-term social care support does not result. For example, the client may move (or be moved) out of the local area, perhaps to live under the care of relatives. Or relatives may decide mid-way through the period of support to take over that support, forcing ST-Max to end.  There is a ‘grey area’ between support ending prior to the original scheduled end date but with enough time to judge the impact on the client, and support which ends so soon that there cannot be any opportunity for ST-Max to have an impact. With the guidance not being prescriptive this could be an instance where it is down to interpretation, therefore you could chose whatever of the two options is most appropriate. You can also add additional information in the comments box"},null,null,null,null,null,null,null,"I have a question around the sequel options for STS002A which I hope you can help to clarify please? I’ve looked at your FAQ’s and I’m still unsure of the correct sequel for the following scenario:\n\nA client was in receipt of a service to maximise their independence for 3 weeks or more. The client was making good progress and the family decided to take over the care – at this point we offered information and advice ( information about organisations in the community that can support and also gave them our front door contact details).\n\nAs the support had an impact, I don’t feel an early cessation sequel is the correct one so which of the following would you advise we use\n•\tNo services provided – Universal Services / Signposted to other services or\n•\tNo services provided – needs identified but declined service.","We would agree that early cessation wouldn’t apply as the support had an impact but that our guidance specifically references where relatives take over the care, with regard to using early cessation. However, as you mention impact/making good progress this part of the guidance may be of use: Hierarchy of Sequels, Early Cessation of ST-Max , Early Cessation of Service (not leading to long term support) – other reason. This sequel should be used for all other instances of ST-Max ending early where long-term social care support does not result. For example, the client may move (or be moved) out of the local area, perhaps to live under the care of relatives. Or relatives may decide mid-way through the period of support to take over that support, forcing ST-Max to end.  There is a ‘grey area’ between support ending prior to the original scheduled end date but with enough time to judge the impact on the client, and support which ends so soon that there cannot be any opportunity for ST-Max to have an impact. With the guidance not being prescriptive this could be an instance where it is down to interpretation, therefore you could chose whatever of the two options is most appropriate. You can also add additional information in the comments box",{"$f":"IF($AL$417=1,IF(ISNUMBER(SEARCH($AK$417,'Hide this - Workings'!D82)),1,0),\"\")","v":""},{"$f":"IF($AL$418=1,IF(ISNUMBER(SEARCH($AK$418,'Hide this - Workings'!D82)),1,0),\"\")","v":""},{"$f":"IF($AL$419=1,IF(ISNUMBER(SEARCH($AK$419,'Hide this - Workings'!D82)),1,0),\"\")","v":""},{"$f":"IF($AL$420=1,IF(ISNUMBER(SEARCH($AK$420,'Hide this - Workings'!D82)),1,0),\"\")","v":""},{"$f":"IF($AL$421=1,IF(ISNUMBER(SEARCH($AK$421,'Hide this - Workings'!D82)),1,0),\"\")","v":""},{"$f":"IF($AL$422=1,IF(ISNUMBER(SEARCH($AK$422,'Hide this - Workings'!D82)),1,0),\"\")","v":""},{"$f":"IF($AL$423=1,IF(ISNUMBER(SEARCH($AK$423,'Hide this - Workings'!D82)),1,0),\"\")","v":""},{"$f":"IF($AL$424=1,IF(ISNUMBER(SEARCH($AK$424,'Hide this - Workings'!D82)),1,0),\"\")","v":""},{"$f":"IF($AL$425=1,IF(ISNUMBER(SEARCH($AK$425,'Hide this - Workings'!D82)),1,0),\"\")","v":""},{"$f":"IF($AL$426=1,IF(ISNUMBER(SEARCH($AK$426,'Hide this - Workings'!D82)),1,0),\"\")","v":""},{"$f":"IF($AL$427=1,IF(ISNUMBER(SEARCH($AK$427,'Hide this - Workings'!D82)),1,0),\"\")","v":""},{"$f":"IF($AL$428=1,IF(ISNUMBER(SEARCH($AK$428,'Hide this - Workings'!D82)),1,0),\"\")","v":""},{"$f":"IF($AL$429=1,IF(ISNUMBER(SEARCH($AK$429,'Hide this - Workings'!D82)),1,0),\"\")","v":""},{"$f":"IF($AL$430=1,IF(ISNUMBER(SEARCH($AK$430,'Hide this - Workings'!D82)),1,0),\"\")","v":""},{"$f":"IF($AL$431=1,IF(ISNUMBER(SEARCH($AK$431,'Hide this - Workings'!D82)),1,0),\"\")","v":""},{"$f":"IF($AL$432=1,IF(ISNUMBER(SEARCH($AK$432,'Hide this - Workings'!D82)),1,0),\"\")","v":""},{"$f":"IF($AL$433=1,IF(ISNUMBER(SEARCH($AK$433,'Hide this - Workings'!D82)),1,0),\"\")","v":""},0,"A078",0,"I have a question around the sequel options for STS002A which I hope you can help to clarify please? I’ve looked at your FAQ’s and I’m still unsure of the correct sequel for the following scenario:\n\nA client was in receipt of a service to maximise their independence for 3 weeks or more. The client was making good progress and the family decided to take over the care – at this point we offered information and advice ( information about organisations in the community that can support and also gave them our front door contact details).\n\nAs the support had an impact, I don’t feel an early cessation sequel is the correct one so which of the following would you advise we use\n•\tNo services provided – Universal Services / Signposted to other services or\n•\tNo services provided – needs identified but declined service. We would agree that early cessation wouldn’t apply as the support had an impact but that our guidance specifically references where relatives take over the care, with regard to using early cessation. However, as you mention impact/making good progress this part of the guidance may be of use: Hierarchy of Sequels, Early Cessation of ST-Max , Early Cessation of Service (not leading to long term support) – other reason. This sequel should be used for all other instances of ST-Max ending early where long-term social care support does not result. For example, the client may move (or be moved) out of the local area, perhaps to live under the care of relatives. Or relatives may decide mid-way through the period of support to take over that support, forcing ST-Max to end.  There is a ‘grey area’ between support ending prior to the original scheduled end date but with enough time to judge the impact on the client, and support which ends so soon that there cannot be any opportunity for ST-Max to have an impact. With the guidance not being prescriptive this could be an instance where it is down to interpretation, therefore you could chose whatever of the two options is most appropriate. You can also add additional information in the comments box","I have a question around the sequel options for STS002A which I hope you can help to clarify please? I’ve looked at your FAQ’s and I’m still unsure of the correct sequel for the following scenario:\n\nA client was in receipt of a service to maximise their independence for 3 weeks or more. The client was making good progress and the family decided to take over the care – at this point we offered information and advice ( information about organisations in the community that can support and also gave them our front door contact details).\n\nAs the support had an impact, I don’t feel an early cessation sequel is the correct one so which of the following would you advise we use\n•\tNo services provided – Universal Services / Signposted to other services or\n•\tNo services provided – needs identified but declined service.","We would agree that early cessation wouldn’t apply as the support had an impact but that our guidance specifically references where relatives take over the care, with regard to using early cessation. However, as you mention impact/making good progress this part of the guidance may be of use: Hierarchy of Sequels, Early Cessation of ST-Max , Early Cessation of Service (not leading to long term support) – other reason. This sequel should be used for all other instances of ST-Max ending early where long-term social care support does not result. For example, the client may move (or be moved) out of the local area, perhaps to live under the care of relatives. Or relatives may decide mid-way through the period of support to take over that support, forcing ST-Max to end.  There is a ‘grey area’ between support ending prior to the original scheduled end date but with enough time to judge the impact on the client, and support which ends so soon that there cannot be any opportunity for ST-Max to have an impact. With the guidance not being prescriptive this could be an instance where it is down to interpretation, therefore you could chose whatever of the two options is most appropriate. You can also add additional information in the comments box"]
[null,null,"","Recently we have been asked to review our recording of home care/personal care calls for clients that include an element of providing/prompting medication as we have been informed that the medication element can be funded by Health.\n \nMy manager has asked me to query whether this activity can still be included in our reporting in relation to SALT as in many cases it would be part of a long term support care package. As the medication call is still part of the package of care commissioned and care managed by us, should it be excluded from our long term services/short term services as it is funded by Health or can it be included as it is commissioned by us? If it is just medication alone then this would not be included: “Other clients whose support is not funded by the local authority or where there is no social care component (e.g. 100% health funded clients) are excluded from all measures. This includes clients where care arrangements are put in place by the local authority on behalf of the NHS and/or the costs recharged to them.” However, if it’s part of a long term support package, then the client would still be recorded in SALT for those recognised social care components of the package.  On its own wouldn’t be included in SALT.",null,null,null,null,null,null,null,"Recently we have been asked to review our recording of home care/personal care calls for clients that include an element of providing/prompting medication as we have been informed that the medication element can be funded by Health.\n \nMy manager has asked me to query whether this activity can still be included in our reporting in relation to SALT as in many cases it would be part of a long term support care package. As the medication call is still part of the package of care commissioned and care managed by us, should it be excluded from our long term services/short term services as it is funded by Health or can it be included as it is commissioned by us?","If it is just medication alone then this would not be included: “Other clients whose support is not funded by the local authority or where there is no social care component (e.g. 100% health funded clients) are excluded from all measures. This includes clients where care arrangements are put in place by the local authority on behalf of the NHS and/or the costs recharged to them.” However, if it’s part of a long term support package, then the client would still be recorded in SALT for those recognised social care components of the package.  On its own wouldn’t be included in SALT.",{"$f":"IF($AL$417=1,IF(ISNUMBER(SEARCH($AK$417,'Hide this - Workings'!D83)),1,0),\"\")","v":""},{"$f":"IF($AL$418=1,IF(ISNUMBER(SEARCH($AK$418,'Hide this - Workings'!D83)),1,0),\"\")","v":""},{"$f":"IF($AL$419=1,IF(ISNUMBER(SEARCH($AK$419,'Hide this - Workings'!D83)),1,0),\"\")","v":""},{"$f":"IF($AL$420=1,IF(ISNUMBER(SEARCH($AK$420,'Hide this - Workings'!D83)),1,0),\"\")","v":""},{"$f":"IF($AL$421=1,IF(ISNUMBER(SEARCH($AK$421,'Hide this - Workings'!D83)),1,0),\"\")","v":""},{"$f":"IF($AL$422=1,IF(ISNUMBER(SEARCH($AK$422,'Hide this - Workings'!D83)),1,0),\"\")","v":""},{"$f":"IF($AL$423=1,IF(ISNUMBER(SEARCH($AK$423,'Hide this - Workings'!D83)),1,0),\"\")","v":""},{"$f":"IF($AL$424=1,IF(ISNUMBER(SEARCH($AK$424,'Hide this - Workings'!D83)),1,0),\"\")","v":""},{"$f":"IF($AL$425=1,IF(ISNUMBER(SEARCH($AK$425,'Hide this - Workings'!D83)),1,0),\"\")","v":""},{"$f":"IF($AL$426=1,IF(ISNUMBER(SEARCH($AK$426,'Hide this - Workings'!D83)),1,0),\"\")","v":""},{"$f":"IF($AL$427=1,IF(ISNUMBER(SEARCH($AK$427,'Hide this - Workings'!D83)),1,0),\"\")","v":""},{"$f":"IF($AL$428=1,IF(ISNUMBER(SEARCH($AK$428,'Hide this - Workings'!D83)),1,0),\"\")","v":""},{"$f":"IF($AL$429=1,IF(ISNUMBER(SEARCH($AK$429,'Hide this - Workings'!D83)),1,0),\"\")","v":""},{"$f":"IF($AL$430=1,IF(ISNUMBER(SEARCH($AK$430,'Hide this - Workings'!D83)),1,0),\"\")","v":""},{"$f":"IF($AL$431=1,IF(ISNUMBER(SEARCH($AK$431,'Hide this - Workings'!D83)),1,0),\"\")","v":""},{"$f":"IF($AL$432=1,IF(ISNUMBER(SEARCH($AK$432,'Hide this - Workings'!D83)),1,0),\"\")","v":""},{"$f":"IF($AL$433=1,IF(ISNUMBER(SEARCH($AK$433,'Hide this - Workings'!D83)),1,0),\"\")","v":""},0,"A079",0,"Recently we have been asked to review our recording of home care/personal care calls for clients that include an element of providing/prompting medication as we have been informed that the medication element can be funded by Health.\n \nMy manager has asked me to query whether this activity can still be included in our reporting in relation to SALT as in many cases it would be part of a long term support care package. As the medication call is still part of the package of care commissioned and care managed by us, should it be excluded from our long term services/short term services as it is funded by Health or can it be included as it is commissioned by us? If it is just medication alone then this would not be included: “Other clients whose support is not funded by the local authority or where there is no social care component (e.g. 100% health funded clients) are excluded from all measures. This includes clients where care arrangements are put in place by the local authority on behalf of the NHS and/or the costs recharged to them.” However, if it’s part of a long term support package, then the client would still be recorded in SALT for those recognised social care components of the package.  On its own wouldn’t be included in SALT.","Recently we have been asked to review our recording of home care/personal care calls for clients that include an element of providing/prompting medication as we have been informed that the medication element can be funded by Health.\n \nMy manager has asked me to query whether this activity can still be included in our reporting in relation to SALT as in many cases it would be part of a long term support care package. As the medication call is still part of the package of care commissioned and care managed by us, should it be excluded from our long term services/short term services as it is funded by Health or can it be included as it is commissioned by us?","If it is just medication alone then this would not be included: “Other clients whose support is not funded by the local authority or where there is no social care component (e.g. 100% health funded clients) are excluded from all measures. This includes clients where care arrangements are put in place by the local authority on behalf of the NHS and/or the costs recharged to them.” However, if it’s part of a long term support package, then the client would still be recorded in SALT for those recognised social care components of the package.  On its own wouldn’t be included in SALT."]
[null,null,"","If a service user is in receipt of supported living support since 1st April 2019. In terms of LTS001 should this service provision be counted as long-term support? The client would be classed under as community support, under the delivery mechanism the provision is covered by (e.g. direct payment, commissioned etc).\n",null,null,null,null,null,null,null,"If a service user is in receipt of supported living support since 1st April 2019. In terms of LTS001 should this service provision be counted as long-term support?","The client would be classed under as community support, under the delivery mechanism the provision is covered by (e.g. direct payment, commissioned etc).\n",{"$f":"IF($AL$417=1,IF(ISNUMBER(SEARCH($AK$417,'Hide this - Workings'!D84)),1,0),\"\")","v":""},{"$f":"IF($AL$418=1,IF(ISNUMBER(SEARCH($AK$418,'Hide this - Workings'!D84)),1,0),\"\")","v":""},{"$f":"IF($AL$419=1,IF(ISNUMBER(SEARCH($AK$419,'Hide this - Workings'!D84)),1,0),\"\")","v":""},{"$f":"IF($AL$420=1,IF(ISNUMBER(SEARCH($AK$420,'Hide this - Workings'!D84)),1,0),\"\")","v":""},{"$f":"IF($AL$421=1,IF(ISNUMBER(SEARCH($AK$421,'Hide this - Workings'!D84)),1,0),\"\")","v":""},{"$f":"IF($AL$422=1,IF(ISNUMBER(SEARCH($AK$422,'Hide this - Workings'!D84)),1,0),\"\")","v":""},{"$f":"IF($AL$423=1,IF(ISNUMBER(SEARCH($AK$423,'Hide this - Workings'!D84)),1,0),\"\")","v":""},{"$f":"IF($AL$424=1,IF(ISNUMBER(SEARCH($AK$424,'Hide this - Workings'!D84)),1,0),\"\")","v":""},{"$f":"IF($AL$425=1,IF(ISNUMBER(SEARCH($AK$425,'Hide this - Workings'!D84)),1,0),\"\")","v":""},{"$f":"IF($AL$426=1,IF(ISNUMBER(SEARCH($AK$426,'Hide this - Workings'!D84)),1,0),\"\")","v":""},{"$f":"IF($AL$427=1,IF(ISNUMBER(SEARCH($AK$427,'Hide this - Workings'!D84)),1,0),\"\")","v":""},{"$f":"IF($AL$428=1,IF(ISNUMBER(SEARCH($AK$428,'Hide this - Workings'!D84)),1,0),\"\")","v":""},{"$f":"IF($AL$429=1,IF(ISNUMBER(SEARCH($AK$429,'Hide this - Workings'!D84)),1,0),\"\")","v":""},{"$f":"IF($AL$430=1,IF(ISNUMBER(SEARCH($AK$430,'Hide this - Workings'!D84)),1,0),\"\")","v":""},{"$f":"IF($AL$431=1,IF(ISNUMBER(SEARCH($AK$431,'Hide this - Workings'!D84)),1,0),\"\")","v":""},{"$f":"IF($AL$432=1,IF(ISNUMBER(SEARCH($AK$432,'Hide this - Workings'!D84)),1,0),\"\")","v":""},{"$f":"IF($AL$433=1,IF(ISNUMBER(SEARCH($AK$433,'Hide this - Workings'!D84)),1,0),\"\")","v":""},0,"A080",0,"If a service user is in receipt of supported living support since 1st April 2019. In terms of LTS001 should this service provision be counted as long-term support? The client would be classed under as community support, under the delivery mechanism the provision is covered by (e.g. direct payment, commissioned etc).\n","If a service user is in receipt of supported living support since 1st April 2019. In terms of LTS001 should this service provision be counted as long-term support?","The client would be classed under as community support, under the delivery mechanism the provision is covered by (e.g. direct payment, commissioned etc).\n"]
[null,null,"","In our recent SALT return, we were identified as having a high number of contacts ending in ‘no services provided’. On investigating these in more detail, some of them appear to be contacts received by our customer service centre (CSC) from a hospital, but as the client is not yet medically fit for discharge, no action is taken and therefore no services are provided. We would close this contact and pick it up again at a more suitable time through a second contact. \n\nAre these correctly being recorded? We’ve had discussions internally, but have reached two possible outcomes:\n\n1) Record information and advice instead. We’re not doing ‘nothing’ on these cases. CSC have already started to gather information on the discharge. And we are only advising of our process and that we will pick the case up at a more suitable time. \n\n2) Continue as is with ‘no services provided’. Telling a health staff member that we are closing a case cannot be classified as giving advice, even if you stretch it to imply that we advised them we are closing it. CSC’s process means we have a high number of ‘no service’ outcomes, but that is in fact a true picture of what happened to that referral. With regards to this question we would look at the following excerpt from the SALT guidance: “If multiple requests for support are made within a short period of time for the same client and presenting issue, then only one request should be counted.”",null,null,null,null,null,null,null,"In our recent SALT return, we were identified as having a high number of contacts ending in ‘no services provided’. On investigating these in more detail, some of them appear to be contacts received by our customer service centre (CSC) from a hospital, but as the client is not yet medically fit for discharge, no action is taken and therefore no services are provided. We would close this contact and pick it up again at a more suitable time through a second contact. \n\nAre these correctly being recorded? We’ve had discussions internally, but have reached two possible outcomes:\n\n1) Record information and advice instead. We’re not doing ‘nothing’ on these cases. CSC have already started to gather information on the discharge. And we are only advising of our process and that we will pick the case up at a more suitable time. \n\n2) Continue as is with ‘no services provided’. Telling a health staff member that we are closing a case cannot be classified as giving advice, even if you stretch it to imply that we advised them we are closing it. CSC’s process means we have a high number of ‘no service’ outcomes, but that is in fact a true picture of what happened to that referral.","With regards to this question we would look at the following excerpt from the SALT guidance: “If multiple requests for support are made within a short period of time for the same client and presenting issue, then only one request should be counted.”",{"$f":"IF($AL$417=1,IF(ISNUMBER(SEARCH($AK$417,'Hide this - Workings'!D85)),1,0),\"\")","v":""},{"$f":"IF($AL$418=1,IF(ISNUMBER(SEARCH($AK$418,'Hide this - Workings'!D85)),1,0),\"\")","v":""},{"$f":"IF($AL$419=1,IF(ISNUMBER(SEARCH($AK$419,'Hide this - Workings'!D85)),1,0),\"\")","v":""},{"$f":"IF($AL$420=1,IF(ISNUMBER(SEARCH($AK$420,'Hide this - Workings'!D85)),1,0),\"\")","v":""},{"$f":"IF($AL$421=1,IF(ISNUMBER(SEARCH($AK$421,'Hide this - Workings'!D85)),1,0),\"\")","v":""},{"$f":"IF($AL$422=1,IF(ISNUMBER(SEARCH($AK$422,'Hide this - Workings'!D85)),1,0),\"\")","v":""},{"$f":"IF($AL$423=1,IF(ISNUMBER(SEARCH($AK$423,'Hide this - Workings'!D85)),1,0),\"\")","v":""},{"$f":"IF($AL$424=1,IF(ISNUMBER(SEARCH($AK$424,'Hide this - Workings'!D85)),1,0),\"\")","v":""},{"$f":"IF($AL$425=1,IF(ISNUMBER(SEARCH($AK$425,'Hide this - Workings'!D85)),1,0),\"\")","v":""},{"$f":"IF($AL$426=1,IF(ISNUMBER(SEARCH($AK$426,'Hide this - Workings'!D85)),1,0),\"\")","v":""},{"$f":"IF($AL$427=1,IF(ISNUMBER(SEARCH($AK$427,'Hide this - Workings'!D85)),1,0),\"\")","v":""},{"$f":"IF($AL$428=1,IF(ISNUMBER(SEARCH($AK$428,'Hide this - Workings'!D85)),1,0),\"\")","v":""},{"$f":"IF($AL$429=1,IF(ISNUMBER(SEARCH($AK$429,'Hide this - Workings'!D85)),1,0),\"\")","v":""},{"$f":"IF($AL$430=1,IF(ISNUMBER(SEARCH($AK$430,'Hide this - Workings'!D85)),1,0),\"\")","v":""},{"$f":"IF($AL$431=1,IF(ISNUMBER(SEARCH($AK$431,'Hide this - Workings'!D85)),1,0),\"\")","v":""},{"$f":"IF($AL$432=1,IF(ISNUMBER(SEARCH($AK$432,'Hide this - Workings'!D85)),1,0),\"\")","v":""},{"$f":"IF($AL$433=1,IF(ISNUMBER(SEARCH($AK$433,'Hide this - Workings'!D85)),1,0),\"\")","v":""},0,"A081",0,"In our recent SALT return, we were identified as having a high number of contacts ending in ‘no services provided’. On investigating these in more detail, some of them appear to be contacts received by our customer service centre (CSC) from a hospital, but as the client is not yet medically fit for discharge, no action is taken and therefore no services are provided. We would close this contact and pick it up again at a more suitable time through a second contact. \n\nAre these correctly being recorded? We’ve had discussions internally, but have reached two possible outcomes:\n\n1) Record information and advice instead. We’re not doing ‘nothing’ on these cases. CSC have already started to gather information on the discharge. And we are only advising of our process and that we will pick the case up at a more suitable time. \n\n2) Continue as is with ‘no services provided’. Telling a health staff member that we are closing a case cannot be classified as giving advice, even if you stretch it to imply that we advised them we are closing it. CSC’s process means we have a high number of ‘no service’ outcomes, but that is in fact a true picture of what happened to that referral. With regards to this question we would look at the following excerpt from the SALT guidance: “If multiple requests for support are made within a short period of time for the same client and presenting issue, then only one request should be counted.”","In our recent SALT return, we were identified as having a high number of contacts ending in ‘no services provided’. On investigating these in more detail, some of them appear to be contacts received by our customer service centre (CSC) from a hospital, but as the client is not yet medically fit for discharge, no action is taken and therefore no services are provided. We would close this contact and pick it up again at a more suitable time through a second contact. \n\nAre these correctly being recorded? We’ve had discussions internally, but have reached two possible outcomes:\n\n1) Record information and advice instead. We’re not doing ‘nothing’ on these cases. CSC have already started to gather information on the discharge. And we are only advising of our process and that we will pick the case up at a more suitable time. \n\n2) Continue as is with ‘no services provided’. Telling a health staff member that we are closing a case cannot be classified as giving advice, even if you stretch it to imply that we advised them we are closing it. CSC’s process means we have a high number of ‘no service’ outcomes, but that is in fact a true picture of what happened to that referral.","With regards to this question we would look at the following excerpt from the SALT guidance: “If multiple requests for support are made within a short period of time for the same client and presenting issue, then only one request should be counted.”"]
[null,null,"","I have a question about carers included in LTS003 table 1. \n\nIf a client has two carers would both carers be included in LTS003 table 1 if both received support during the reporting period, or would only one carer to be included? According to the SALT guidance: “As defined in the ASC Data Dictionary, clients may have support provided by an unpaid carer. This includes support from family, friends and neighbours where the client has identified “there is someone who helps me”. Paid care workers funded by direct payments, provided as part of a commissioned service or in a residential and nursing care setting are not in the scope of the SALT collection and so should not be counted as ‘carers’. Similarly, those in a prison setting should also not be counted as having a carer.” Therefore, as long as the carer is not paid, please include. Also feel free to include further information in the commentary box.",null,null,null,null,null,null,null,"I have a question about carers included in LTS003 table 1. \n\nIf a client has two carers would both carers be included in LTS003 table 1 if both received support during the reporting period, or would only one carer to be included?","According to the SALT guidance: “As defined in the ASC Data Dictionary, clients may have support provided by an unpaid carer. This includes support from family, friends and neighbours where the client has identified “there is someone who helps me”. Paid care workers funded by direct payments, provided as part of a commissioned service or in a residential and nursing care setting are not in the scope of the SALT collection and so should not be counted as ‘carers’. Similarly, those in a prison setting should also not be counted as having a carer.” Therefore, as long as the carer is not paid, please include. Also feel free to include further information in the commentary box.",{"$f":"IF($AL$417=1,IF(ISNUMBER(SEARCH($AK$417,'Hide this - Workings'!D86)),1,0),\"\")","v":""},{"$f":"IF($AL$418=1,IF(ISNUMBER(SEARCH($AK$418,'Hide this - Workings'!D86)),1,0),\"\")","v":""},{"$f":"IF($AL$419=1,IF(ISNUMBER(SEARCH($AK$419,'Hide this - Workings'!D86)),1,0),\"\")","v":""},{"$f":"IF($AL$420=1,IF(ISNUMBER(SEARCH($AK$420,'Hide this - Workings'!D86)),1,0),\"\")","v":""},{"$f":"IF($AL$421=1,IF(ISNUMBER(SEARCH($AK$421,'Hide this - Workings'!D86)),1,0),\"\")","v":""},{"$f":"IF($AL$422=1,IF(ISNUMBER(SEARCH($AK$422,'Hide this - Workings'!D86)),1,0),\"\")","v":""},{"$f":"IF($AL$423=1,IF(ISNUMBER(SEARCH($AK$423,'Hide this - Workings'!D86)),1,0),\"\")","v":""},{"$f":"IF($AL$424=1,IF(ISNUMBER(SEARCH($AK$424,'Hide this - Workings'!D86)),1,0),\"\")","v":""},{"$f":"IF($AL$425=1,IF(ISNUMBER(SEARCH($AK$425,'Hide this - Workings'!D86)),1,0),\"\")","v":""},{"$f":"IF($AL$426=1,IF(ISNUMBER(SEARCH($AK$426,'Hide this - Workings'!D86)),1,0),\"\")","v":""},{"$f":"IF($AL$427=1,IF(ISNUMBER(SEARCH($AK$427,'Hide this - Workings'!D86)),1,0),\"\")","v":""},{"$f":"IF($AL$428=1,IF(ISNUMBER(SEARCH($AK$428,'Hide this - Workings'!D86)),1,0),\"\")","v":""},{"$f":"IF($AL$429=1,IF(ISNUMBER(SEARCH($AK$429,'Hide this - Workings'!D86)),1,0),\"\")","v":""},{"$f":"IF($AL$430=1,IF(ISNUMBER(SEARCH($AK$430,'Hide this - Workings'!D86)),1,0),\"\")","v":""},{"$f":"IF($AL$431=1,IF(ISNUMBER(SEARCH($AK$431,'Hide this - Workings'!D86)),1,0),\"\")","v":""},{"$f":"IF($AL$432=1,IF(ISNUMBER(SEARCH($AK$432,'Hide this - Workings'!D86)),1,0),\"\")","v":""},{"$f":"IF($AL$433=1,IF(ISNUMBER(SEARCH($AK$433,'Hide this - Workings'!D86)),1,0),\"\")","v":""},0,"A082",0,"I have a question about carers included in LTS003 table 1. \n\nIf a client has two carers would both carers be included in LTS003 table 1 if both received support during the reporting period, or would only one carer to be included? According to the SALT guidance: “As defined in the ASC Data Dictionary, clients may have support provided by an unpaid carer. This includes support from family, friends and neighbours where the client has identified “there is someone who helps me”. Paid care workers funded by direct payments, provided as part of a commissioned service or in a residential and nursing care setting are not in the scope of the SALT collection and so should not be counted as ‘carers’. Similarly, those in a prison setting should also not be counted as having a carer.” Therefore, as long as the carer is not paid, please include. Also feel free to include further information in the commentary box.","I have a question about carers included in LTS003 table 1. \n\nIf a client has two carers would both carers be included in LTS003 table 1 if both received support during the reporting period, or would only one carer to be included?","According to the SALT guidance: “As defined in the ASC Data Dictionary, clients may have support provided by an unpaid carer. This includes support from family, friends and neighbours where the client has identified “there is someone who helps me”. Paid care workers funded by direct payments, provided as part of a commissioned service or in a residential and nursing care setting are not in the scope of the SALT collection and so should not be counted as ‘carers’. Similarly, those in a prison setting should also not be counted as having a carer.” Therefore, as long as the carer is not paid, please include. Also feel free to include further information in the commentary box."]
[null,null,"","Are you able to provide advice about what data you have about respite services.\nThe Qs are (as I interpret it from the trail):\n•\tWhat do we know about carers\n(Note: we would rely on the Health Survey for England on this, but would be interested whether you have standard lines/data you use \n•\tWhat do we know about the provision of/use of/spend on respite services? (If so, is this delineated by working age/older, type etc)\n(Q: is this a separate line in SALT?) The SALT guidance states: “As defined in the ASC Data Dictionary, clients may have support provided by an unpaid carer. This includes support from family, friends and neighbours where the client has identified “there is someone who helps me”. Paid care workers funded by direct payments, provided as part of a commissioned service or in a residential and nursing care setting are not in the scope of the SALT collection and so should not be counted as ‘carers’. Similarly, those in a prison setting should also not be counted as having a carer.” I’ve also attached a link to our adult social care workforce report that we produce in conjunction with Skills for Care.",null,null,null,null,null,null,null,"Are you able to provide advice about what data you have about respite services.\nThe Qs are (as I interpret it from the trail):\n•\tWhat do we know about carers\n(Note: we would rely on the Health Survey for England on this, but would be interested whether you have standard lines/data you use \n•\tWhat do we know about the provision of/use of/spend on respite services? (If so, is this delineated by working age/older, type etc)\n(Q: is this a separate line in SALT?)","The SALT guidance states: “As defined in the ASC Data Dictionary, clients may have support provided by an unpaid carer. This includes support from family, friends and neighbours where the client has identified “there is someone who helps me”. Paid care workers funded by direct payments, provided as part of a commissioned service or in a residential and nursing care setting are not in the scope of the SALT collection and so should not be counted as ‘carers’. Similarly, those in a prison setting should also not be counted as having a carer.” I’ve also attached a link to our adult social care workforce report that we produce in conjunction with Skills for Care.",{"$f":"IF($AL$417=1,IF(ISNUMBER(SEARCH($AK$417,'Hide this - Workings'!D87)),1,0),\"\")","v":""},{"$f":"IF($AL$418=1,IF(ISNUMBER(SEARCH($AK$418,'Hide this - Workings'!D87)),1,0),\"\")","v":""},{"$f":"IF($AL$419=1,IF(ISNUMBER(SEARCH($AK$419,'Hide this - Workings'!D87)),1,0),\"\")","v":""},{"$f":"IF($AL$420=1,IF(ISNUMBER(SEARCH($AK$420,'Hide this - Workings'!D87)),1,0),\"\")","v":""},{"$f":"IF($AL$421=1,IF(ISNUMBER(SEARCH($AK$421,'Hide this - Workings'!D87)),1,0),\"\")","v":""},{"$f":"IF($AL$422=1,IF(ISNUMBER(SEARCH($AK$422,'Hide this - Workings'!D87)),1,0),\"\")","v":""},{"$f":"IF($AL$423=1,IF(ISNUMBER(SEARCH($AK$423,'Hide this - Workings'!D87)),1,0),\"\")","v":""},{"$f":"IF($AL$424=1,IF(ISNUMBER(SEARCH($AK$424,'Hide this - Workings'!D87)),1,0),\"\")","v":""},{"$f":"IF($AL$425=1,IF(ISNUMBER(SEARCH($AK$425,'Hide this - Workings'!D87)),1,0),\"\")","v":""},{"$f":"IF($AL$426=1,IF(ISNUMBER(SEARCH($AK$426,'Hide this - Workings'!D87)),1,0),\"\")","v":""},{"$f":"IF($AL$427=1,IF(ISNUMBER(SEARCH($AK$427,'Hide this - Workings'!D87)),1,0),\"\")","v":""},{"$f":"IF($AL$428=1,IF(ISNUMBER(SEARCH($AK$428,'Hide this - Workings'!D87)),1,0),\"\")","v":""},{"$f":"IF($AL$429=1,IF(ISNUMBER(SEARCH($AK$429,'Hide this - Workings'!D87)),1,0),\"\")","v":""},{"$f":"IF($AL$430=1,IF(ISNUMBER(SEARCH($AK$430,'Hide this - Workings'!D87)),1,0),\"\")","v":""},{"$f":"IF($AL$431=1,IF(ISNUMBER(SEARCH($AK$431,'Hide this - Workings'!D87)),1,0),\"\")","v":""},{"$f":"IF($AL$432=1,IF(ISNUMBER(SEARCH($AK$432,'Hide this - Workings'!D87)),1,0),\"\")","v":""},{"$f":"IF($AL$433=1,IF(ISNUMBER(SEARCH($AK$433,'Hide this - Workings'!D87)),1,0),\"\")","v":""},0,"A083",0,"Are you able to provide advice about what data you have about respite services.\nThe Qs are (as I interpret it from the trail):\n•\tWhat do we know about carers\n(Note: we would rely on the Health Survey for England on this, but would be interested whether you have standard lines/data you use \n•\tWhat do we know about the provision of/use of/spend on respite services? (If so, is this delineated by working age/older, type etc)\n(Q: is this a separate line in SALT?) The SALT guidance states: “As defined in the ASC Data Dictionary, clients may have support provided by an unpaid carer. This includes support from family, friends and neighbours where the client has identified “there is someone who helps me”. Paid care workers funded by direct payments, provided as part of a commissioned service or in a residential and nursing care setting are not in the scope of the SALT collection and so should not be counted as ‘carers’. Similarly, those in a prison setting should also not be counted as having a carer.” I’ve also attached a link to our adult social care workforce report that we produce in conjunction with Skills for Care.","Are you able to provide advice about what data you have about respite services.\nThe Qs are (as I interpret it from the trail):\n•\tWhat do we know about carers\n(Note: we would rely on the Health Survey for England on this, but would be interested whether you have standard lines/data you use \n•\tWhat do we know about the provision of/use of/spend on respite services? (If so, is this delineated by working age/older, type etc)\n(Q: is this a separate line in SALT?)","The SALT guidance states: “As defined in the ASC Data Dictionary, clients may have support provided by an unpaid carer. This includes support from family, friends and neighbours where the client has identified “there is someone who helps me”. Paid care workers funded by direct payments, provided as part of a commissioned service or in a residential and nursing care setting are not in the scope of the SALT collection and so should not be counted as ‘carers’. Similarly, those in a prison setting should also not be counted as having a carer.” I’ve also attached a link to our adult social care workforce report that we produce in conjunction with Skills for Care."]
[null,null,"","I have a couple of questions relating to ST-Max outcomes.\nThey are very similar to one of the scenarios in the FAQs (below), but I wanted to be absolutely clear.\n\nWe would normally consider achieving some goals as being complete – e.g. not early cessation.\nSo I am a little surprised that the FAQ advises that, where the person is admitted to hospital before anything else happens, this should be considered to be an early cessation.\n\nSTS002a\nClient (new case) starts reablement and achieves some goals, but is then admitted to hospital.\nThey may or may not receive long-term care post discharge or start a new reablement intervention post discharge, but we do not know this at the time of the admission.\nWhat sequel?\n\n•\tEarly cessation of service (not leading to long term support) - 100% NHS funded care/End of Life/deceased\n•\tEarly cessation of service (not leading to long term support)\n•\tEarly Cessation of Service (leading to long term support)\n•\tLong Term Support (any setting)\n•\tNo services provided – needs identified but self-funding\n•\tOngoing Low Level Support\n•\tShort Term Support (other)\n•\tNo services provided – needs identified but support declined \n•\tNo Services Provided - Universal Services / signposted to other services\n•\tNo Services provided – no identified needs\n\nSTS002b\nClient (with LTS) starts reablement and achieves some goals, but is then admitted to hospital\nThey may or may not restart long-term care or start a new reablement intervention post discharge, but we do not know this at the time of the admission.\nWhat sequel?\n\n•\tEarly Cessation of Service (not returning to long term support) - NHS funded care/ end of life / deceased\n•\tEarly Cessation of Service (not returning to long term support) - other reason\n•\tEarly Cessation of Service (return to long term support) - any setting\n•\tMove to Nursing Care (from community)\n•\tMove to Residential Care (from community)\n•\tMove to Community\n•\tLevel of Long-Term Support Increased\n•\tNo Change in Long Term Support\n•\tLevel of Long Term Support Decreased\n•\tALL Long Term Support Ended - no ongoing eligible needs\n\nFAQ Scenario 6\nThe client completed 6 weeks reablement but before any long term support arrangements could be put in place, they were readmitted to hospital and died.\nA: Because the ongoing support arrangements didn’t commence before the hospital readmission, this case should be considered ‘early cessation’. All cases in which the client dies or is admitted to hospital or requires palliative care, even after the end of ST-Max services but before the commencement or delivery of any subsequent services, should be counted as ‘Early cessation of service (not leading to long term support) - NHS funded care/End of Life/deceased’ For both scenarios we suggest- Early Cessation of ST-Max, Early cessation of service (not leading to long term support) - NHS funded care/End of Life/ deceased. This sequel shows explicitly that further health care or palliative care was needed, or that the client died before ST-Max was completed. This reflects the fact that the hospital stay cut short the ST-Max, even though progress was being made, then if applicable, a new plan might be put in place post-discharge. In your scenarios, some goals have been achieved, Early Cessation is defined as ‘a circumstance where the period of short-term support was forced to be cut short in an unexpected way.’ As always, we always advise using the text boxes for additional commentary so that we can get a better understanding of the data.",null,null,null,null,null,null,null,"I have a couple of questions relating to ST-Max outcomes.\nThey are very similar to one of the scenarios in the FAQs (below), but I wanted to be absolutely clear.\n\nWe would normally consider achieving some goals as being complete – e.g. not early cessation.\nSo I am a little surprised that the FAQ advises that, where the person is admitted to hospital before anything else happens, this should be considered to be an early cessation.\n\nSTS002a\nClient (new case) starts reablement and achieves some goals, but is then admitted to hospital.\nThey may or may not receive long-term care post discharge or start a new reablement intervention post discharge, but we do not know this at the time of the admission.\nWhat sequel?\n\n•\tEarly cessation of service (not leading to long term support) - 100% NHS funded care/End of Life/deceased\n•\tEarly cessation of service (not leading to long term support)\n•\tEarly Cessation of Service (leading to long term support)\n•\tLong Term Support (any setting)\n•\tNo services provided – needs identified but self-funding\n•\tOngoing Low Level Support\n•\tShort Term Support (other)\n•\tNo services provided – needs identified but support declined \n•\tNo Services Provided - Universal Services / signposted to other services\n•\tNo Services provided – no identified needs\n\nSTS002b\nClient (with LTS) starts reablement and achieves some goals, but is then admitted to hospital\nThey may or may not restart long-term care or start a new reablement intervention post discharge, but we do not know this at the time of the admission.\nWhat sequel?\n\n•\tEarly Cessation of Service (not returning to long term support) - NHS funded care/ end of life / deceased\n•\tEarly Cessation of Service (not returning to long term support) - other reason\n•\tEarly Cessation of Service (return to long term support) - any setting\n•\tMove to Nursing Care (from community)\n•\tMove to Residential Care (from community)\n•\tMove to Community\n•\tLevel of Long-Term Support Increased\n•\tNo Change in Long Term Support\n•\tLevel of Long Term Support Decreased\n•\tALL Long Term Support Ended - no ongoing eligible needs\n\nFAQ Scenario 6\nThe client completed 6 weeks reablement but before any long term support arrangements could be put in place, they were readmitted to hospital and died.\nA: Because the ongoing support arrangements didn’t commence before the hospital readmission, this case should be considered ‘early cessation’. All cases in which the client dies or is admitted to hospital or requires palliative care, even after the end of ST-Max services but before the commencement or delivery of any subsequent services, should be counted as ‘Early cessation of service (not leading to long term support) - NHS funded care/End of Life/deceased’","For both scenarios we suggest- Early Cessation of ST-Max, Early cessation of service (not leading to long term support) - NHS funded care/End of Life/ deceased. This sequel shows explicitly that further health care or palliative care was needed, or that the client died before ST-Max was completed. This reflects the fact that the hospital stay cut short the ST-Max, even though progress was being made, then if applicable, a new plan might be put in place post-discharge. In your scenarios, some goals have been achieved, Early Cessation is defined as ‘a circumstance where the period of short-term support was forced to be cut short in an unexpected way.’ As always, we always advise using the text boxes for additional commentary so that we can get a better understanding of the data.",{"$f":"IF($AL$417=1,IF(ISNUMBER(SEARCH($AK$417,'Hide this - Workings'!D88)),1,0),\"\")","v":""},{"$f":"IF($AL$418=1,IF(ISNUMBER(SEARCH($AK$418,'Hide this - Workings'!D88)),1,0),\"\")","v":""},{"$f":"IF($AL$419=1,IF(ISNUMBER(SEARCH($AK$419,'Hide this - Workings'!D88)),1,0),\"\")","v":""},{"$f":"IF($AL$420=1,IF(ISNUMBER(SEARCH($AK$420,'Hide this - Workings'!D88)),1,0),\"\")","v":""},{"$f":"IF($AL$421=1,IF(ISNUMBER(SEARCH($AK$421,'Hide this - Workings'!D88)),1,0),\"\")","v":""},{"$f":"IF($AL$422=1,IF(ISNUMBER(SEARCH($AK$422,'Hide this - Workings'!D88)),1,0),\"\")","v":""},{"$f":"IF($AL$423=1,IF(ISNUMBER(SEARCH($AK$423,'Hide this - Workings'!D88)),1,0),\"\")","v":""},{"$f":"IF($AL$424=1,IF(ISNUMBER(SEARCH($AK$424,'Hide this - Workings'!D88)),1,0),\"\")","v":""},{"$f":"IF($AL$425=1,IF(ISNUMBER(SEARCH($AK$425,'Hide this - Workings'!D88)),1,0),\"\")","v":""},{"$f":"IF($AL$426=1,IF(ISNUMBER(SEARCH($AK$426,'Hide this - Workings'!D88)),1,0),\"\")","v":""},{"$f":"IF($AL$427=1,IF(ISNUMBER(SEARCH($AK$427,'Hide this - Workings'!D88)),1,0),\"\")","v":""},{"$f":"IF($AL$428=1,IF(ISNUMBER(SEARCH($AK$428,'Hide this - Workings'!D88)),1,0),\"\")","v":""},{"$f":"IF($AL$429=1,IF(ISNUMBER(SEARCH($AK$429,'Hide this - Workings'!D88)),1,0),\"\")","v":""},{"$f":"IF($AL$430=1,IF(ISNUMBER(SEARCH($AK$430,'Hide this - Workings'!D88)),1,0),\"\")","v":""},{"$f":"IF($AL$431=1,IF(ISNUMBER(SEARCH($AK$431,'Hide this - Workings'!D88)),1,0),\"\")","v":""},{"$f":"IF($AL$432=1,IF(ISNUMBER(SEARCH($AK$432,'Hide this - Workings'!D88)),1,0),\"\")","v":""},{"$f":"IF($AL$433=1,IF(ISNUMBER(SEARCH($AK$433,'Hide this - Workings'!D88)),1,0),\"\")","v":""},0,"A084",0,"I have a couple of questions relating to ST-Max outcomes.\nThey are very similar to one of the scenarios in the FAQs (below), but I wanted to be absolutely clear.\n\nWe would normally consider achieving some goals as being complete – e.g. not early cessation.\nSo I am a little surprised that the FAQ advises that, where the person is admitted to hospital before anything else happens, this should be considered to be an early cessation.\n\nSTS002a\nClient (new case) starts reablement and achieves some goals, but is then admitted to hospital.\nThey may or may not receive long-term care post discharge or start a new reablement intervention post discharge, but we do not know this at the time of the admission.\nWhat sequel?\n\n•\tEarly cessation of service (not leading to long term support) - 100% NHS funded care/End of Life/deceased\n•\tEarly cessation of service (not leading to long term support)\n•\tEarly Cessation of Service (leading to long term support)\n•\tLong Term Support (any setting)\n•\tNo services provided – needs identified but self-funding\n•\tOngoing Low Level Support\n•\tShort Term Support (other)\n•\tNo services provided – needs identified but support declined \n•\tNo Services Provided - Universal Services / signposted to other services\n•\tNo Services provided – no identified needs\n\nSTS002b\nClient (with LTS) starts reablement and achieves some goals, but is then admitted to hospital\nThey may or may not restart long-term care or start a new reablement intervention post discharge, but we do not know this at the time of the admission.\nWhat sequel?\n\n•\tEarly Cessation of Service (not returning to long term support) - NHS funded care/ end of life / deceased\n•\tEarly Cessation of Service (not returning to long term support) - other reason\n•\tEarly Cessation of Service (return to long term support) - any setting\n•\tMove to Nursing Care (from community)\n•\tMove to Residential Care (from community)\n•\tMove to Community\n•\tLevel of Long-Term Support Increased\n•\tNo Change in Long Term Support\n•\tLevel of Long Term Support Decreased\n•\tALL Long Term Support Ended - no ongoing eligible needs\n\nFAQ Scenario 6\nThe client completed 6 weeks reablement but before any long term support arrangements could be put in place, they were readmitted to hospital and died.\nA: Because the ongoing support arrangements didn’t commence before the hospital readmission, this case should be considered ‘early cessation’. All cases in which the client dies or is admitted to hospital or requires palliative care, even after the end of ST-Max services but before the commencement or delivery of any subsequent services, should be counted as ‘Early cessation of service (not leading to long term support) - NHS funded care/End of Life/deceased’ For both scenarios we suggest- Early Cessation of ST-Max, Early cessation of service (not leading to long term support) - NHS funded care/End of Life/ deceased. This sequel shows explicitly that further health care or palliative care was needed, or that the client died before ST-Max was completed. This reflects the fact that the hospital stay cut short the ST-Max, even though progress was being made, then if applicable, a new plan might be put in place post-discharge. In your scenarios, some goals have been achieved, Early Cessation is defined as ‘a circumstance where the period of short-term support was forced to be cut short in an unexpected way.’ As always, we always advise using the text boxes for additional commentary so that we can get a better understanding of the data.","I have a couple of questions relating to ST-Max outcomes.\nThey are very similar to one of the scenarios in the FAQs (below), but I wanted to be absolutely clear.\n\nWe would normally consider achieving some goals as being complete – e.g. not early cessation.\nSo I am a little surprised that the FAQ advises that, where the person is admitted to hospital before anything else happens, this should be considered to be an early cessation.\n\nSTS002a\nClient (new case) starts reablement and achieves some goals, but is then admitted to hospital.\nThey may or may not receive long-term care post discharge or start a new reablement intervention post discharge, but we do not know this at the time of the admission.\nWhat sequel?\n\n•\tEarly cessation of service (not leading to long term support) - 100% NHS funded care/End of Life/deceased\n•\tEarly cessation of service (not leading to long term support)\n•\tEarly Cessation of Service (leading to long term support)\n•\tLong Term Support (any setting)\n•\tNo services provided – needs identified but self-funding\n•\tOngoing Low Level Support\n•\tShort Term Support (other)\n•\tNo services provided – needs identified but support declined \n•\tNo Services Provided - Universal Services / signposted to other services\n•\tNo Services provided – no identified needs\n\nSTS002b\nClient (with LTS) starts reablement and achieves some goals, but is then admitted to hospital\nThey may or may not restart long-term care or start a new reablement intervention post discharge, but we do not know this at the time of the admission.\nWhat sequel?\n\n•\tEarly Cessation of Service (not returning to long term support) - NHS funded care/ end of life / deceased\n•\tEarly Cessation of Service (not returning to long term support) - other reason\n•\tEarly Cessation of Service (return to long term support) - any setting\n•\tMove to Nursing Care (from community)\n•\tMove to Residential Care (from community)\n•\tMove to Community\n•\tLevel of Long-Term Support Increased\n•\tNo Change in Long Term Support\n•\tLevel of Long Term Support Decreased\n•\tALL Long Term Support Ended - no ongoing eligible needs\n\nFAQ Scenario 6\nThe client completed 6 weeks reablement but before any long term support arrangements could be put in place, they were readmitted to hospital and died.\nA: Because the ongoing support arrangements didn’t commence before the hospital readmission, this case should be considered ‘early cessation’. All cases in which the client dies or is admitted to hospital or requires palliative care, even after the end of ST-Max services but before the commencement or delivery of any subsequent services, should be counted as ‘Early cessation of service (not leading to long term support) - NHS funded care/End of Life/deceased’","For both scenarios we suggest- Early Cessation of ST-Max, Early cessation of service (not leading to long term support) - NHS funded care/End of Life/ deceased. This sequel shows explicitly that further health care or palliative care was needed, or that the client died before ST-Max was completed. This reflects the fact that the hospital stay cut short the ST-Max, even though progress was being made, then if applicable, a new plan might be put in place post-discharge. In your scenarios, some goals have been achieved, Early Cessation is defined as ‘a circumstance where the period of short-term support was forced to be cut short in an unexpected way.’ As always, we always advise using the text boxes for additional commentary so that we can get a better understanding of the data."]
[null,null,"","Would you please be able to confirm in regards to the definition of Full-cost clients in LTS001b measure of SALT, does this include LTS clients with deferred payment arrangements? I have been discussing this with my colleagues and this is something that has also been discussed with LAs at workshops. We would agree that these clients can be included on the basis that this element of the full-cost criteria guidance is being met through the LA provision of a DPA: Full-cost and self-funding clients. Clients who pay the full costs of their care are included if they decide to remain in contact or work with the local authority during the planning and commissioning of their support and afterwards are reviewed on an ongoing basis.",null,null,null,null,null,null,null,"Would you please be able to confirm in regards to the definition of Full-cost clients in LTS001b measure of SALT, does this include LTS clients with deferred payment arrangements?","I have been discussing this with my colleagues and this is something that has also been discussed with LAs at workshops. We would agree that these clients can be included on the basis that this element of the full-cost criteria guidance is being met through the LA provision of a DPA: Full-cost and self-funding clients. Clients who pay the full costs of their care are included if they decide to remain in contact or work with the local authority during the planning and commissioning of their support and afterwards are reviewed on an ongoing basis.",{"$f":"IF($AL$417=1,IF(ISNUMBER(SEARCH($AK$417,'Hide this - Workings'!D89)),1,0),\"\")","v":""},{"$f":"IF($AL$418=1,IF(ISNUMBER(SEARCH($AK$418,'Hide this - Workings'!D89)),1,0),\"\")","v":""},{"$f":"IF($AL$419=1,IF(ISNUMBER(SEARCH($AK$419,'Hide this - Workings'!D89)),1,0),\"\")","v":""},{"$f":"IF($AL$420=1,IF(ISNUMBER(SEARCH($AK$420,'Hide this - Workings'!D89)),1,0),\"\")","v":""},{"$f":"IF($AL$421=1,IF(ISNUMBER(SEARCH($AK$421,'Hide this - Workings'!D89)),1,0),\"\")","v":""},{"$f":"IF($AL$422=1,IF(ISNUMBER(SEARCH($AK$422,'Hide this - Workings'!D89)),1,0),\"\")","v":""},{"$f":"IF($AL$423=1,IF(ISNUMBER(SEARCH($AK$423,'Hide this - Workings'!D89)),1,0),\"\")","v":""},{"$f":"IF($AL$424=1,IF(ISNUMBER(SEARCH($AK$424,'Hide this - Workings'!D89)),1,0),\"\")","v":""},{"$f":"IF($AL$425=1,IF(ISNUMBER(SEARCH($AK$425,'Hide this - Workings'!D89)),1,0),\"\")","v":""},{"$f":"IF($AL$426=1,IF(ISNUMBER(SEARCH($AK$426,'Hide this - Workings'!D89)),1,0),\"\")","v":""},{"$f":"IF($AL$427=1,IF(ISNUMBER(SEARCH($AK$427,'Hide this - Workings'!D89)),1,0),\"\")","v":""},{"$f":"IF($AL$428=1,IF(ISNUMBER(SEARCH($AK$428,'Hide this - Workings'!D89)),1,0),\"\")","v":""},{"$f":"IF($AL$429=1,IF(ISNUMBER(SEARCH($AK$429,'Hide this - Workings'!D89)),1,0),\"\")","v":""},{"$f":"IF($AL$430=1,IF(ISNUMBER(SEARCH($AK$430,'Hide this - Workings'!D89)),1,0),\"\")","v":""},{"$f":"IF($AL$431=1,IF(ISNUMBER(SEARCH($AK$431,'Hide this - Workings'!D89)),1,0),\"\")","v":""},{"$f":"IF($AL$432=1,IF(ISNUMBER(SEARCH($AK$432,'Hide this - Workings'!D89)),1,0),\"\")","v":""},{"$f":"IF($AL$433=1,IF(ISNUMBER(SEARCH($AK$433,'Hide this - Workings'!D89)),1,0),\"\")","v":""},0,"A085",0,{"$f":"IF((IFERROR(N89,0))>1,D89,\"\")","v":"Would you please be able to confirm in regards to the definition of Full-cost clients in LTS001b measure of SALT, does this include LTS clients with deferred payment arrangements? I have been discussing this with my colleagues and this is something that has also been discussed with LAs at workshops. We would agree that these clients can be included on the basis that this element of the full-cost criteria guidance is being met through the LA provision of a DPA: Full-cost and self-funding clients. Clients who pay the full costs of their care are included if they decide to remain in contact or work with the local authority during the planning and commissioning of their support and afterwards are reviewed on an ongoing basis."},"Would you please be able to confirm in regards to the definition of Full-cost clients in LTS001b measure of SALT, does this include LTS clients with deferred payment arrangements?",{"$f":"IF((IFERROR(N89,0))>1,M89,\"\")","v":"I have been discussing this with my colleagues and this is something that has also been discussed with LAs at workshops. We would agree that these clients can be included on the basis that this element of the full-cost criteria guidance is being met through the LA provision of a DPA: Full-cost and self-funding clients. Clients who pay the full costs of their care are included if they decide to remain in contact or work with the local authority during the planning and commissioning of their support and afterwards are reviewed on an ongoing basis."}]
[null,null,"","In STS004 it is stated that the measure applies to multi-disciplinary health and social care cases, as well as social care only. Is this also the case for STS001 and STS002a/b, or is that specific to STS004. We currently operate an Early Intervention service (EICT) through the hospitals, providing short term support to help discharge and improve independence. Historically we have only been capturing those elements which were very directly dealt with by social care staff, but all going through the process are dealt with by multi-disciplinary arrangements.\n \nWe are therefore looking at reporting the full cohort for STS004 in future. Should we also be including them in STS001 / 2? The guidance does note state such things should be excluded, but as it clearly defines them in STS004 but not in STS001 I wasn’t sure if this was a specific exception to a general rule. The joint/multi-disciplinary work in question in STS004 is specific to that table, as shown below. It’s specified here because it is an exception to the general rule – the answer to FAQ A040 may help explain the rationale behind this.",null,null,null,null,null,null,null,"In STS004 it is stated that the measure applies to multi-disciplinary health and social care cases, as well as social care only. Is this also the case for STS001 and STS002a/b, or is that specific to STS004. We currently operate an Early Intervention service (EICT) through the hospitals, providing short term support to help discharge and improve independence. Historically we have only been capturing those elements which were very directly dealt with by social care staff, but all going through the process are dealt with by multi-disciplinary arrangements.\n \nWe are therefore looking at reporting the full cohort for STS004 in future. Should we also be including them in STS001 / 2? The guidance does note state such things should be excluded, but as it clearly defines them in STS004 but not in STS001 I wasn’t sure if this was a specific exception to a general rule.","The joint/multi-disciplinary work in question in STS004 is specific to that table, as shown below. It’s specified here because it is an exception to the general rule – the answer to FAQ A040 may help explain the rationale behind this.",{"$f":"IF($AL$417=1,IF(ISNUMBER(SEARCH($AK$417,'Hide this - Workings'!D90)),1,0),\"\")","v":""},{"$f":"IF($AL$418=1,IF(ISNUMBER(SEARCH($AK$418,'Hide this - Workings'!D90)),1,0),\"\")","v":""},{"$f":"IF($AL$419=1,IF(ISNUMBER(SEARCH($AK$419,'Hide this - Workings'!D90)),1,0),\"\")","v":""},{"$f":"IF($AL$420=1,IF(ISNUMBER(SEARCH($AK$420,'Hide this - Workings'!D90)),1,0),\"\")","v":""},{"$f":"IF($AL$421=1,IF(ISNUMBER(SEARCH($AK$421,'Hide this - Workings'!D90)),1,0),\"\")","v":""},{"$f":"IF($AL$422=1,IF(ISNUMBER(SEARCH($AK$422,'Hide this - Workings'!D90)),1,0),\"\")","v":""},{"$f":"IF($AL$423=1,IF(ISNUMBER(SEARCH($AK$423,'Hide this - Workings'!D90)),1,0),\"\")","v":""},{"$f":"IF($AL$424=1,IF(ISNUMBER(SEARCH($AK$424,'Hide this - Workings'!D90)),1,0),\"\")","v":""},{"$f":"IF($AL$425=1,IF(ISNUMBER(SEARCH($AK$425,'Hide this - Workings'!D90)),1,0),\"\")","v":""},{"$f":"IF($AL$426=1,IF(ISNUMBER(SEARCH($AK$426,'Hide this - Workings'!D90)),1,0),\"\")","v":""},{"$f":"IF($AL$427=1,IF(ISNUMBER(SEARCH($AK$427,'Hide this - Workings'!D90)),1,0),\"\")","v":""},{"$f":"IF($AL$428=1,IF(ISNUMBER(SEARCH($AK$428,'Hide this - Workings'!D90)),1,0),\"\")","v":""},{"$f":"IF($AL$429=1,IF(ISNUMBER(SEARCH($AK$429,'Hide this - Workings'!D90)),1,0),\"\")","v":""},{"$f":"IF($AL$430=1,IF(ISNUMBER(SEARCH($AK$430,'Hide this - Workings'!D90)),1,0),\"\")","v":""},{"$f":"IF($AL$431=1,IF(ISNUMBER(SEARCH($AK$431,'Hide this - Workings'!D90)),1,0),\"\")","v":""},{"$f":"IF($AL$432=1,IF(ISNUMBER(SEARCH($AK$432,'Hide this - Workings'!D90)),1,0),\"\")","v":""},{"$f":"IF($AL$433=1,IF(ISNUMBER(SEARCH($AK$433,'Hide this - Workings'!D90)),1,0),\"\")","v":""},0,"A086",0,"In STS004 it is stated that the measure applies to multi-disciplinary health and social care cases, as well as social care only. Is this also the case for STS001 and STS002a/b, or is that specific to STS004. We currently operate an Early Intervention service (EICT) through the hospitals, providing short term support to help discharge and improve independence. Historically we have only been capturing those elements which were very directly dealt with by social care staff, but all going through the process are dealt with by multi-disciplinary arrangements.\n \nWe are therefore looking at reporting the full cohort for STS004 in future. Should we also be including them in STS001 / 2? The guidance does note state such things should be excluded, but as it clearly defines them in STS004 but not in STS001 I wasn’t sure if this was a specific exception to a general rule. The joint/multi-disciplinary work in question in STS004 is specific to that table, as shown below. It’s specified here because it is an exception to the general rule – the answer to FAQ A040 may help explain the rationale behind this.","In STS004 it is stated that the measure applies to multi-disciplinary health and social care cases, as well as social care only. Is this also the case for STS001 and STS002a/b, or is that specific to STS004. We currently operate an Early Intervention service (EICT) through the hospitals, providing short term support to help discharge and improve independence. Historically we have only been capturing those elements which were very directly dealt with by social care staff, but all going through the process are dealt with by multi-disciplinary arrangements.\n \nWe are therefore looking at reporting the full cohort for STS004 in future. Should we also be including them in STS001 / 2? The guidance does note state such things should be excluded, but as it clearly defines them in STS004 but not in STS001 I wasn’t sure if this was a specific exception to a general rule.","The joint/multi-disciplinary work in question in STS004 is specific to that table, as shown below. It’s specified here because it is an exception to the general rule – the answer to FAQ A040 may help explain the rationale behind this."]
[null,null,null,"How to treat discharge to access (D2A) You are correct that STS004 should only include older people (over 65) discharged hospital directly to reablement. Discharge to Access (D2A) often means that reablement won’t occur straight away and therefore these cases would also not feature in STS004. In this situation, please add comments to your submission to describe how the D2A service results in fewer cases being recorded.",null,null,null,null,null,null,null,"How to treat discharge to access (D2A)","You are correct that STS004 should only include older people (over 65) discharged hospital directly to reablement. Discharge to Access (D2A) often means that reablement won’t occur straight away and therefore these cases would also not feature in STS004. In this situation, please add comments to your submission to describe how the D2A service results in fewer cases being recorded.",{"$f":"IF($AL$417=1,IF(ISNUMBER(SEARCH($AK$417,'Hide this - Workings'!D91)),1,0),\"\")","v":""},{"$f":"IF($AL$418=1,IF(ISNUMBER(SEARCH($AK$418,'Hide this - Workings'!D91)),1,0),\"\")","v":""},{"$f":"IF($AL$419=1,IF(ISNUMBER(SEARCH($AK$419,'Hide this - Workings'!D91)),1,0),\"\")","v":""},{"$f":"IF($AL$420=1,IF(ISNUMBER(SEARCH($AK$420,'Hide this - Workings'!D91)),1,0),\"\")","v":""},{"$f":"IF($AL$421=1,IF(ISNUMBER(SEARCH($AK$421,'Hide this - Workings'!D91)),1,0),\"\")","v":""},{"$f":"IF($AL$422=1,IF(ISNUMBER(SEARCH($AK$422,'Hide this - Workings'!D91)),1,0),\"\")","v":""},{"$f":"IF($AL$423=1,IF(ISNUMBER(SEARCH($AK$423,'Hide this - Workings'!D91)),1,0),\"\")","v":""},{"$f":"IF($AL$424=1,IF(ISNUMBER(SEARCH($AK$424,'Hide this - Workings'!D91)),1,0),\"\")","v":""},{"$f":"IF($AL$425=1,IF(ISNUMBER(SEARCH($AK$425,'Hide this - Workings'!D91)),1,0),\"\")","v":""},{"$f":"IF($AL$426=1,IF(ISNUMBER(SEARCH($AK$426,'Hide this - Workings'!D91)),1,0),\"\")","v":""},{"$f":"IF($AL$427=1,IF(ISNUMBER(SEARCH($AK$427,'Hide this - Workings'!D91)),1,0),\"\")","v":""},{"$f":"IF($AL$428=1,IF(ISNUMBER(SEARCH($AK$428,'Hide this - Workings'!D91)),1,0),\"\")","v":""},{"$f":"IF($AL$429=1,IF(ISNUMBER(SEARCH($AK$429,'Hide this - Workings'!D91)),1,0),\"\")","v":""},{"$f":"IF($AL$430=1,IF(ISNUMBER(SEARCH($AK$430,'Hide this - Workings'!D91)),1,0),\"\")","v":""},{"$f":"IF($AL$431=1,IF(ISNUMBER(SEARCH($AK$431,'Hide this - Workings'!D91)),1,0),\"\")","v":""},{"$f":"IF($AL$432=1,IF(ISNUMBER(SEARCH($AK$432,'Hide this - Workings'!D91)),1,0),\"\")","v":""},{"$f":"IF($AL$433=1,IF(ISNUMBER(SEARCH($AK$433,'Hide this - Workings'!D91)),1,0),\"\")","v":""},0,"A087",0,"How to treat discharge to access (D2A) You are correct that STS004 should only include older people (over 65) discharged hospital directly to reablement. Discharge to Access (D2A) often means that reablement won’t occur straight away and therefore these cases would also not feature in STS004. In this situation, please add comments to your submission to describe how the D2A service results in fewer cases being recorded.","How to treat discharge to access (D2A)","You are correct that STS004 should only include older people (over 65) discharged hospital directly to reablement. Discharge to Access (D2A) often means that reablement won’t occur straight away and therefore these cases would also not feature in STS004. In this situation, please add comments to your submission to describe how the D2A service results in fewer cases being recorded."]
[null,null,null,"I have a question about the cohort for SALT table STS004. I’ve looked at your frequently asked questions and also the SALT guidance and just want to confirm I’m counting the correct clients. Example: A client is over the age of 65 and has been discharged from hospital. The intention was for the client to have a short term service to maximise their independence, but the service did not start as there was a delay and the adult cancelled the care before it started.  I have not included this client in the 91 day later cohort as they didn’t receive a service – am I right to exclude the client? I would agree that they should be excluded as the guidance states they need to receive the service.",null,null,null,null,null,null,null,"I have a question about the cohort for SALT table STS004. I’ve looked at your frequently asked questions and also the SALT guidance and just want to confirm I’m counting the correct clients. Example: A client is over the age of 65 and has been discharged from hospital. The intention was for the client to have a short term service to maximise their independence, but the service did not start as there was a delay and the adult cancelled the care before it started.  I have not included this client in the 91 day later cohort as they didn’t receive a service – am I right to exclude the client?","I would agree that they should be excluded as the guidance states they need to receive the service.",{"$f":"IF($AL$417=1,IF(ISNUMBER(SEARCH($AK$417,'Hide this - Workings'!D92)),1,0),\"\")","v":""},{"$f":"IF($AL$418=1,IF(ISNUMBER(SEARCH($AK$418,'Hide this - Workings'!D92)),1,0),\"\")","v":""},{"$f":"IF($AL$419=1,IF(ISNUMBER(SEARCH($AK$419,'Hide this - Workings'!D92)),1,0),\"\")","v":""},{"$f":"IF($AL$420=1,IF(ISNUMBER(SEARCH($AK$420,'Hide this - Workings'!D92)),1,0),\"\")","v":""},{"$f":"IF($AL$421=1,IF(ISNUMBER(SEARCH($AK$421,'Hide this - Workings'!D92)),1,0),\"\")","v":""},{"$f":"IF($AL$422=1,IF(ISNUMBER(SEARCH($AK$422,'Hide this - Workings'!D92)),1,0),\"\")","v":""},{"$f":"IF($AL$423=1,IF(ISNUMBER(SEARCH($AK$423,'Hide this - Workings'!D92)),1,0),\"\")","v":""},{"$f":"IF($AL$424=1,IF(ISNUMBER(SEARCH($AK$424,'Hide this - Workings'!D92)),1,0),\"\")","v":""},{"$f":"IF($AL$425=1,IF(ISNUMBER(SEARCH($AK$425,'Hide this - Workings'!D92)),1,0),\"\")","v":""},{"$f":"IF($AL$426=1,IF(ISNUMBER(SEARCH($AK$426,'Hide this - Workings'!D92)),1,0),\"\")","v":""},{"$f":"IF($AL$427=1,IF(ISNUMBER(SEARCH($AK$427,'Hide this - Workings'!D92)),1,0),\"\")","v":""},{"$f":"IF($AL$428=1,IF(ISNUMBER(SEARCH($AK$428,'Hide this - Workings'!D92)),1,0),\"\")","v":""},{"$f":"IF($AL$429=1,IF(ISNUMBER(SEARCH($AK$429,'Hide this - Workings'!D92)),1,0),\"\")","v":""},{"$f":"IF($AL$430=1,IF(ISNUMBER(SEARCH($AK$430,'Hide this - Workings'!D92)),1,0),\"\")","v":""},{"$f":"IF($AL$431=1,IF(ISNUMBER(SEARCH($AK$431,'Hide this - Workings'!D92)),1,0),\"\")","v":""},{"$f":"IF($AL$432=1,IF(ISNUMBER(SEARCH($AK$432,'Hide this - Workings'!D92)),1,0),\"\")","v":""},{"$f":"IF($AL$433=1,IF(ISNUMBER(SEARCH($AK$433,'Hide this - Workings'!D92)),1,0),\"\")","v":""},0,"A088",0,"I have a question about the cohort for SALT table STS004. I’ve looked at your frequently asked questions and also the SALT guidance and just want to confirm I’m counting the correct clients. Example: A client is over the age of 65 and has been discharged from hospital. The intention was for the client to have a short term service to maximise their independence, but the service did not start as there was a delay and the adult cancelled the care before it started.  I have not included this client in the 91 day later cohort as they didn’t receive a service – am I right to exclude the client? I would agree that they should be excluded as the guidance states they need to receive the service.","I have a question about the cohort for SALT table STS004. I’ve looked at your frequently asked questions and also the SALT guidance and just want to confirm I’m counting the correct clients. Example: A client is over the age of 65 and has been discharged from hospital. The intention was for the client to have a short term service to maximise their independence, but the service did not start as there was a delay and the adult cancelled the care before it started.  I have not included this client in the 91 day later cohort as they didn’t receive a service – am I right to exclude the client?","I would agree that they should be excluded as the guidance states they need to receive the service."]
[null,null,null,"Please can you advise what is meant by detained under the mental health act. Does this include people who live in the community but are subject to S117? Section 117 of the Mental Health Act 1983 requires clinical commissioning groups and local social services authorities to provide aftercare services to patients who were detained in hospital for treatment under section 3, 37, 45A, 47 or 48 of the Mental Health Act and who are no longer detained. Therefore, S117 clients would not be excluded from LTS004",null,null,null,null,null,null,null,"Please can you advise what is meant by detained under the mental health act. Does this include people who live in the community but are subject to S117?","Section 117 of the Mental Health Act 1983 requires clinical commissioning groups and local social services authorities to provide aftercare services to patients who were detained in hospital for treatment under section 3, 37, 45A, 47 or 48 of the Mental Health Act and who are no longer detained. Therefore, S117 clients would not be excluded from LTS004",{"$f":"IF($AL$417=1,IF(ISNUMBER(SEARCH($AK$417,'Hide this - Workings'!D93)),1,0),\"\")","v":""},{"$f":"IF($AL$418=1,IF(ISNUMBER(SEARCH($AK$418,'Hide this - Workings'!D93)),1,0),\"\")","v":""},{"$f":"IF($AL$419=1,IF(ISNUMBER(SEARCH($AK$419,'Hide this - Workings'!D93)),1,0),\"\")","v":""},{"$f":"IF($AL$420=1,IF(ISNUMBER(SEARCH($AK$420,'Hide this - Workings'!D93)),1,0),\"\")","v":""},{"$f":"IF($AL$421=1,IF(ISNUMBER(SEARCH($AK$421,'Hide this - Workings'!D93)),1,0),\"\")","v":""},{"$f":"IF($AL$422=1,IF(ISNUMBER(SEARCH($AK$422,'Hide this - Workings'!D93)),1,0),\"\")","v":""},{"$f":"IF($AL$423=1,IF(ISNUMBER(SEARCH($AK$423,'Hide this - Workings'!D93)),1,0),\"\")","v":""},{"$f":"IF($AL$424=1,IF(ISNUMBER(SEARCH($AK$424,'Hide this - Workings'!D93)),1,0),\"\")","v":""},{"$f":"IF($AL$425=1,IF(ISNUMBER(SEARCH($AK$425,'Hide this - Workings'!D93)),1,0),\"\")","v":""},{"$f":"IF($AL$426=1,IF(ISNUMBER(SEARCH($AK$426,'Hide this - Workings'!D93)),1,0),\"\")","v":""},{"$f":"IF($AL$427=1,IF(ISNUMBER(SEARCH($AK$427,'Hide this - Workings'!D93)),1,0),\"\")","v":""},{"$f":"IF($AL$428=1,IF(ISNUMBER(SEARCH($AK$428,'Hide this - Workings'!D93)),1,0),\"\")","v":""},{"$f":"IF($AL$429=1,IF(ISNUMBER(SEARCH($AK$429,'Hide this - Workings'!D93)),1,0),\"\")","v":""},{"$f":"IF($AL$430=1,IF(ISNUMBER(SEARCH($AK$430,'Hide this - Workings'!D93)),1,0),\"\")","v":""},{"$f":"IF($AL$431=1,IF(ISNUMBER(SEARCH($AK$431,'Hide this - Workings'!D93)),1,0),\"\")","v":""},{"$f":"IF($AL$432=1,IF(ISNUMBER(SEARCH($AK$432,'Hide this - Workings'!D93)),1,0),\"\")","v":""},{"$f":"IF($AL$433=1,IF(ISNUMBER(SEARCH($AK$433,'Hide this - Workings'!D93)),1,0),\"\")","v":""},0,"A089",0,"Please can you advise what is meant by detained under the mental health act. Does this include people who live in the community but are subject to S117? Section 117 of the Mental Health Act 1983 requires clinical commissioning groups and local social services authorities to provide aftercare services to patients who were detained in hospital for treatment under section 3, 37, 45A, 47 or 48 of the Mental Health Act and who are no longer detained. Therefore, S117 clients would not be excluded from LTS004","Please can you advise what is meant by detained under the mental health act. Does this include people who live in the community but are subject to S117?","Section 117 of the Mental Health Act 1983 requires clinical commissioning groups and local social services authorities to provide aftercare services to patients who were detained in hospital for treatment under section 3, 37, 45A, 47 or 48 of the Mental Health Act and who are no longer detained. Therefore, S117 clients would not be excluded from LTS004"]
[null,null,null,"I have checked the guidance and FAQ’s – I was wondering how we count NRPF cases, would we count them as a long term service? Or would we exclude them? I have been discussing this with my colleagues. The guidance isn’t prescriptive in this instance, but we would suggest this is recorded. Having done some reading into NRPF, according to Social services support for adults | NRPF (nrpfnetwork.org.uk) “When an adult cannot access benefits and housing assistance due to having no recourse to public funds, their local council may have a duty to provide accommodation and financial support if the adult is assessed as having care and support needs by social services. We would advise that you caveat this in the relevant comments boxes when completing the return. Happy to answer any other questions you may have.",null,null,null,null,null,null,null,"I have checked the guidance and FAQ’s – I was wondering how we count NRPF cases, would we count them as a long term service? Or would we exclude them?","I have been discussing this with my colleagues. The guidance isn’t prescriptive in this instance, but we would suggest this is recorded. Having done some reading into NRPF, according to Social services support for adults | NRPF (nrpfnetwork.org.uk) “When an adult cannot access benefits and housing assistance due to having no recourse to public funds, their local council may have a duty to provide accommodation and financial support if the adult is assessed as having care and support needs by social services. We would advise that you caveat this in the relevant comments boxes when completing the return. Happy to answer any other questions you may have.",{"$f":"IF($AL$417=1,IF(ISNUMBER(SEARCH($AK$417,'Hide this - Workings'!D94)),1,0),\"\")","v":""},{"$f":"IF($AL$418=1,IF(ISNUMBER(SEARCH($AK$418,'Hide this - Workings'!D94)),1,0),\"\")","v":""},{"$f":"IF($AL$419=1,IF(ISNUMBER(SEARCH($AK$419,'Hide this - Workings'!D94)),1,0),\"\")","v":""},{"$f":"IF($AL$420=1,IF(ISNUMBER(SEARCH($AK$420,'Hide this - Workings'!D94)),1,0),\"\")","v":""},{"$f":"IF($AL$421=1,IF(ISNUMBER(SEARCH($AK$421,'Hide this - Workings'!D94)),1,0),\"\")","v":""},{"$f":"IF($AL$422=1,IF(ISNUMBER(SEARCH($AK$422,'Hide this - Workings'!D94)),1,0),\"\")","v":""},{"$f":"IF($AL$423=1,IF(ISNUMBER(SEARCH($AK$423,'Hide this - Workings'!D94)),1,0),\"\")","v":""},{"$f":"IF($AL$424=1,IF(ISNUMBER(SEARCH($AK$424,'Hide this - Workings'!D94)),1,0),\"\")","v":""},{"$f":"IF($AL$425=1,IF(ISNUMBER(SEARCH($AK$425,'Hide this - Workings'!D94)),1,0),\"\")","v":""},{"$f":"IF($AL$426=1,IF(ISNUMBER(SEARCH($AK$426,'Hide this - Workings'!D94)),1,0),\"\")","v":""},{"$f":"IF($AL$427=1,IF(ISNUMBER(SEARCH($AK$427,'Hide this - Workings'!D94)),1,0),\"\")","v":""},{"$f":"IF($AL$428=1,IF(ISNUMBER(SEARCH($AK$428,'Hide this - Workings'!D94)),1,0),\"\")","v":""},{"$f":"IF($AL$429=1,IF(ISNUMBER(SEARCH($AK$429,'Hide this - Workings'!D94)),1,0),\"\")","v":""},{"$f":"IF($AL$430=1,IF(ISNUMBER(SEARCH($AK$430,'Hide this - Workings'!D94)),1,0),\"\")","v":""},{"$f":"IF($AL$431=1,IF(ISNUMBER(SEARCH($AK$431,'Hide this - Workings'!D94)),1,0),\"\")","v":""},{"$f":"IF($AL$432=1,IF(ISNUMBER(SEARCH($AK$432,'Hide this - Workings'!D94)),1,0),\"\")","v":""},{"$f":"IF($AL$433=1,IF(ISNUMBER(SEARCH($AK$433,'Hide this - Workings'!D94)),1,0),\"\")","v":""},0,"A090",0,"I have checked the guidance and FAQ’s – I was wondering how we count NRPF cases, would we count them as a long term service? Or would we exclude them? I have been discussing this with my colleagues. The guidance isn’t prescriptive in this instance, but we would suggest this is recorded. Having done some reading into NRPF, according to Social services support for adults | NRPF (nrpfnetwork.org.uk) “When an adult cannot access benefits and housing assistance due to having no recourse to public funds, their local council may have a duty to provide accommodation and financial support if the adult is assessed as having care and support needs by social services. We would advise that you caveat this in the relevant comments boxes when completing the return. Happy to answer any other questions you may have.","I have checked the guidance and FAQ’s – I was wondering how we count NRPF cases, would we count them as a long term service? Or would we exclude them?","I have been discussing this with my colleagues. The guidance isn’t prescriptive in this instance, but we would suggest this is recorded. Having done some reading into NRPF, according to Social services support for adults | NRPF (nrpfnetwork.org.uk) “When an adult cannot access benefits and housing assistance due to having no recourse to public funds, their local council may have a duty to provide accommodation and financial support if the adult is assessed as having care and support needs by social services. We would advise that you caveat this in the relevant comments boxes when completing the return. Happy to answer any other questions you may have."]
[null,null,null,"We are preparing data for the SALT return, and we have a query about the correct categorisation of the data for LTS003, Carer Support, which we would be grateful if you could advise on please.  We provide grants to the voluntary sector to provide support to carers. The voluntary sector provide us with a list of carers to whom they provide services. Our question to you is – we think this support be included in LTS003 as “Information, Advice and Universal Services / Signposting” instead of as “LA Commissioned Support” – is this correct please? We have also read the following similar queries in the SALT FAQs. The guidance below recognises that authorities may have different funding arrangements with third party organisations – how does this relate to the above please? How do you advise we approach grants in SALT? We think this should go down as CASSR Commissioned Support. The CASSR are providing funds for actual care to be provided via a third party rather than Information or Advice.",null,null,null,null,null,null,null,"We are preparing data for the SALT return, and we have a query about the correct categorisation of the data for LTS003, Carer Support, which we would be grateful if you could advise on please.  We provide grants to the voluntary sector to provide support to carers. The voluntary sector provide us with a list of carers to whom they provide services. Our question to you is – we think this support be included in LTS003 as “Information, Advice and Universal Services / Signposting” instead of as “LA Commissioned Support” – is this correct please? We have also read the following similar queries in the SALT FAQs. The guidance below recognises that authorities may have different funding arrangements with third party organisations – how does this relate to the above please? How do you advise we approach grants in SALT?","We think this should go down as CASSR Commissioned Support. The CASSR are providing funds for actual care to be provided via a third party rather than Information or Advice.",{"$f":"IF($AL$417=1,IF(ISNUMBER(SEARCH($AK$417,'Hide this - Workings'!D95)),1,0),\"\")","v":""},{"$f":"IF($AL$418=1,IF(ISNUMBER(SEARCH($AK$418,'Hide this - Workings'!D95)),1,0),\"\")","v":""},{"$f":"IF($AL$419=1,IF(ISNUMBER(SEARCH($AK$419,'Hide this - Workings'!D95)),1,0),\"\")","v":""},{"$f":"IF($AL$420=1,IF(ISNUMBER(SEARCH($AK$420,'Hide this - Workings'!D95)),1,0),\"\")","v":""},{"$f":"IF($AL$421=1,IF(ISNUMBER(SEARCH($AK$421,'Hide this - Workings'!D95)),1,0),\"\")","v":""},{"$f":"IF($AL$422=1,IF(ISNUMBER(SEARCH($AK$422,'Hide this - Workings'!D95)),1,0),\"\")","v":""},{"$f":"IF($AL$423=1,IF(ISNUMBER(SEARCH($AK$423,'Hide this - Workings'!D95)),1,0),\"\")","v":""},{"$f":"IF($AL$424=1,IF(ISNUMBER(SEARCH($AK$424,'Hide this - Workings'!D95)),1,0),\"\")","v":""},{"$f":"IF($AL$425=1,IF(ISNUMBER(SEARCH($AK$425,'Hide this - Workings'!D95)),1,0),\"\")","v":""},{"$f":"IF($AL$426=1,IF(ISNUMBER(SEARCH($AK$426,'Hide this - Workings'!D95)),1,0),\"\")","v":""},{"$f":"IF($AL$427=1,IF(ISNUMBER(SEARCH($AK$427,'Hide this - Workings'!D95)),1,0),\"\")","v":""},{"$f":"IF($AL$428=1,IF(ISNUMBER(SEARCH($AK$428,'Hide this - Workings'!D95)),1,0),\"\")","v":""},{"$f":"IF($AL$429=1,IF(ISNUMBER(SEARCH($AK$429,'Hide this - Workings'!D95)),1,0),\"\")","v":""},{"$f":"IF($AL$430=1,IF(ISNUMBER(SEARCH($AK$430,'Hide this - Workings'!D95)),1,0),\"\")","v":""},{"$f":"IF($AL$431=1,IF(ISNUMBER(SEARCH($AK$431,'Hide this - Workings'!D95)),1,0),\"\")","v":""},{"$f":"IF($AL$432=1,IF(ISNUMBER(SEARCH($AK$432,'Hide this - Workings'!D95)),1,0),\"\")","v":""},{"$f":"IF($AL$433=1,IF(ISNUMBER(SEARCH($AK$433,'Hide this - Workings'!D95)),1,0),\"\")","v":""},0,"A091",0,"We are preparing data for the SALT return, and we have a query about the correct categorisation of the data for LTS003, Carer Support, which we would be grateful if you could advise on please.  We provide grants to the voluntary sector to provide support to carers. The voluntary sector provide us with a list of carers to whom they provide services. Our question to you is – we think this support be included in LTS003 as “Information, Advice and Universal Services / Signposting” instead of as “LA Commissioned Support” – is this correct please? We have also read the following similar queries in the SALT FAQs. The guidance below recognises that authorities may have different funding arrangements with third party organisations – how does this relate to the above please? How do you advise we approach grants in SALT? We think this should go down as CASSR Commissioned Support. The CASSR are providing funds for actual care to be provided via a third party rather than Information or Advice.","We are preparing data for the SALT return, and we have a query about the correct categorisation of the data for LTS003, Carer Support, which we would be grateful if you could advise on please.  We provide grants to the voluntary sector to provide support to carers. The voluntary sector provide us with a list of carers to whom they provide services. Our question to you is – we think this support be included in LTS003 as “Information, Advice and Universal Services / Signposting” instead of as “LA Commissioned Support” – is this correct please? We have also read the following similar queries in the SALT FAQs. The guidance below recognises that authorities may have different funding arrangements with third party organisations – how does this relate to the above please? How do you advise we approach grants in SALT?","We think this should go down as CASSR Commissioned Support. The CASSR are providing funds for actual care to be provided via a third party rather than Information or Advice."]
[null,null,null,null,null,null,null,null,null,null,null,null,null,{"$f":"IF($AL$417=1,IF(ISNUMBER(SEARCH($AK$417,'Hide this - Workings'!D96)),1,0),\"\")","v":""},{"$f":"IF($AL$418=1,IF(ISNUMBER(SEARCH($AK$418,'Hide this - Workings'!D96)),1,0),\"\")","v":""},{"$f":"IF($AL$419=1,IF(ISNUMBER(SEARCH($AK$419,'Hide this - Workings'!D96)),1,0),\"\")","v":""},{"$f":"IF($AL$420=1,IF(ISNUMBER(SEARCH($AK$420,'Hide this - Workings'!D96)),1,0),\"\")","v":""},{"$f":"IF($AL$421=1,IF(ISNUMBER(SEARCH($AK$421,'Hide this - Workings'!D96)),1,0),\"\")","v":""},{"$f":"IF($AL$422=1,IF(ISNUMBER(SEARCH($AK$422,'Hide this - Workings'!D96)),1,0),\"\")","v":""},{"$f":"IF($AL$423=1,IF(ISNUMBER(SEARCH($AK$423,'Hide this - Workings'!D96)),1,0),\"\")","v":""},{"$f":"IF($AL$424=1,IF(ISNUMBER(SEARCH($AK$424,'Hide this - Workings'!D96)),1,0),\"\")","v":""},{"$f":"IF($AL$425=1,IF(ISNUMBER(SEARCH($AK$425,'Hide this - Workings'!D96)),1,0),\"\")","v":""},{"$f":"IF($AL$426=1,IF(ISNUMBER(SEARCH($AK$426,'Hide this - Workings'!D96)),1,0),\"\")","v":""},{"$f":"IF($AL$427=1,IF(ISNUMBER(SEARCH($AK$427,'Hide this - Workings'!D96)),1,0),\"\")","v":""},{"$f":"IF($AL$428=1,IF(ISNUMBER(SEARCH($AK$428,'Hide this - Workings'!D96)),1,0),\"\")","v":""},{"$f":"IF($AL$429=1,IF(ISNUMBER(SEARCH($AK$429,'Hide this - Workings'!D96)),1,0),\"\")","v":""},{"$f":"IF($AL$430=1,IF(ISNUMBER(SEARCH($AK$430,'Hide this - Workings'!D96)),1,0),\"\")","v":""},{"$f":"IF($AL$431=1,IF(ISNUMBER(SEARCH($AK$431,'Hide this - Workings'!D96)),1,0),\"\")","v":""},{"$f":"IF($AL$432=1,IF(ISNUMBER(SEARCH($AK$432,'Hide this - Workings'!D96)),1,0),\"\")","v":""},{"$f":"IF($AL$433=1,IF(ISNUMBER(SEARCH($AK$433,'Hide this - Workings'!D96)),1,0),\"\")","v":""},{"$f":"SUM(N96:AD96)","v":0},"A092",{"$f":"AE96","v":0},0,0,0]
[null,null,null,null,null,null,null,null,null,null,null,null,null,{"$f":"IF($AL$417=1,IF(ISNUMBER(SEARCH($AK$417,'Hide this - Workings'!D97)),1,0),\"\")","v":""},{"$f":"IF($AL$418=1,IF(ISNUMBER(SEARCH($AK$418,'Hide this - Workings'!D97)),1,0),\"\")","v":""},{"$f":"IF($AL$419=1,IF(ISNUMBER(SEARCH($AK$419,'Hide this - Workings'!D97)),1,0),\"\")","v":""},{"$f":"IF($AL$420=1,IF(ISNUMBER(SEARCH($AK$420,'Hide this - Workings'!D97)),1,0),\"\")","v":""},{"$f":"IF($AL$421=1,IF(ISNUMBER(SEARCH($AK$421,'Hide this - Workings'!D97)),1,0),\"\")","v":""},{"$f":"IF($AL$422=1,IF(ISNUMBER(SEARCH($AK$422,'Hide this - Workings'!D97)),1,0),\"\")","v":""},{"$f":"IF($AL$423=1,IF(ISNUMBER(SEARCH($AK$423,'Hide this - Workings'!D97)),1,0),\"\")","v":""},{"$f":"IF($AL$424=1,IF(ISNUMBER(SEARCH($AK$424,'Hide this - Workings'!D97)),1,0),\"\")","v":""},{"$f":"IF($AL$425=1,IF(ISNUMBER(SEARCH($AK$425,'Hide this - Workings'!D97)),1,0),\"\")","v":""},{"$f":"IF($AL$426=1,IF(ISNUMBER(SEARCH($AK$426,'Hide this - Workings'!D97)),1,0),\"\")","v":""},{"$f":"IF($AL$427=1,IF(ISNUMBER(SEARCH($AK$427,'Hide this - Workings'!D97)),1,0),\"\")","v":""},{"$f":"IF($AL$428=1,IF(ISNUMBER(SEARCH($AK$428,'Hide this - Workings'!D97)),1,0),\"\")","v":""},{"$f":"IF($AL$429=1,IF(ISNUMBER(SEARCH($AK$429,'Hide this - Workings'!D97)),1,0),\"\")","v":""},{"$f":"IF($AL$430=1,IF(ISNUMBER(SEARCH($AK$430,'Hide this - Workings'!D97)),1,0),\"\")","v":""},{"$f":"IF($AL$431=1,IF(ISNUMBER(SEARCH($AK$431,'Hide this - Workings'!D97)),1,0),\"\")","v":""},{"$f":"IF($AL$432=1,IF(ISNUMBER(SEARCH($AK$432,'Hide this - Workings'!D97)),1,0),\"\")","v":""},{"$f":"IF($AL$433=1,IF(ISNUMBER(SEARCH($AK$433,'Hide this - Workings'!D97)),1,0),\"\")","v":""},0,"A093",0,0,0,0]
[null,null,null,null,null,null,null,null,null,null,null,null,null,{"$f":"IF($AL$417=1,IF(ISNUMBER(SEARCH($AK$417,'Hide this - Workings'!D98)),1,0),\"\")","v":""},{"$f":"IF($AL$418=1,IF(ISNUMBER(SEARCH($AK$418,'Hide this - Workings'!D98)),1,0),\"\")","v":""},{"$f":"IF($AL$419=1,IF(ISNUMBER(SEARCH($AK$419,'Hide this - Workings'!D98)),1,0),\"\")","v":""},{"$f":"IF($AL$420=1,IF(ISNUMBER(SEARCH($AK$420,'Hide this - Workings'!D98)),1,0),\"\")","v":""},{"$f":"IF($AL$421=1,IF(ISNUMBER(SEARCH($AK$421,'Hide this - Workings'!D98)),1,0),\"\")","v":""},{"$f":"IF($AL$422=1,IF(ISNUMBER(SEARCH($AK$422,'Hide this - Workings'!D98)),1,0),\"\")","v":""},{"$f":"IF($AL$423=1,IF(ISNUMBER(SEARCH($AK$423,'Hide this - Workings'!D98)),1,0),\"\")","v":""},{"$f":"IF($AL$424=1,IF(ISNUMBER(SEARCH($AK$424,'Hide this - Workings'!D98)),1,0),\"\")","v":""},{"$f":"IF($AL$425=1,IF(ISNUMBER(SEARCH($AK$425,'Hide this - Workings'!D98)),1,0),\"\")","v":""},{"$f":"IF($AL$426=1,IF(ISNUMBER(SEARCH($AK$426,'Hide this - Workings'!D98)),1,0),\"\")","v":""},{"$f":"IF($AL$427=1,IF(ISNUMBER(SEARCH($AK$427,'Hide this - Workings'!D98)),1,0),\"\")","v":""},{"$f":"IF($AL$428=1,IF(ISNUMBER(SEARCH($AK$428,'Hide this - Workings'!D98)),1,0),\"\")","v":""},{"$f":"IF($AL$429=1,IF(ISNUMBER(SEARCH($AK$429,'Hide this - Workings'!D98)),1,0),\"\")","v":""},{"$f":"IF($AL$430=1,IF(ISNUMBER(SEARCH($AK$430,'Hide this - Workings'!D98)),1,0),\"\")","v":""},{"$f":"IF($AL$431=1,IF(ISNUMBER(SEARCH($AK$431,'Hide this - Workings'!D98)),1,0),\"\")","v":""},{"$f":"IF($AL$432=1,IF(ISNUMBER(SEARCH($AK$432,'Hide this - Workings'!D98)),1,0),\"\")","v":""},{"$f":"IF($AL$433=1,IF(ISNUMBER(SEARCH($AK$433,'Hide this - Workings'!D98)),1,0),\"\")","v":""},0,"A094",0,0,0,0]
[null,null,null,null,null,null,null,null,null,null,null,null,null,{"$f":"IF($AL$417=1,IF(ISNUMBER(SEARCH($AK$417,'Hide this - Workings'!D99)),1,0),\"\")","v":""},{"$f":"IF($AL$418=1,IF(ISNUMBER(SEARCH($AK$418,'Hide this - Workings'!D99)),1,0),\"\")","v":""},{"$f":"IF($AL$419=1,IF(ISNUMBER(SEARCH($AK$419,'Hide this - Workings'!D99)),1,0),\"\")","v":""},{"$f":"IF($AL$420=1,IF(ISNUMBER(SEARCH($AK$420,'Hide this - Workings'!D99)),1,0),\"\")","v":""},{"$f":"IF($AL$421=1,IF(ISNUMBER(SEARCH($AK$421,'Hide this - Workings'!D99)),1,0),\"\")","v":""},{"$f":"IF($AL$422=1,IF(ISNUMBER(SEARCH($AK$422,'Hide this - Workings'!D99)),1,0),\"\")","v":""},{"$f":"IF($AL$423=1,IF(ISNUMBER(SEARCH($AK$423,'Hide this - Workings'!D99)),1,0),\"\")","v":""},{"$f":"IF($AL$424=1,IF(ISNUMBER(SEARCH($AK$424,'Hide this - Workings'!D99)),1,0),\"\")","v":""},{"$f":"IF($AL$425=1,IF(ISNUMBER(SEARCH($AK$425,'Hide this - Workings'!D99)),1,0),\"\")","v":""},{"$f":"IF($AL$426=1,IF(ISNUMBER(SEARCH($AK$426,'Hide this - Workings'!D99)),1,0),\"\")","v":""},{"$f":"IF($AL$427=1,IF(ISNUMBER(SEARCH($AK$427,'Hide this - Workings'!D99)),1,0),\"\")","v":""},{"$f":"IF($AL$428=1,IF(ISNUMBER(SEARCH($AK$428,'Hide this - Workings'!D99)),1,0),\"\")","v":""},{"$f":"IF($AL$429=1,IF(ISNUMBER(SEARCH($AK$429,'Hide this - Workings'!D99)),1,0),\"\")","v":""},{"$f":"IF($AL$430=1,IF(ISNUMBER(SEARCH($AK$430,'Hide this - Workings'!D99)),1,0),\"\")","v":""},{"$f":"IF($AL$431=1,IF(ISNUMBER(SEARCH($AK$431,'Hide this - Workings'!D99)),1,0),\"\")","v":""},{"$f":"IF($AL$432=1,IF(ISNUMBER(SEARCH($AK$432,'Hide this - Workings'!D99)),1,0),\"\")","v":""},{"$f":"IF($AL$433=1,IF(ISNUMBER(SEARCH($AK$433,'Hide this - Workings'!D99)),1,0),\"\")","v":""},0,"A095",0,{"$f":"IF((IFERROR(N99,0))>1,D99,\"\")","v":0},{"$f":"IF((IFERROR(N99,0))>1,L99,\"\")","v":0},{"$f":"IF((IFERROR(N99,0))>1,M99,\"\")","v":0}]
[null,null,null,null,null,null,null,null,null,null,null,null,null,{"$f":"IF($AL$417=1,IF(ISNUMBER(SEARCH($AK$417,'Hide this - Workings'!D100)),1,0),\"\")","v":""},{"$f":"IF($AL$418=1,IF(ISNUMBER(SEARCH($AK$418,'Hide this - Workings'!D100)),1,0),\"\")","v":""},{"$f":"IF($AL$419=1,IF(ISNUMBER(SEARCH($AK$419,'Hide this - Workings'!D100)),1,0),\"\")","v":""},{"$f":"IF($AL$420=1,IF(ISNUMBER(SEARCH($AK$420,'Hide this - Workings'!D100)),1,0),\"\")","v":""},{"$f":"IF($AL$421=1,IF(ISNUMBER(SEARCH($AK$421,'Hide this - Workings'!D100)),1,0),\"\")","v":""},{"$f":"IF($AL$422=1,IF(ISNUMBER(SEARCH($AK$422,'Hide this - Workings'!D100)),1,0),\"\")","v":""},{"$f":"IF($AL$423=1,IF(ISNUMBER(SEARCH($AK$423,'Hide this - Workings'!D100)),1,0),\"\")","v":""},{"$f":"IF($AL$424=1,IF(ISNUMBER(SEARCH($AK$424,'Hide this - Workings'!D100)),1,0),\"\")","v":""},{"$f":"IF($AL$425=1,IF(ISNUMBER(SEARCH($AK$425,'Hide this - Workings'!D100)),1,0),\"\")","v":""},{"$f":"IF($AL$426=1,IF(ISNUMBER(SEARCH($AK$426,'Hide this - Workings'!D100)),1,0),\"\")","v":""},{"$f":"IF($AL$427=1,IF(ISNUMBER(SEARCH($AK$427,'Hide this - Workings'!D100)),1,0),\"\")","v":""},{"$f":"IF($AL$428=1,IF(ISNUMBER(SEARCH($AK$428,'Hide this - Workings'!D100)),1,0),\"\")","v":""},{"$f":"IF($AL$429=1,IF(ISNUMBER(SEARCH($AK$429,'Hide this - Workings'!D100)),1,0),\"\")","v":""},{"$f":"IF($AL$430=1,IF(ISNUMBER(SEARCH($AK$430,'Hide this - Workings'!D100)),1,0),\"\")","v":""},{"$f":"IF($AL$431=1,IF(ISNUMBER(SEARCH($AK$431,'Hide this - Workings'!D100)),1,0),\"\")","v":""},{"$f":"IF($AL$432=1,IF(ISNUMBER(SEARCH($AK$432,'Hide this - Workings'!D100)),1,0),\"\")","v":""},{"$f":"IF($AL$433=1,IF(ISNUMBER(SEARCH($AK$433,'Hide this - Workings'!D100)),1,0),\"\")","v":""},0,"A096",0,0,0,0]
[null,null,null,null,null,null,null,null,null,null,null,null,null,{"$f":"IF($AL$417=1,IF(ISNUMBER(SEARCH($AK$417,'Hide this - Workings'!D101)),1,0),\"\")","v":""},{"$f":"IF($AL$418=1,IF(ISNUMBER(SEARCH($AK$418,'Hide this - Workings'!D101)),1,0),\"\")","v":""},{"$f":"IF($AL$419=1,IF(ISNUMBER(SEARCH($AK$419,'Hide this - Workings'!D101)),1,0),\"\")","v":""},{"$f":"IF($AL$420=1,IF(ISNUMBER(SEARCH($AK$420,'Hide this - Workings'!D101)),1,0),\"\")","v":""},{"$f":"IF($AL$421=1,IF(ISNUMBER(SEARCH($AK$421,'Hide this - Workings'!D101)),1,0),\"\")","v":""},{"$f":"IF($AL$422=1,IF(ISNUMBER(SEARCH($AK$422,'Hide this - Workings'!D101)),1,0),\"\")","v":""},{"$f":"IF($AL$423=1,IF(ISNUMBER(SEARCH($AK$423,'Hide this - Workings'!D101)),1,0),\"\")","v":""},{"$f":"IF($AL$424=1,IF(ISNUMBER(SEARCH($AK$424,'Hide this - Workings'!D101)),1,0),\"\")","v":""},{"$f":"IF($AL$425=1,IF(ISNUMBER(SEARCH($AK$425,'Hide this - Workings'!D101)),1,0),\"\")","v":""},{"$f":"IF($AL$426=1,IF(ISNUMBER(SEARCH($AK$426,'Hide this - Workings'!D101)),1,0),\"\")","v":""},{"$f":"IF($AL$427=1,IF(ISNUMBER(SEARCH($AK$427,'Hide this - Workings'!D101)),1,0),\"\")","v":""},{"$f":"IF($AL$428=1,IF(ISNUMBER(SEARCH($AK$428,'Hide this - Workings'!D101)),1,0),\"\")","v":""},{"$f":"IF($AL$429=1,IF(ISNUMBER(SEARCH($AK$429,'Hide this - Workings'!D101)),1,0),\"\")","v":""},{"$f":"IF($AL$430=1,IF(ISNUMBER(SEARCH($AK$430,'Hide this - Workings'!D101)),1,0),\"\")","v":""},{"$f":"IF($AL$431=1,IF(ISNUMBER(SEARCH($AK$431,'Hide this - Workings'!D101)),1,0),\"\")","v":""},{"$f":"IF($AL$432=1,IF(ISNUMBER(SEARCH($AK$432,'Hide this - Workings'!D101)),1,0),\"\")","v":""},{"$f":"IF($AL$433=1,IF(ISNUMBER(SEARCH($AK$433,'Hide this - Workings'!D101)),1,0),\"\")","v":""},0,"A097",0,0,0,0]
[null,null,null,null,null,null,null,null,null,null,null,null,null,{"$f":"IF($AL$417=1,IF(ISNUMBER(SEARCH($AK$417,'Hide this - Workings'!D102)),1,0),\"\")","v":""},{"$f":"IF($AL$418=1,IF(ISNUMBER(SEARCH($AK$418,'Hide this - Workings'!D102)),1,0),\"\")","v":""},{"$f":"IF($AL$419=1,IF(ISNUMBER(SEARCH($AK$419,'Hide this - Workings'!D102)),1,0),\"\")","v":""},{"$f":"IF($AL$420=1,IF(ISNUMBER(SEARCH($AK$420,'Hide this - Workings'!D102)),1,0),\"\")","v":""},{"$f":"IF($AL$421=1,IF(ISNUMBER(SEARCH($AK$421,'Hide this - Workings'!D102)),1,0),\"\")","v":""},{"$f":"IF($AL$422=1,IF(ISNUMBER(SEARCH($AK$422,'Hide this - Workings'!D102)),1,0),\"\")","v":""},{"$f":"IF($AL$423=1,IF(ISNUMBER(SEARCH($AK$423,'Hide this - Workings'!D102)),1,0),\"\")","v":""},{"$f":"IF($AL$424=1,IF(ISNUMBER(SEARCH($AK$424,'Hide this - Workings'!D102)),1,0),\"\")","v":""},{"$f":"IF($AL$425=1,IF(ISNUMBER(SEARCH($AK$425,'Hide this - Workings'!D102)),1,0),\"\")","v":""},{"$f":"IF($AL$426=1,IF(ISNUMBER(SEARCH($AK$426,'Hide this - Workings'!D102)),1,0),\"\")","v":""},{"$f":"IF($AL$427=1,IF(ISNUMBER(SEARCH($AK$427,'Hide this - Workings'!D102)),1,0),\"\")","v":""},{"$f":"IF($AL$428=1,IF(ISNUMBER(SEARCH($AK$428,'Hide this - Workings'!D102)),1,0),\"\")","v":""},{"$f":"IF($AL$429=1,IF(ISNUMBER(SEARCH($AK$429,'Hide this - Workings'!D102)),1,0),\"\")","v":""},{"$f":"IF($AL$430=1,IF(ISNUMBER(SEARCH($AK$430,'Hide this - Workings'!D102)),1,0),\"\")","v":""},{"$f":"IF($AL$431=1,IF(ISNUMBER(SEARCH($AK$431,'Hide this - Workings'!D102)),1,0),\"\")","v":""},{"$f":"IF($AL$432=1,IF(ISNUMBER(SEARCH($AK$432,'Hide this - Workings'!D102)),1,0),\"\")","v":""},{"$f":"IF($AL$433=1,IF(ISNUMBER(SEARCH($AK$433,'Hide this - Workings'!D102)),1,0),\"\")","v":""},0,"A098",0,0,0,0]
[null,null,null,null,null,null,null,null,null,null,null,null,null,{"$f":"IF($AL$417=1,IF(ISNUMBER(SEARCH($AK$417,'Hide this - Workings'!D103)),1,0),\"\")","v":""},{"$f":"IF($AL$418=1,IF(ISNUMBER(SEARCH($AK$418,'Hide this - Workings'!D103)),1,0),\"\")","v":""},{"$f":"IF($AL$419=1,IF(ISNUMBER(SEARCH($AK$419,'Hide this - Workings'!D103)),1,0),\"\")","v":""},{"$f":"IF($AL$420=1,IF(ISNUMBER(SEARCH($AK$420,'Hide this - Workings'!D103)),1,0),\"\")","v":""},{"$f":"IF($AL$421=1,IF(ISNUMBER(SEARCH($AK$421,'Hide this - Workings'!D103)),1,0),\"\")","v":""},{"$f":"IF($AL$422=1,IF(ISNUMBER(SEARCH($AK$422,'Hide this - Workings'!D103)),1,0),\"\")","v":""},{"$f":"IF($AL$423=1,IF(ISNUMBER(SEARCH($AK$423,'Hide this - Workings'!D103)),1,0),\"\")","v":""},{"$f":"IF($AL$424=1,IF(ISNUMBER(SEARCH($AK$424,'Hide this - Workings'!D103)),1,0),\"\")","v":""},{"$f":"IF($AL$425=1,IF(ISNUMBER(SEARCH($AK$425,'Hide this - Workings'!D103)),1,0),\"\")","v":""},{"$f":"IF($AL$426=1,IF(ISNUMBER(SEARCH($AK$426,'Hide this - Workings'!D103)),1,0),\"\")","v":""},{"$f":"IF($AL$427=1,IF(ISNUMBER(SEARCH($AK$427,'Hide this - Workings'!D103)),1,0),\"\")","v":""},{"$f":"IF($AL$428=1,IF(ISNUMBER(SEARCH($AK$428,'Hide this - Workings'!D103)),1,0),\"\")","v":""},{"$f":"IF($AL$429=1,IF(ISNUMBER(SEARCH($AK$429,'Hide this - Workings'!D103)),1,0),\"\")","v":""},{"$f":"IF($AL$430=1,IF(ISNUMBER(SEARCH($AK$430,'Hide this - Workings'!D103)),1,0),\"\")","v":""},{"$f":"IF($AL$431=1,IF(ISNUMBER(SEARCH($AK$431,'Hide this - Workings'!D103)),1,0),\"\")","v":""},{"$f":"IF($AL$432=1,IF(ISNUMBER(SEARCH($AK$432,'Hide this - Workings'!D103)),1,0),\"\")","v":""},{"$f":"IF($AL$433=1,IF(ISNUMBER(SEARCH($AK$433,'Hide this - Workings'!D103)),1,0),\"\")","v":""},0,"A099",0,0,0,0]
[null,null,null,null,null,null,null,null,null,null,null,null,null,{"$f":"IF($AL$417=1,IF(ISNUMBER(SEARCH($AK$417,'Hide this - Workings'!D104)),1,0),\"\")","v":""},{"$f":"IF($AL$418=1,IF(ISNUMBER(SEARCH($AK$418,'Hide this - Workings'!D104)),1,0),\"\")","v":""},{"$f":"IF($AL$419=1,IF(ISNUMBER(SEARCH($AK$419,'Hide this - Workings'!D104)),1,0),\"\")","v":""},{"$f":"IF($AL$420=1,IF(ISNUMBER(SEARCH($AK$420,'Hide this - Workings'!D104)),1,0),\"\")","v":""},{"$f":"IF($AL$421=1,IF(ISNUMBER(SEARCH($AK$421,'Hide this - Workings'!D104)),1,0),\"\")","v":""},{"$f":"IF($AL$422=1,IF(ISNUMBER(SEARCH($AK$422,'Hide this - Workings'!D104)),1,0),\"\")","v":""},{"$f":"IF($AL$423=1,IF(ISNUMBER(SEARCH($AK$423,'Hide this - Workings'!D104)),1,0),\"\")","v":""},{"$f":"IF($AL$424=1,IF(ISNUMBER(SEARCH($AK$424,'Hide this - Workings'!D104)),1,0),\"\")","v":""},{"$f":"IF($AL$425=1,IF(ISNUMBER(SEARCH($AK$425,'Hide this - Workings'!D104)),1,0),\"\")","v":""},{"$f":"IF($AL$426=1,IF(ISNUMBER(SEARCH($AK$426,'Hide this - Workings'!D104)),1,0),\"\")","v":""},{"$f":"IF($AL$427=1,IF(ISNUMBER(SEARCH($AK$427,'Hide this - Workings'!D104)),1,0),\"\")","v":""},{"$f":"IF($AL$428=1,IF(ISNUMBER(SEARCH($AK$428,'Hide this - Workings'!D104)),1,0),\"\")","v":""},{"$f":"IF($AL$429=1,IF(ISNUMBER(SEARCH($AK$429,'Hide this - Workings'!D104)),1,0),\"\")","v":""},{"$f":"IF($AL$430=1,IF(ISNUMBER(SEARCH($AK$430,'Hide this - Workings'!D104)),1,0),\"\")","v":""},{"$f":"IF($AL$431=1,IF(ISNUMBER(SEARCH($AK$431,'Hide this - Workings'!D104)),1,0),\"\")","v":""},{"$f":"IF($AL$432=1,IF(ISNUMBER(SEARCH($AK$432,'Hide this - Workings'!D104)),1,0),\"\")","v":""},{"$f":"IF($AL$433=1,IF(ISNUMBER(SEARCH($AK$433,'Hide this - Workings'!D104)),1,0),\"\")","v":""},0,"A100",0,0,0,0]
[null,null,null,null,null,null,null,null,null,null,null,null,null,{"$f":"IF($AL$417=1,IF(ISNUMBER(SEARCH($AK$417,'Hide this - Workings'!D105)),1,0),\"\")","v":""},{"$f":"IF($AL$418=1,IF(ISNUMBER(SEARCH($AK$418,'Hide this - Workings'!D105)),1,0),\"\")","v":""},{"$f":"IF($AL$419=1,IF(ISNUMBER(SEARCH($AK$419,'Hide this - Workings'!D105)),1,0),\"\")","v":""},{"$f":"IF($AL$420=1,IF(ISNUMBER(SEARCH($AK$420,'Hide this - Workings'!D105)),1,0),\"\")","v":""},{"$f":"IF($AL$421=1,IF(ISNUMBER(SEARCH($AK$421,'Hide this - Workings'!D105)),1,0),\"\")","v":""},{"$f":"IF($AL$422=1,IF(ISNUMBER(SEARCH($AK$422,'Hide this - Workings'!D105)),1,0),\"\")","v":""},{"$f":"IF($AL$423=1,IF(ISNUMBER(SEARCH($AK$423,'Hide this - Workings'!D105)),1,0),\"\")","v":""},{"$f":"IF($AL$424=1,IF(ISNUMBER(SEARCH($AK$424,'Hide this - Workings'!D105)),1,0),\"\")","v":""},{"$f":"IF($AL$425=1,IF(ISNUMBER(SEARCH($AK$425,'Hide this - Workings'!D105)),1,0),\"\")","v":""},{"$f":"IF($AL$426=1,IF(ISNUMBER(SEARCH($AK$426,'Hide this - Workings'!D105)),1,0),\"\")","v":""},{"$f":"IF($AL$427=1,IF(ISNUMBER(SEARCH($AK$427,'Hide this - Workings'!D105)),1,0),\"\")","v":""},{"$f":"IF($AL$428=1,IF(ISNUMBER(SEARCH($AK$428,'Hide this - Workings'!D105)),1,0),\"\")","v":""},{"$f":"IF($AL$429=1,IF(ISNUMBER(SEARCH($AK$429,'Hide this - Workings'!D105)),1,0),\"\")","v":""},{"$f":"IF($AL$430=1,IF(ISNUMBER(SEARCH($AK$430,'Hide this - Workings'!D105)),1,0),\"\")","v":""},{"$f":"IF($AL$431=1,IF(ISNUMBER(SEARCH($AK$431,'Hide this - Workings'!D105)),1,0),\"\")","v":""},{"$f":"IF($AL$432=1,IF(ISNUMBER(SEARCH($AK$432,'Hide this - Workings'!D105)),1,0),\"\")","v":""},{"$f":"IF($AL$433=1,IF(ISNUMBER(SEARCH($AK$433,'Hide this - Workings'!D105)),1,0),\"\")","v":""},0,"A101",0,0,0,0]
[null,null,null,null,null,null,null,null,null,null,null,null,null,{"$f":"IF($AL$417=1,IF(ISNUMBER(SEARCH($AK$417,'Hide this - Workings'!D106)),1,0),\"\")","v":""},{"$f":"IF($AL$418=1,IF(ISNUMBER(SEARCH($AK$418,'Hide this - Workings'!D106)),1,0),\"\")","v":""},{"$f":"IF($AL$419=1,IF(ISNUMBER(SEARCH($AK$419,'Hide this - Workings'!D106)),1,0),\"\")","v":""},{"$f":"IF($AL$420=1,IF(ISNUMBER(SEARCH($AK$420,'Hide this - Workings'!D106)),1,0),\"\")","v":""},{"$f":"IF($AL$421=1,IF(ISNUMBER(SEARCH($AK$421,'Hide this - Workings'!D106)),1,0),\"\")","v":""},{"$f":"IF($AL$422=1,IF(ISNUMBER(SEARCH($AK$422,'Hide this - Workings'!D106)),1,0),\"\")","v":""},{"$f":"IF($AL$423=1,IF(ISNUMBER(SEARCH($AK$423,'Hide this - Workings'!D106)),1,0),\"\")","v":""},{"$f":"IF($AL$424=1,IF(ISNUMBER(SEARCH($AK$424,'Hide this - Workings'!D106)),1,0),\"\")","v":""},{"$f":"IF($AL$425=1,IF(ISNUMBER(SEARCH($AK$425,'Hide this - Workings'!D106)),1,0),\"\")","v":""},{"$f":"IF($AL$426=1,IF(ISNUMBER(SEARCH($AK$426,'Hide this - Workings'!D106)),1,0),\"\")","v":""},{"$f":"IF($AL$427=1,IF(ISNUMBER(SEARCH($AK$427,'Hide this - Workings'!D106)),1,0),\"\")","v":""},{"$f":"IF($AL$428=1,IF(ISNUMBER(SEARCH($AK$428,'Hide this - Workings'!D106)),1,0),\"\")","v":""},{"$f":"IF($AL$429=1,IF(ISNUMBER(SEARCH($AK$429,'Hide this - Workings'!D106)),1,0),\"\")","v":""},{"$f":"IF($AL$430=1,IF(ISNUMBER(SEARCH($AK$430,'Hide this - Workings'!D106)),1,0),\"\")","v":""},{"$f":"IF($AL$431=1,IF(ISNUMBER(SEARCH($AK$431,'Hide this - Workings'!D106)),1,0),\"\")","v":""},{"$f":"IF($AL$432=1,IF(ISNUMBER(SEARCH($AK$432,'Hide this - Workings'!D106)),1,0),\"\")","v":""},{"$f":"IF($AL$433=1,IF(ISNUMBER(SEARCH($AK$433,'Hide this - Workings'!D106)),1,0),\"\")","v":""},0,"A102",0,0,0,0]
[null,null,null,null,null,null,null,null,null,null,null,null,null,{"$f":"IF($AL$417=1,IF(ISNUMBER(SEARCH($AK$417,'Hide this - Workings'!D107)),1,0),\"\")","v":""},{"$f":"IF($AL$418=1,IF(ISNUMBER(SEARCH($AK$418,'Hide this - Workings'!D107)),1,0),\"\")","v":""},{"$f":"IF($AL$419=1,IF(ISNUMBER(SEARCH($AK$419,'Hide this - Workings'!D107)),1,0),\"\")","v":""},{"$f":"IF($AL$420=1,IF(ISNUMBER(SEARCH($AK$420,'Hide this - Workings'!D107)),1,0),\"\")","v":""},{"$f":"IF($AL$421=1,IF(ISNUMBER(SEARCH($AK$421,'Hide this - Workings'!D107)),1,0),\"\")","v":""},{"$f":"IF($AL$422=1,IF(ISNUMBER(SEARCH($AK$422,'Hide this - Workings'!D107)),1,0),\"\")","v":""},{"$f":"IF($AL$423=1,IF(ISNUMBER(SEARCH($AK$423,'Hide this - Workings'!D107)),1,0),\"\")","v":""},{"$f":"IF($AL$424=1,IF(ISNUMBER(SEARCH($AK$424,'Hide this - Workings'!D107)),1,0),\"\")","v":""},{"$f":"IF($AL$425=1,IF(ISNUMBER(SEARCH($AK$425,'Hide this - Workings'!D107)),1,0),\"\")","v":""},{"$f":"IF($AL$426=1,IF(ISNUMBER(SEARCH($AK$426,'Hide this - Workings'!D107)),1,0),\"\")","v":""},{"$f":"IF($AL$427=1,IF(ISNUMBER(SEARCH($AK$427,'Hide this - Workings'!D107)),1,0),\"\")","v":""},{"$f":"IF($AL$428=1,IF(ISNUMBER(SEARCH($AK$428,'Hide this - Workings'!D107)),1,0),\"\")","v":""},{"$f":"IF($AL$429=1,IF(ISNUMBER(SEARCH($AK$429,'Hide this - Workings'!D107)),1,0),\"\")","v":""},{"$f":"IF($AL$430=1,IF(ISNUMBER(SEARCH($AK$430,'Hide this - Workings'!D107)),1,0),\"\")","v":""},{"$f":"IF($AL$431=1,IF(ISNUMBER(SEARCH($AK$431,'Hide this - Workings'!D107)),1,0),\"\")","v":""},{"$f":"IF($AL$432=1,IF(ISNUMBER(SEARCH($AK$432,'Hide this - Workings'!D107)),1,0),\"\")","v":""},{"$f":"IF($AL$433=1,IF(ISNUMBER(SEARCH($AK$433,'Hide this - Workings'!D107)),1,0),\"\")","v":""},0,"A103",0,0,0,0]
[null,null,null,null,null,null,null,null,null,null,null,null,null,{"$f":"IF($AL$417=1,IF(ISNUMBER(SEARCH($AK$417,'Hide this - Workings'!D108)),1,0),\"\")","v":""},{"$f":"IF($AL$418=1,IF(ISNUMBER(SEARCH($AK$418,'Hide this - Workings'!D108)),1,0),\"\")","v":""},{"$f":"IF($AL$419=1,IF(ISNUMBER(SEARCH($AK$419,'Hide this - Workings'!D108)),1,0),\"\")","v":""},{"$f":"IF($AL$420=1,IF(ISNUMBER(SEARCH($AK$420,'Hide this - Workings'!D108)),1,0),\"\")","v":""},{"$f":"IF($AL$421=1,IF(ISNUMBER(SEARCH($AK$421,'Hide this - Workings'!D108)),1,0),\"\")","v":""},{"$f":"IF($AL$422=1,IF(ISNUMBER(SEARCH($AK$422,'Hide this - Workings'!D108)),1,0),\"\")","v":""},{"$f":"IF($AL$423=1,IF(ISNUMBER(SEARCH($AK$423,'Hide this - Workings'!D108)),1,0),\"\")","v":""},{"$f":"IF($AL$424=1,IF(ISNUMBER(SEARCH($AK$424,'Hide this - Workings'!D108)),1,0),\"\")","v":""},{"$f":"IF($AL$425=1,IF(ISNUMBER(SEARCH($AK$425,'Hide this - Workings'!D108)),1,0),\"\")","v":""},{"$f":"IF($AL$426=1,IF(ISNUMBER(SEARCH($AK$426,'Hide this - Workings'!D108)),1,0),\"\")","v":""},{"$f":"IF($AL$427=1,IF(ISNUMBER(SEARCH($AK$427,'Hide this - Workings'!D108)),1,0),\"\")","v":""},{"$f":"IF($AL$428=1,IF(ISNUMBER(SEARCH($AK$428,'Hide this - Workings'!D108)),1,0),\"\")","v":""},{"$f":"IF($AL$429=1,IF(ISNUMBER(SEARCH($AK$429,'Hide this - Workings'!D108)),1,0),\"\")","v":""},{"$f":"IF($AL$430=1,IF(ISNUMBER(SEARCH($AK$430,'Hide this - Workings'!D108)),1,0),\"\")","v":""},{"$f":"IF($AL$431=1,IF(ISNUMBER(SEARCH($AK$431,'Hide this - Workings'!D108)),1,0),\"\")","v":""},{"$f":"IF($AL$432=1,IF(ISNUMBER(SEARCH($AK$432,'Hide this - Workings'!D108)),1,0),\"\")","v":""},{"$f":"IF($AL$433=1,IF(ISNUMBER(SEARCH($AK$433,'Hide this - Workings'!D108)),1,0),\"\")","v":""},0,"A104",0,0,0,0]
[null,null,null,null,null,null,null,null,null,null,null,null,null,{"$f":"IF($AL$417=1,IF(ISNUMBER(SEARCH($AK$417,'Hide this - Workings'!D109)),1,0),\"\")","v":""},{"$f":"IF($AL$418=1,IF(ISNUMBER(SEARCH($AK$418,'Hide this - Workings'!D109)),1,0),\"\")","v":""},{"$f":"IF($AL$419=1,IF(ISNUMBER(SEARCH($AK$419,'Hide this - Workings'!D109)),1,0),\"\")","v":""},{"$f":"IF($AL$420=1,IF(ISNUMBER(SEARCH($AK$420,'Hide this - Workings'!D109)),1,0),\"\")","v":""},{"$f":"IF($AL$421=1,IF(ISNUMBER(SEARCH($AK$421,'Hide this - Workings'!D109)),1,0),\"\")","v":""},{"$f":"IF($AL$422=1,IF(ISNUMBER(SEARCH($AK$422,'Hide this - Workings'!D109)),1,0),\"\")","v":""},{"$f":"IF($AL$423=1,IF(ISNUMBER(SEARCH($AK$423,'Hide this - Workings'!D109)),1,0),\"\")","v":""},{"$f":"IF($AL$424=1,IF(ISNUMBER(SEARCH($AK$424,'Hide this - Workings'!D109)),1,0),\"\")","v":""},{"$f":"IF($AL$425=1,IF(ISNUMBER(SEARCH($AK$425,'Hide this - Workings'!D109)),1,0),\"\")","v":""},{"$f":"IF($AL$426=1,IF(ISNUMBER(SEARCH($AK$426,'Hide this - Workings'!D109)),1,0),\"\")","v":""},{"$f":"IF($AL$427=1,IF(ISNUMBER(SEARCH($AK$427,'Hide this - Workings'!D109)),1,0),\"\")","v":""},{"$f":"IF($AL$428=1,IF(ISNUMBER(SEARCH($AK$428,'Hide this - Workings'!D109)),1,0),\"\")","v":""},{"$f":"IF($AL$429=1,IF(ISNUMBER(SEARCH($AK$429,'Hide this - Workings'!D109)),1,0),\"\")","v":""},{"$f":"IF($AL$430=1,IF(ISNUMBER(SEARCH($AK$430,'Hide this - Workings'!D109)),1,0),\"\")","v":""},{"$f":"IF($AL$431=1,IF(ISNUMBER(SEARCH($AK$431,'Hide this - Workings'!D109)),1,0),\"\")","v":""},{"$f":"IF($AL$432=1,IF(ISNUMBER(SEARCH($AK$432,'Hide this - Workings'!D109)),1,0),\"\")","v":""},{"$f":"IF($AL$433=1,IF(ISNUMBER(SEARCH($AK$433,'Hide this - Workings'!D109)),1,0),\"\")","v":""},0,"A105",0,0,0,0]
[null,null,null,null,null,null,null,null,null,null,null,null,null,{"$f":"IF($AL$417=1,IF(ISNUMBER(SEARCH($AK$417,'Hide this - Workings'!D110)),1,0),\"\")","v":""},{"$f":"IF($AL$418=1,IF(ISNUMBER(SEARCH($AK$418,'Hide this - Workings'!D110)),1,0),\"\")","v":""},{"$f":"IF($AL$419=1,IF(ISNUMBER(SEARCH($AK$419,'Hide this - Workings'!D110)),1,0),\"\")","v":""},{"$f":"IF($AL$420=1,IF(ISNUMBER(SEARCH($AK$420,'Hide this - Workings'!D110)),1,0),\"\")","v":""},{"$f":"IF($AL$421=1,IF(ISNUMBER(SEARCH($AK$421,'Hide this - Workings'!D110)),1,0),\"\")","v":""},{"$f":"IF($AL$422=1,IF(ISNUMBER(SEARCH($AK$422,'Hide this - Workings'!D110)),1,0),\"\")","v":""},{"$f":"IF($AL$423=1,IF(ISNUMBER(SEARCH($AK$423,'Hide this - Workings'!D110)),1,0),\"\")","v":""},{"$f":"IF($AL$424=1,IF(ISNUMBER(SEARCH($AK$424,'Hide this - Workings'!D110)),1,0),\"\")","v":""},{"$f":"IF($AL$425=1,IF(ISNUMBER(SEARCH($AK$425,'Hide this - Workings'!D110)),1,0),\"\")","v":""},{"$f":"IF($AL$426=1,IF(ISNUMBER(SEARCH($AK$426,'Hide this - Workings'!D110)),1,0),\"\")","v":""},{"$f":"IF($AL$427=1,IF(ISNUMBER(SEARCH($AK$427,'Hide this - Workings'!D110)),1,0),\"\")","v":""},{"$f":"IF($AL$428=1,IF(ISNUMBER(SEARCH($AK$428,'Hide this - Workings'!D110)),1,0),\"\")","v":""},{"$f":"IF($AL$429=1,IF(ISNUMBER(SEARCH($AK$429,'Hide this - Workings'!D110)),1,0),\"\")","v":""},{"$f":"IF($AL$430=1,IF(ISNUMBER(SEARCH($AK$430,'Hide this - Workings'!D110)),1,0),\"\")","v":""},{"$f":"IF($AL$431=1,IF(ISNUMBER(SEARCH($AK$431,'Hide this - Workings'!D110)),1,0),\"\")","v":""},{"$f":"IF($AL$432=1,IF(ISNUMBER(SEARCH($AK$432,'Hide this - Workings'!D110)),1,0),\"\")","v":""},{"$f":"IF($AL$433=1,IF(ISNUMBER(SEARCH($AK$433,'Hide this - Workings'!D110)),1,0),\"\")","v":""},0,"A106",0,0,0,0]
[null,null,null,null,null,null,null,null,null,null,null,null,null,{"$f":"IF($AL$417=1,IF(ISNUMBER(SEARCH($AK$417,'Hide this - Workings'!D111)),1,0),\"\")","v":""},{"$f":"IF($AL$418=1,IF(ISNUMBER(SEARCH($AK$418,'Hide this - Workings'!D111)),1,0),\"\")","v":""},{"$f":"IF($AL$419=1,IF(ISNUMBER(SEARCH($AK$419,'Hide this - Workings'!D111)),1,0),\"\")","v":""},{"$f":"IF($AL$420=1,IF(ISNUMBER(SEARCH($AK$420,'Hide this - Workings'!D111)),1,0),\"\")","v":""},{"$f":"IF($AL$421=1,IF(ISNUMBER(SEARCH($AK$421,'Hide this - Workings'!D111)),1,0),\"\")","v":""},{"$f":"IF($AL$422=1,IF(ISNUMBER(SEARCH($AK$422,'Hide this - Workings'!D111)),1,0),\"\")","v":""},{"$f":"IF($AL$423=1,IF(ISNUMBER(SEARCH($AK$423,'Hide this - Workings'!D111)),1,0),\"\")","v":""},{"$f":"IF($AL$424=1,IF(ISNUMBER(SEARCH($AK$424,'Hide this - Workings'!D111)),1,0),\"\")","v":""},{"$f":"IF($AL$425=1,IF(ISNUMBER(SEARCH($AK$425,'Hide this - Workings'!D111)),1,0),\"\")","v":""},{"$f":"IF($AL$426=1,IF(ISNUMBER(SEARCH($AK$426,'Hide this - Workings'!D111)),1,0),\"\")","v":""},{"$f":"IF($AL$427=1,IF(ISNUMBER(SEARCH($AK$427,'Hide this - Workings'!D111)),1,0),\"\")","v":""},{"$f":"IF($AL$428=1,IF(ISNUMBER(SEARCH($AK$428,'Hide this - Workings'!D111)),1,0),\"\")","v":""},{"$f":"IF($AL$429=1,IF(ISNUMBER(SEARCH($AK$429,'Hide this - Workings'!D111)),1,0),\"\")","v":""},{"$f":"IF($AL$430=1,IF(ISNUMBER(SEARCH($AK$430,'Hide this - Workings'!D111)),1,0),\"\")","v":""},{"$f":"IF($AL$431=1,IF(ISNUMBER(SEARCH($AK$431,'Hide this - Workings'!D111)),1,0),\"\")","v":""},{"$f":"IF($AL$432=1,IF(ISNUMBER(SEARCH($AK$432,'Hide this - Workings'!D111)),1,0),\"\")","v":""},{"$f":"IF($AL$433=1,IF(ISNUMBER(SEARCH($AK$433,'Hide this - Workings'!D111)),1,0),\"\")","v":""},0,"A107",0,0,0,0]
[null,null,null,null,null,null,null,null,null,null,null,null,null,{"$f":"IF($AL$417=1,IF(ISNUMBER(SEARCH($AK$417,'Hide this - Workings'!D112)),1,0),\"\")","v":""},{"$f":"IF($AL$418=1,IF(ISNUMBER(SEARCH($AK$418,'Hide this - Workings'!D112)),1,0),\"\")","v":""},{"$f":"IF($AL$419=1,IF(ISNUMBER(SEARCH($AK$419,'Hide this - Workings'!D112)),1,0),\"\")","v":""},{"$f":"IF($AL$420=1,IF(ISNUMBER(SEARCH($AK$420,'Hide this - Workings'!D112)),1,0),\"\")","v":""},{"$f":"IF($AL$421=1,IF(ISNUMBER(SEARCH($AK$421,'Hide this - Workings'!D112)),1,0),\"\")","v":""},{"$f":"IF($AL$422=1,IF(ISNUMBER(SEARCH($AK$422,'Hide this - Workings'!D112)),1,0),\"\")","v":""},{"$f":"IF($AL$423=1,IF(ISNUMBER(SEARCH($AK$423,'Hide this - Workings'!D112)),1,0),\"\")","v":""},{"$f":"IF($AL$424=1,IF(ISNUMBER(SEARCH($AK$424,'Hide this - Workings'!D112)),1,0),\"\")","v":""},{"$f":"IF($AL$425=1,IF(ISNUMBER(SEARCH($AK$425,'Hide this - Workings'!D112)),1,0),\"\")","v":""},{"$f":"IF($AL$426=1,IF(ISNUMBER(SEARCH($AK$426,'Hide this - Workings'!D112)),1,0),\"\")","v":""},{"$f":"IF($AL$427=1,IF(ISNUMBER(SEARCH($AK$427,'Hide this - Workings'!D112)),1,0),\"\")","v":""},{"$f":"IF($AL$428=1,IF(ISNUMBER(SEARCH($AK$428,'Hide this - Workings'!D112)),1,0),\"\")","v":""},{"$f":"IF($AL$429=1,IF(ISNUMBER(SEARCH($AK$429,'Hide this - Workings'!D112)),1,0),\"\")","v":""},{"$f":"IF($AL$430=1,IF(ISNUMBER(SEARCH($AK$430,'Hide this - Workings'!D112)),1,0),\"\")","v":""},{"$f":"IF($AL$431=1,IF(ISNUMBER(SEARCH($AK$431,'Hide this - Workings'!D112)),1,0),\"\")","v":""},{"$f":"IF($AL$432=1,IF(ISNUMBER(SEARCH($AK$432,'Hide this - Workings'!D112)),1,0),\"\")","v":""},{"$f":"IF($AL$433=1,IF(ISNUMBER(SEARCH($AK$433,'Hide this - Workings'!D112)),1,0),\"\")","v":""},0,"A108",0,0,0,0]
[null,null,null,null,null,null,null,null,null,null,null,null,null,{"$f":"IF($AL$417=1,IF(ISNUMBER(SEARCH($AK$417,'Hide this - Workings'!D113)),1,0),\"\")","v":""},{"$f":"IF($AL$418=1,IF(ISNUMBER(SEARCH($AK$418,'Hide this - Workings'!D113)),1,0),\"\")","v":""},{"$f":"IF($AL$419=1,IF(ISNUMBER(SEARCH($AK$419,'Hide this - Workings'!D113)),1,0),\"\")","v":""},{"$f":"IF($AL$420=1,IF(ISNUMBER(SEARCH($AK$420,'Hide this - Workings'!D113)),1,0),\"\")","v":""},{"$f":"IF($AL$421=1,IF(ISNUMBER(SEARCH($AK$421,'Hide this - Workings'!D113)),1,0),\"\")","v":""},{"$f":"IF($AL$422=1,IF(ISNUMBER(SEARCH($AK$422,'Hide this - Workings'!D113)),1,0),\"\")","v":""},{"$f":"IF($AL$423=1,IF(ISNUMBER(SEARCH($AK$423,'Hide this - Workings'!D113)),1,0),\"\")","v":""},{"$f":"IF($AL$424=1,IF(ISNUMBER(SEARCH($AK$424,'Hide this - Workings'!D113)),1,0),\"\")","v":""},{"$f":"IF($AL$425=1,IF(ISNUMBER(SEARCH($AK$425,'Hide this - Workings'!D113)),1,0),\"\")","v":""},{"$f":"IF($AL$426=1,IF(ISNUMBER(SEARCH($AK$426,'Hide this - Workings'!D113)),1,0),\"\")","v":""},{"$f":"IF($AL$427=1,IF(ISNUMBER(SEARCH($AK$427,'Hide this - Workings'!D113)),1,0),\"\")","v":""},{"$f":"IF($AL$428=1,IF(ISNUMBER(SEARCH($AK$428,'Hide this - Workings'!D113)),1,0),\"\")","v":""},{"$f":"IF($AL$429=1,IF(ISNUMBER(SEARCH($AK$429,'Hide this - Workings'!D113)),1,0),\"\")","v":""},{"$f":"IF($AL$430=1,IF(ISNUMBER(SEARCH($AK$430,'Hide this - Workings'!D113)),1,0),\"\")","v":""},{"$f":"IF($AL$431=1,IF(ISNUMBER(SEARCH($AK$431,'Hide this - Workings'!D113)),1,0),\"\")","v":""},{"$f":"IF($AL$432=1,IF(ISNUMBER(SEARCH($AK$432,'Hide this - Workings'!D113)),1,0),\"\")","v":""},{"$f":"IF($AL$433=1,IF(ISNUMBER(SEARCH($AK$433,'Hide this - Workings'!D113)),1,0),\"\")","v":""},0,"A109",0,0,0,0]
[null,null,null,null,null,null,null,null,null,null,null,null,null,{"$f":"IF($AL$417=1,IF(ISNUMBER(SEARCH($AK$417,'Hide this - Workings'!D114)),1,0),\"\")","v":""},{"$f":"IF($AL$418=1,IF(ISNUMBER(SEARCH($AK$418,'Hide this - Workings'!D114)),1,0),\"\")","v":""},{"$f":"IF($AL$419=1,IF(ISNUMBER(SEARCH($AK$419,'Hide this - Workings'!D114)),1,0),\"\")","v":""},{"$f":"IF($AL$420=1,IF(ISNUMBER(SEARCH($AK$420,'Hide this - Workings'!D114)),1,0),\"\")","v":""},{"$f":"IF($AL$421=1,IF(ISNUMBER(SEARCH($AK$421,'Hide this - Workings'!D114)),1,0),\"\")","v":""},{"$f":"IF($AL$422=1,IF(ISNUMBER(SEARCH($AK$422,'Hide this - Workings'!D114)),1,0),\"\")","v":""},{"$f":"IF($AL$423=1,IF(ISNUMBER(SEARCH($AK$423,'Hide this - Workings'!D114)),1,0),\"\")","v":""},{"$f":"IF($AL$424=1,IF(ISNUMBER(SEARCH($AK$424,'Hide this - Workings'!D114)),1,0),\"\")","v":""},{"$f":"IF($AL$425=1,IF(ISNUMBER(SEARCH($AK$425,'Hide this - Workings'!D114)),1,0),\"\")","v":""},{"$f":"IF($AL$426=1,IF(ISNUMBER(SEARCH($AK$426,'Hide this - Workings'!D114)),1,0),\"\")","v":""},{"$f":"IF($AL$427=1,IF(ISNUMBER(SEARCH($AK$427,'Hide this - Workings'!D114)),1,0),\"\")","v":""},{"$f":"IF($AL$428=1,IF(ISNUMBER(SEARCH($AK$428,'Hide this - Workings'!D114)),1,0),\"\")","v":""},{"$f":"IF($AL$429=1,IF(ISNUMBER(SEARCH($AK$429,'Hide this - Workings'!D114)),1,0),\"\")","v":""},{"$f":"IF($AL$430=1,IF(ISNUMBER(SEARCH($AK$430,'Hide this - Workings'!D114)),1,0),\"\")","v":""},{"$f":"IF($AL$431=1,IF(ISNUMBER(SEARCH($AK$431,'Hide this - Workings'!D114)),1,0),\"\")","v":""},{"$f":"IF($AL$432=1,IF(ISNUMBER(SEARCH($AK$432,'Hide this - Workings'!D114)),1,0),\"\")","v":""},{"$f":"IF($AL$433=1,IF(ISNUMBER(SEARCH($AK$433,'Hide this - Workings'!D114)),1,0),\"\")","v":""},0,"A110",0,0,0,0]
[null,null,null,null,null,null,null,null,null,null,null,null,null,{"$f":"IF($AL$417=1,IF(ISNUMBER(SEARCH($AK$417,'Hide this - Workings'!D115)),1,0),\"\")","v":""},{"$f":"IF($AL$418=1,IF(ISNUMBER(SEARCH($AK$418,'Hide this - Workings'!D115)),1,0),\"\")","v":""},{"$f":"IF($AL$419=1,IF(ISNUMBER(SEARCH($AK$419,'Hide this - Workings'!D115)),1,0),\"\")","v":""},{"$f":"IF($AL$420=1,IF(ISNUMBER(SEARCH($AK$420,'Hide this - Workings'!D115)),1,0),\"\")","v":""},{"$f":"IF($AL$421=1,IF(ISNUMBER(SEARCH($AK$421,'Hide this - Workings'!D115)),1,0),\"\")","v":""},{"$f":"IF($AL$422=1,IF(ISNUMBER(SEARCH($AK$422,'Hide this - Workings'!D115)),1,0),\"\")","v":""},{"$f":"IF($AL$423=1,IF(ISNUMBER(SEARCH($AK$423,'Hide this - Workings'!D115)),1,0),\"\")","v":""},{"$f":"IF($AL$424=1,IF(ISNUMBER(SEARCH($AK$424,'Hide this - Workings'!D115)),1,0),\"\")","v":""},{"$f":"IF($AL$425=1,IF(ISNUMBER(SEARCH($AK$425,'Hide this - Workings'!D115)),1,0),\"\")","v":""},{"$f":"IF($AL$426=1,IF(ISNUMBER(SEARCH($AK$426,'Hide this - Workings'!D115)),1,0),\"\")","v":""},{"$f":"IF($AL$427=1,IF(ISNUMBER(SEARCH($AK$427,'Hide this - Workings'!D115)),1,0),\"\")","v":""},{"$f":"IF($AL$428=1,IF(ISNUMBER(SEARCH($AK$428,'Hide this - Workings'!D115)),1,0),\"\")","v":""},{"$f":"IF($AL$429=1,IF(ISNUMBER(SEARCH($AK$429,'Hide this - Workings'!D115)),1,0),\"\")","v":""},{"$f":"IF($AL$430=1,IF(ISNUMBER(SEARCH($AK$430,'Hide this - Workings'!D115)),1,0),\"\")","v":""},{"$f":"IF($AL$431=1,IF(ISNUMBER(SEARCH($AK$431,'Hide this - Workings'!D115)),1,0),\"\")","v":""},{"$f":"IF($AL$432=1,IF(ISNUMBER(SEARCH($AK$432,'Hide this - Workings'!D115)),1,0),\"\")","v":""},{"$f":"IF($AL$433=1,IF(ISNUMBER(SEARCH($AK$433,'Hide this - Workings'!D115)),1,0),\"\")","v":""},0,"A111",0,0,0,0]
[null,null,null,null,null,null,null,null,null,null,null,null,null,{"$f":"IF($AL$417=1,IF(ISNUMBER(SEARCH($AK$417,'Hide this - Workings'!D116)),1,0),\"\")","v":""},{"$f":"IF($AL$418=1,IF(ISNUMBER(SEARCH($AK$418,'Hide this - Workings'!D116)),1,0),\"\")","v":""},{"$f":"IF($AL$419=1,IF(ISNUMBER(SEARCH($AK$419,'Hide this - Workings'!D116)),1,0),\"\")","v":""},{"$f":"IF($AL$420=1,IF(ISNUMBER(SEARCH($AK$420,'Hide this - Workings'!D116)),1,0),\"\")","v":""},{"$f":"IF($AL$421=1,IF(ISNUMBER(SEARCH($AK$421,'Hide this - Workings'!D116)),1,0),\"\")","v":""},{"$f":"IF($AL$422=1,IF(ISNUMBER(SEARCH($AK$422,'Hide this - Workings'!D116)),1,0),\"\")","v":""},{"$f":"IF($AL$423=1,IF(ISNUMBER(SEARCH($AK$423,'Hide this - Workings'!D116)),1,0),\"\")","v":""},{"$f":"IF($AL$424=1,IF(ISNUMBER(SEARCH($AK$424,'Hide this - Workings'!D116)),1,0),\"\")","v":""},{"$f":"IF($AL$425=1,IF(ISNUMBER(SEARCH($AK$425,'Hide this - Workings'!D116)),1,0),\"\")","v":""},{"$f":"IF($AL$426=1,IF(ISNUMBER(SEARCH($AK$426,'Hide this - Workings'!D116)),1,0),\"\")","v":""},{"$f":"IF($AL$427=1,IF(ISNUMBER(SEARCH($AK$427,'Hide this - Workings'!D116)),1,0),\"\")","v":""},{"$f":"IF($AL$428=1,IF(ISNUMBER(SEARCH($AK$428,'Hide this - Workings'!D116)),1,0),\"\")","v":""},{"$f":"IF($AL$429=1,IF(ISNUMBER(SEARCH($AK$429,'Hide this - Workings'!D116)),1,0),\"\")","v":""},{"$f":"IF($AL$430=1,IF(ISNUMBER(SEARCH($AK$430,'Hide this - Workings'!D116)),1,0),\"\")","v":""},{"$f":"IF($AL$431=1,IF(ISNUMBER(SEARCH($AK$431,'Hide this - Workings'!D116)),1,0),\"\")","v":""},{"$f":"IF($AL$432=1,IF(ISNUMBER(SEARCH($AK$432,'Hide this - Workings'!D116)),1,0),\"\")","v":""},{"$f":"IF($AL$433=1,IF(ISNUMBER(SEARCH($AK$433,'Hide this - Workings'!D116)),1,0),\"\")","v":""},0,"A112",0,0,0,0]
[null,null,null,null,null,null,null,null,null,null,null,null,null,{"$f":"IF($AL$417=1,IF(ISNUMBER(SEARCH($AK$417,'Hide this - Workings'!D117)),1,0),\"\")","v":""},{"$f":"IF($AL$418=1,IF(ISNUMBER(SEARCH($AK$418,'Hide this - Workings'!D117)),1,0),\"\")","v":""},{"$f":"IF($AL$419=1,IF(ISNUMBER(SEARCH($AK$419,'Hide this - Workings'!D117)),1,0),\"\")","v":""},{"$f":"IF($AL$420=1,IF(ISNUMBER(SEARCH($AK$420,'Hide this - Workings'!D117)),1,0),\"\")","v":""},{"$f":"IF($AL$421=1,IF(ISNUMBER(SEARCH($AK$421,'Hide this - Workings'!D117)),1,0),\"\")","v":""},{"$f":"IF($AL$422=1,IF(ISNUMBER(SEARCH($AK$422,'Hide this - Workings'!D117)),1,0),\"\")","v":""},{"$f":"IF($AL$423=1,IF(ISNUMBER(SEARCH($AK$423,'Hide this - Workings'!D117)),1,0),\"\")","v":""},{"$f":"IF($AL$424=1,IF(ISNUMBER(SEARCH($AK$424,'Hide this - Workings'!D117)),1,0),\"\")","v":""},{"$f":"IF($AL$425=1,IF(ISNUMBER(SEARCH($AK$425,'Hide this - Workings'!D117)),1,0),\"\")","v":""},{"$f":"IF($AL$426=1,IF(ISNUMBER(SEARCH($AK$426,'Hide this - Workings'!D117)),1,0),\"\")","v":""},{"$f":"IF($AL$427=1,IF(ISNUMBER(SEARCH($AK$427,'Hide this - Workings'!D117)),1,0),\"\")","v":""},{"$f":"IF($AL$428=1,IF(ISNUMBER(SEARCH($AK$428,'Hide this - Workings'!D117)),1,0),\"\")","v":""},{"$f":"IF($AL$429=1,IF(ISNUMBER(SEARCH($AK$429,'Hide this - Workings'!D117)),1,0),\"\")","v":""},{"$f":"IF($AL$430=1,IF(ISNUMBER(SEARCH($AK$430,'Hide this - Workings'!D117)),1,0),\"\")","v":""},{"$f":"IF($AL$431=1,IF(ISNUMBER(SEARCH($AK$431,'Hide this - Workings'!D117)),1,0),\"\")","v":""},{"$f":"IF($AL$432=1,IF(ISNUMBER(SEARCH($AK$432,'Hide this - Workings'!D117)),1,0),\"\")","v":""},{"$f":"IF($AL$433=1,IF(ISNUMBER(SEARCH($AK$433,'Hide this - Workings'!D117)),1,0),\"\")","v":""},0,"A113",0,0,0,0]
[null,null,null,null,null,null,null,null,null,null,null,null,null,{"$f":"IF($AL$417=1,IF(ISNUMBER(SEARCH($AK$417,'Hide this - Workings'!D118)),1,0),\"\")","v":""},{"$f":"IF($AL$418=1,IF(ISNUMBER(SEARCH($AK$418,'Hide this - Workings'!D118)),1,0),\"\")","v":""},{"$f":"IF($AL$419=1,IF(ISNUMBER(SEARCH($AK$419,'Hide this - Workings'!D118)),1,0),\"\")","v":""},{"$f":"IF($AL$420=1,IF(ISNUMBER(SEARCH($AK$420,'Hide this - Workings'!D118)),1,0),\"\")","v":""},{"$f":"IF($AL$421=1,IF(ISNUMBER(SEARCH($AK$421,'Hide this - Workings'!D118)),1,0),\"\")","v":""},{"$f":"IF($AL$422=1,IF(ISNUMBER(SEARCH($AK$422,'Hide this - Workings'!D118)),1,0),\"\")","v":""},{"$f":"IF($AL$423=1,IF(ISNUMBER(SEARCH($AK$423,'Hide this - Workings'!D118)),1,0),\"\")","v":""},{"$f":"IF($AL$424=1,IF(ISNUMBER(SEARCH($AK$424,'Hide this - Workings'!D118)),1,0),\"\")","v":""},{"$f":"IF($AL$425=1,IF(ISNUMBER(SEARCH($AK$425,'Hide this - Workings'!D118)),1,0),\"\")","v":""},{"$f":"IF($AL$426=1,IF(ISNUMBER(SEARCH($AK$426,'Hide this - Workings'!D118)),1,0),\"\")","v":""},{"$f":"IF($AL$427=1,IF(ISNUMBER(SEARCH($AK$427,'Hide this - Workings'!D118)),1,0),\"\")","v":""},{"$f":"IF($AL$428=1,IF(ISNUMBER(SEARCH($AK$428,'Hide this - Workings'!D118)),1,0),\"\")","v":""},{"$f":"IF($AL$429=1,IF(ISNUMBER(SEARCH($AK$429,'Hide this - Workings'!D118)),1,0),\"\")","v":""},{"$f":"IF($AL$430=1,IF(ISNUMBER(SEARCH($AK$430,'Hide this - Workings'!D118)),1,0),\"\")","v":""},{"$f":"IF($AL$431=1,IF(ISNUMBER(SEARCH($AK$431,'Hide this - Workings'!D118)),1,0),\"\")","v":""},{"$f":"IF($AL$432=1,IF(ISNUMBER(SEARCH($AK$432,'Hide this - Workings'!D118)),1,0),\"\")","v":""},{"$f":"IF($AL$433=1,IF(ISNUMBER(SEARCH($AK$433,'Hide this - Workings'!D118)),1,0),\"\")","v":""},0,"A114",0,0,0,0]
[null,null,null,null,null,null,null,null,null,null,null,null,null,{"$f":"IF($AL$417=1,IF(ISNUMBER(SEARCH($AK$417,'Hide this - Workings'!D119)),1,0),\"\")","v":""},{"$f":"IF($AL$418=1,IF(ISNUMBER(SEARCH($AK$418,'Hide this - Workings'!D119)),1,0),\"\")","v":""},{"$f":"IF($AL$419=1,IF(ISNUMBER(SEARCH($AK$419,'Hide this - Workings'!D119)),1,0),\"\")","v":""},{"$f":"IF($AL$420=1,IF(ISNUMBER(SEARCH($AK$420,'Hide this - Workings'!D119)),1,0),\"\")","v":""},{"$f":"IF($AL$421=1,IF(ISNUMBER(SEARCH($AK$421,'Hide this - Workings'!D119)),1,0),\"\")","v":""},{"$f":"IF($AL$422=1,IF(ISNUMBER(SEARCH($AK$422,'Hide this - Workings'!D119)),1,0),\"\")","v":""},{"$f":"IF($AL$423=1,IF(ISNUMBER(SEARCH($AK$423,'Hide this - Workings'!D119)),1,0),\"\")","v":""},{"$f":"IF($AL$424=1,IF(ISNUMBER(SEARCH($AK$424,'Hide this - Workings'!D119)),1,0),\"\")","v":""},{"$f":"IF($AL$425=1,IF(ISNUMBER(SEARCH($AK$425,'Hide this - Workings'!D119)),1,0),\"\")","v":""},{"$f":"IF($AL$426=1,IF(ISNUMBER(SEARCH($AK$426,'Hide this - Workings'!D119)),1,0),\"\")","v":""},{"$f":"IF($AL$427=1,IF(ISNUMBER(SEARCH($AK$427,'Hide this - Workings'!D119)),1,0),\"\")","v":""},{"$f":"IF($AL$428=1,IF(ISNUMBER(SEARCH($AK$428,'Hide this - Workings'!D119)),1,0),\"\")","v":""},{"$f":"IF($AL$429=1,IF(ISNUMBER(SEARCH($AK$429,'Hide this - Workings'!D119)),1,0),\"\")","v":""},{"$f":"IF($AL$430=1,IF(ISNUMBER(SEARCH($AK$430,'Hide this - Workings'!D119)),1,0),\"\")","v":""},{"$f":"IF($AL$431=1,IF(ISNUMBER(SEARCH($AK$431,'Hide this - Workings'!D119)),1,0),\"\")","v":""},{"$f":"IF($AL$432=1,IF(ISNUMBER(SEARCH($AK$432,'Hide this - Workings'!D119)),1,0),\"\")","v":""},{"$f":"IF($AL$433=1,IF(ISNUMBER(SEARCH($AK$433,'Hide this - Workings'!D119)),1,0),\"\")","v":""},0,"A115",0,0,0,0]
[null,null,null,null,null,null,null,null,null,null,null,null,null,{"$f":"IF($AL$417=1,IF(ISNUMBER(SEARCH($AK$417,'Hide this - Workings'!D120)),1,0),\"\")","v":""},{"$f":"IF($AL$418=1,IF(ISNUMBER(SEARCH($AK$418,'Hide this - Workings'!D120)),1,0),\"\")","v":""},{"$f":"IF($AL$419=1,IF(ISNUMBER(SEARCH($AK$419,'Hide this - Workings'!D120)),1,0),\"\")","v":""},{"$f":"IF($AL$420=1,IF(ISNUMBER(SEARCH($AK$420,'Hide this - Workings'!D120)),1,0),\"\")","v":""},{"$f":"IF($AL$421=1,IF(ISNUMBER(SEARCH($AK$421,'Hide this - Workings'!D120)),1,0),\"\")","v":""},{"$f":"IF($AL$422=1,IF(ISNUMBER(SEARCH($AK$422,'Hide this - Workings'!D120)),1,0),\"\")","v":""},{"$f":"IF($AL$423=1,IF(ISNUMBER(SEARCH($AK$423,'Hide this - Workings'!D120)),1,0),\"\")","v":""},{"$f":"IF($AL$424=1,IF(ISNUMBER(SEARCH($AK$424,'Hide this - Workings'!D120)),1,0),\"\")","v":""},{"$f":"IF($AL$425=1,IF(ISNUMBER(SEARCH($AK$425,'Hide this - Workings'!D120)),1,0),\"\")","v":""},{"$f":"IF($AL$426=1,IF(ISNUMBER(SEARCH($AK$426,'Hide this - Workings'!D120)),1,0),\"\")","v":""},{"$f":"IF($AL$427=1,IF(ISNUMBER(SEARCH($AK$427,'Hide this - Workings'!D120)),1,0),\"\")","v":""},{"$f":"IF($AL$428=1,IF(ISNUMBER(SEARCH($AK$428,'Hide this - Workings'!D120)),1,0),\"\")","v":""},{"$f":"IF($AL$429=1,IF(ISNUMBER(SEARCH($AK$429,'Hide this - Workings'!D120)),1,0),\"\")","v":""},{"$f":"IF($AL$430=1,IF(ISNUMBER(SEARCH($AK$430,'Hide this - Workings'!D120)),1,0),\"\")","v":""},{"$f":"IF($AL$431=1,IF(ISNUMBER(SEARCH($AK$431,'Hide this - Workings'!D120)),1,0),\"\")","v":""},{"$f":"IF($AL$432=1,IF(ISNUMBER(SEARCH($AK$432,'Hide this - Workings'!D120)),1,0),\"\")","v":""},{"$f":"IF($AL$433=1,IF(ISNUMBER(SEARCH($AK$433,'Hide this - Workings'!D120)),1,0),\"\")","v":""},0,"A116",0,0,0,0]
[null,null,null,null,null,null,null,null,null,null,null,null,null,{"$f":"IF($AL$417=1,IF(ISNUMBER(SEARCH($AK$417,'Hide this - Workings'!D121)),1,0),\"\")","v":""},{"$f":"IF($AL$418=1,IF(ISNUMBER(SEARCH($AK$418,'Hide this - Workings'!D121)),1,0),\"\")","v":""},{"$f":"IF($AL$419=1,IF(ISNUMBER(SEARCH($AK$419,'Hide this - Workings'!D121)),1,0),\"\")","v":""},{"$f":"IF($AL$420=1,IF(ISNUMBER(SEARCH($AK$420,'Hide this - Workings'!D121)),1,0),\"\")","v":""},{"$f":"IF($AL$421=1,IF(ISNUMBER(SEARCH($AK$421,'Hide this - Workings'!D121)),1,0),\"\")","v":""},{"$f":"IF($AL$422=1,IF(ISNUMBER(SEARCH($AK$422,'Hide this - Workings'!D121)),1,0),\"\")","v":""},{"$f":"IF($AL$423=1,IF(ISNUMBER(SEARCH($AK$423,'Hide this - Workings'!D121)),1,0),\"\")","v":""},{"$f":"IF($AL$424=1,IF(ISNUMBER(SEARCH($AK$424,'Hide this - Workings'!D121)),1,0),\"\")","v":""},{"$f":"IF($AL$425=1,IF(ISNUMBER(SEARCH($AK$425,'Hide this - Workings'!D121)),1,0),\"\")","v":""},{"$f":"IF($AL$426=1,IF(ISNUMBER(SEARCH($AK$426,'Hide this - Workings'!D121)),1,0),\"\")","v":""},{"$f":"IF($AL$427=1,IF(ISNUMBER(SEARCH($AK$427,'Hide this - Workings'!D121)),1,0),\"\")","v":""},{"$f":"IF($AL$428=1,IF(ISNUMBER(SEARCH($AK$428,'Hide this - Workings'!D121)),1,0),\"\")","v":""},{"$f":"IF($AL$429=1,IF(ISNUMBER(SEARCH($AK$429,'Hide this - Workings'!D121)),1,0),\"\")","v":""},{"$f":"IF($AL$430=1,IF(ISNUMBER(SEARCH($AK$430,'Hide this - Workings'!D121)),1,0),\"\")","v":""},{"$f":"IF($AL$431=1,IF(ISNUMBER(SEARCH($AK$431,'Hide this - Workings'!D121)),1,0),\"\")","v":""},{"$f":"IF($AL$432=1,IF(ISNUMBER(SEARCH($AK$432,'Hide this - Workings'!D121)),1,0),\"\")","v":""},{"$f":"IF($AL$433=1,IF(ISNUMBER(SEARCH($AK$433,'Hide this - Workings'!D121)),1,0),\"\")","v":""},0,"A117",0,0,0,0]
[null,null,null,null,null,null,null,null,null,null,null,null,null,{"$f":"IF($AL$417=1,IF(ISNUMBER(SEARCH($AK$417,'Hide this - Workings'!D122)),1,0),\"\")","v":""},{"$f":"IF($AL$418=1,IF(ISNUMBER(SEARCH($AK$418,'Hide this - Workings'!D122)),1,0),\"\")","v":""},{"$f":"IF($AL$419=1,IF(ISNUMBER(SEARCH($AK$419,'Hide this - Workings'!D122)),1,0),\"\")","v":""},{"$f":"IF($AL$420=1,IF(ISNUMBER(SEARCH($AK$420,'Hide this - Workings'!D122)),1,0),\"\")","v":""},{"$f":"IF($AL$421=1,IF(ISNUMBER(SEARCH($AK$421,'Hide this - Workings'!D122)),1,0),\"\")","v":""},{"$f":"IF($AL$422=1,IF(ISNUMBER(SEARCH($AK$422,'Hide this - Workings'!D122)),1,0),\"\")","v":""},{"$f":"IF($AL$423=1,IF(ISNUMBER(SEARCH($AK$423,'Hide this - Workings'!D122)),1,0),\"\")","v":""},{"$f":"IF($AL$424=1,IF(ISNUMBER(SEARCH($AK$424,'Hide this - Workings'!D122)),1,0),\"\")","v":""},{"$f":"IF($AL$425=1,IF(ISNUMBER(SEARCH($AK$425,'Hide this - Workings'!D122)),1,0),\"\")","v":""},{"$f":"IF($AL$426=1,IF(ISNUMBER(SEARCH($AK$426,'Hide this - Workings'!D122)),1,0),\"\")","v":""},{"$f":"IF($AL$427=1,IF(ISNUMBER(SEARCH($AK$427,'Hide this - Workings'!D122)),1,0),\"\")","v":""},{"$f":"IF($AL$428=1,IF(ISNUMBER(SEARCH($AK$428,'Hide this - Workings'!D122)),1,0),\"\")","v":""},{"$f":"IF($AL$429=1,IF(ISNUMBER(SEARCH($AK$429,'Hide this - Workings'!D122)),1,0),\"\")","v":""},{"$f":"IF($AL$430=1,IF(ISNUMBER(SEARCH($AK$430,'Hide this - Workings'!D122)),1,0),\"\")","v":""},{"$f":"IF($AL$431=1,IF(ISNUMBER(SEARCH($AK$431,'Hide this - Workings'!D122)),1,0),\"\")","v":""},{"$f":"IF($AL$432=1,IF(ISNUMBER(SEARCH($AK$432,'Hide this - Workings'!D122)),1,0),\"\")","v":""},{"$f":"IF($AL$433=1,IF(ISNUMBER(SEARCH($AK$433,'Hide this - Workings'!D122)),1,0),\"\")","v":""},0,"A118",0,0,0,0]
[null,null,null,null,null,null,null,null,null,null,null,null,null,{"$f":"IF($AL$417=1,IF(ISNUMBER(SEARCH($AK$417,'Hide this - Workings'!D123)),1,0),\"\")","v":""},{"$f":"IF($AL$418=1,IF(ISNUMBER(SEARCH($AK$418,'Hide this - Workings'!D123)),1,0),\"\")","v":""},{"$f":"IF($AL$419=1,IF(ISNUMBER(SEARCH($AK$419,'Hide this - Workings'!D123)),1,0),\"\")","v":""},{"$f":"IF($AL$420=1,IF(ISNUMBER(SEARCH($AK$420,'Hide this - Workings'!D123)),1,0),\"\")","v":""},{"$f":"IF($AL$421=1,IF(ISNUMBER(SEARCH($AK$421,'Hide this - Workings'!D123)),1,0),\"\")","v":""},{"$f":"IF($AL$422=1,IF(ISNUMBER(SEARCH($AK$422,'Hide this - Workings'!D123)),1,0),\"\")","v":""},{"$f":"IF($AL$423=1,IF(ISNUMBER(SEARCH($AK$423,'Hide this - Workings'!D123)),1,0),\"\")","v":""},{"$f":"IF($AL$424=1,IF(ISNUMBER(SEARCH($AK$424,'Hide this - Workings'!D123)),1,0),\"\")","v":""},{"$f":"IF($AL$425=1,IF(ISNUMBER(SEARCH($AK$425,'Hide this - Workings'!D123)),1,0),\"\")","v":""},{"$f":"IF($AL$426=1,IF(ISNUMBER(SEARCH($AK$426,'Hide this - Workings'!D123)),1,0),\"\")","v":""},{"$f":"IF($AL$427=1,IF(ISNUMBER(SEARCH($AK$427,'Hide this - Workings'!D123)),1,0),\"\")","v":""},{"$f":"IF($AL$428=1,IF(ISNUMBER(SEARCH($AK$428,'Hide this - Workings'!D123)),1,0),\"\")","v":""},{"$f":"IF($AL$429=1,IF(ISNUMBER(SEARCH($AK$429,'Hide this - Workings'!D123)),1,0),\"\")","v":""},{"$f":"IF($AL$430=1,IF(ISNUMBER(SEARCH($AK$430,'Hide this - Workings'!D123)),1,0),\"\")","v":""},{"$f":"IF($AL$431=1,IF(ISNUMBER(SEARCH($AK$431,'Hide this - Workings'!D123)),1,0),\"\")","v":""},{"$f":"IF($AL$432=1,IF(ISNUMBER(SEARCH($AK$432,'Hide this - Workings'!D123)),1,0),\"\")","v":""},{"$f":"IF($AL$433=1,IF(ISNUMBER(SEARCH($AK$433,'Hide this - Workings'!D123)),1,0),\"\")","v":""},0,"A119",0,0,0,0]
[null,null,null,null,null,null,null,null,null,null,null,null,null,{"$f":"IF($AL$417=1,IF(ISNUMBER(SEARCH($AK$417,'Hide this - Workings'!D124)),1,0),\"\")","v":""},{"$f":"IF($AL$418=1,IF(ISNUMBER(SEARCH($AK$418,'Hide this - Workings'!D124)),1,0),\"\")","v":""},{"$f":"IF($AL$419=1,IF(ISNUMBER(SEARCH($AK$419,'Hide this - Workings'!D124)),1,0),\"\")","v":""},{"$f":"IF($AL$420=1,IF(ISNUMBER(SEARCH($AK$420,'Hide this - Workings'!D124)),1,0),\"\")","v":""},{"$f":"IF($AL$421=1,IF(ISNUMBER(SEARCH($AK$421,'Hide this - Workings'!D124)),1,0),\"\")","v":""},{"$f":"IF($AL$422=1,IF(ISNUMBER(SEARCH($AK$422,'Hide this - Workings'!D124)),1,0),\"\")","v":""},{"$f":"IF($AL$423=1,IF(ISNUMBER(SEARCH($AK$423,'Hide this - Workings'!D124)),1,0),\"\")","v":""},{"$f":"IF($AL$424=1,IF(ISNUMBER(SEARCH($AK$424,'Hide this - Workings'!D124)),1,0),\"\")","v":""},{"$f":"IF($AL$425=1,IF(ISNUMBER(SEARCH($AK$425,'Hide this - Workings'!D124)),1,0),\"\")","v":""},{"$f":"IF($AL$426=1,IF(ISNUMBER(SEARCH($AK$426,'Hide this - Workings'!D124)),1,0),\"\")","v":""},{"$f":"IF($AL$427=1,IF(ISNUMBER(SEARCH($AK$427,'Hide this - Workings'!D124)),1,0),\"\")","v":""},{"$f":"IF($AL$428=1,IF(ISNUMBER(SEARCH($AK$428,'Hide this - Workings'!D124)),1,0),\"\")","v":""},{"$f":"IF($AL$429=1,IF(ISNUMBER(SEARCH($AK$429,'Hide this - Workings'!D124)),1,0),\"\")","v":""},{"$f":"IF($AL$430=1,IF(ISNUMBER(SEARCH($AK$430,'Hide this - Workings'!D124)),1,0),\"\")","v":""},{"$f":"IF($AL$431=1,IF(ISNUMBER(SEARCH($AK$431,'Hide this - Workings'!D124)),1,0),\"\")","v":""},{"$f":"IF($AL$432=1,IF(ISNUMBER(SEARCH($AK$432,'Hide this - Workings'!D124)),1,0),\"\")","v":""},{"$f":"IF($AL$433=1,IF(ISNUMBER(SEARCH($AK$433,'Hide this - Workings'!D124)),1,0),\"\")","v":""},0,"A120",0,0,0,0]
[null,null,null,null,null,null,null,null,null,null,null,null,null,{"$f":"IF($AL$417=1,IF(ISNUMBER(SEARCH($AK$417,'Hide this - Workings'!D125)),1,0),\"\")","v":""},{"$f":"IF($AL$418=1,IF(ISNUMBER(SEARCH($AK$418,'Hide this - Workings'!D125)),1,0),\"\")","v":""},{"$f":"IF($AL$419=1,IF(ISNUMBER(SEARCH($AK$419,'Hide this - Workings'!D125)),1,0),\"\")","v":""},{"$f":"IF($AL$420=1,IF(ISNUMBER(SEARCH($AK$420,'Hide this - Workings'!D125)),1,0),\"\")","v":""},{"$f":"IF($AL$421=1,IF(ISNUMBER(SEARCH($AK$421,'Hide this - Workings'!D125)),1,0),\"\")","v":""},{"$f":"IF($AL$422=1,IF(ISNUMBER(SEARCH($AK$422,'Hide this - Workings'!D125)),1,0),\"\")","v":""},{"$f":"IF($AL$423=1,IF(ISNUMBER(SEARCH($AK$423,'Hide this - Workings'!D125)),1,0),\"\")","v":""},{"$f":"IF($AL$424=1,IF(ISNUMBER(SEARCH($AK$424,'Hide this - Workings'!D125)),1,0),\"\")","v":""},{"$f":"IF($AL$425=1,IF(ISNUMBER(SEARCH($AK$425,'Hide this - Workings'!D125)),1,0),\"\")","v":""},{"$f":"IF($AL$426=1,IF(ISNUMBER(SEARCH($AK$426,'Hide this - Workings'!D125)),1,0),\"\")","v":""},{"$f":"IF($AL$427=1,IF(ISNUMBER(SEARCH($AK$427,'Hide this - Workings'!D125)),1,0),\"\")","v":""},{"$f":"IF($AL$428=1,IF(ISNUMBER(SEARCH($AK$428,'Hide this - Workings'!D125)),1,0),\"\")","v":""},{"$f":"IF($AL$429=1,IF(ISNUMBER(SEARCH($AK$429,'Hide this - Workings'!D125)),1,0),\"\")","v":""},{"$f":"IF($AL$430=1,IF(ISNUMBER(SEARCH($AK$430,'Hide this - Workings'!D125)),1,0),\"\")","v":""},{"$f":"IF($AL$431=1,IF(ISNUMBER(SEARCH($AK$431,'Hide this - Workings'!D125)),1,0),\"\")","v":""},{"$f":"IF($AL$432=1,IF(ISNUMBER(SEARCH($AK$432,'Hide this - Workings'!D125)),1,0),\"\")","v":""},{"$f":"IF($AL$433=1,IF(ISNUMBER(SEARCH($AK$433,'Hide this - Workings'!D125)),1,0),\"\")","v":""},0,"A121",0,0,0,0]
[null,null,null,null,null,null,null,null,null,null,null,null,null,{"$f":"IF($AL$417=1,IF(ISNUMBER(SEARCH($AK$417,'Hide this - Workings'!D126)),1,0),\"\")","v":""},{"$f":"IF($AL$418=1,IF(ISNUMBER(SEARCH($AK$418,'Hide this - Workings'!D126)),1,0),\"\")","v":""},{"$f":"IF($AL$419=1,IF(ISNUMBER(SEARCH($AK$419,'Hide this - Workings'!D126)),1,0),\"\")","v":""},{"$f":"IF($AL$420=1,IF(ISNUMBER(SEARCH($AK$420,'Hide this - Workings'!D126)),1,0),\"\")","v":""},{"$f":"IF($AL$421=1,IF(ISNUMBER(SEARCH($AK$421,'Hide this - Workings'!D126)),1,0),\"\")","v":""},{"$f":"IF($AL$422=1,IF(ISNUMBER(SEARCH($AK$422,'Hide this - Workings'!D126)),1,0),\"\")","v":""},{"$f":"IF($AL$423=1,IF(ISNUMBER(SEARCH($AK$423,'Hide this - Workings'!D126)),1,0),\"\")","v":""},{"$f":"IF($AL$424=1,IF(ISNUMBER(SEARCH($AK$424,'Hide this - Workings'!D126)),1,0),\"\")","v":""},{"$f":"IF($AL$425=1,IF(ISNUMBER(SEARCH($AK$425,'Hide this - Workings'!D126)),1,0),\"\")","v":""},{"$f":"IF($AL$426=1,IF(ISNUMBER(SEARCH($AK$426,'Hide this - Workings'!D126)),1,0),\"\")","v":""},{"$f":"IF($AL$427=1,IF(ISNUMBER(SEARCH($AK$427,'Hide this - Workings'!D126)),1,0),\"\")","v":""},{"$f":"IF($AL$428=1,IF(ISNUMBER(SEARCH($AK$428,'Hide this - Workings'!D126)),1,0),\"\")","v":""},{"$f":"IF($AL$429=1,IF(ISNUMBER(SEARCH($AK$429,'Hide this - Workings'!D126)),1,0),\"\")","v":""},{"$f":"IF($AL$430=1,IF(ISNUMBER(SEARCH($AK$430,'Hide this - Workings'!D126)),1,0),\"\")","v":""},{"$f":"IF($AL$431=1,IF(ISNUMBER(SEARCH($AK$431,'Hide this - Workings'!D126)),1,0),\"\")","v":""},{"$f":"IF($AL$432=1,IF(ISNUMBER(SEARCH($AK$432,'Hide this - Workings'!D126)),1,0),\"\")","v":""},{"$f":"IF($AL$433=1,IF(ISNUMBER(SEARCH($AK$433,'Hide this - Workings'!D126)),1,0),\"\")","v":""},0,"A122",0,0,0,0]
[null,null,null,null,null,null,null,null,null,null,null,null,null,{"$f":"IF($AL$417=1,IF(ISNUMBER(SEARCH($AK$417,'Hide this - Workings'!D127)),1,0),\"\")","v":""},{"$f":"IF($AL$418=1,IF(ISNUMBER(SEARCH($AK$418,'Hide this - Workings'!D127)),1,0),\"\")","v":""},{"$f":"IF($AL$419=1,IF(ISNUMBER(SEARCH($AK$419,'Hide this - Workings'!D127)),1,0),\"\")","v":""},{"$f":"IF($AL$420=1,IF(ISNUMBER(SEARCH($AK$420,'Hide this - Workings'!D127)),1,0),\"\")","v":""},{"$f":"IF($AL$421=1,IF(ISNUMBER(SEARCH($AK$421,'Hide this - Workings'!D127)),1,0),\"\")","v":""},{"$f":"IF($AL$422=1,IF(ISNUMBER(SEARCH($AK$422,'Hide this - Workings'!D127)),1,0),\"\")","v":""},{"$f":"IF($AL$423=1,IF(ISNUMBER(SEARCH($AK$423,'Hide this - Workings'!D127)),1,0),\"\")","v":""},{"$f":"IF($AL$424=1,IF(ISNUMBER(SEARCH($AK$424,'Hide this - Workings'!D127)),1,0),\"\")","v":""},{"$f":"IF($AL$425=1,IF(ISNUMBER(SEARCH($AK$425,'Hide this - Workings'!D127)),1,0),\"\")","v":""},{"$f":"IF($AL$426=1,IF(ISNUMBER(SEARCH($AK$426,'Hide this - Workings'!D127)),1,0),\"\")","v":""},{"$f":"IF($AL$427=1,IF(ISNUMBER(SEARCH($AK$427,'Hide this - Workings'!D127)),1,0),\"\")","v":""},{"$f":"IF($AL$428=1,IF(ISNUMBER(SEARCH($AK$428,'Hide this - Workings'!D127)),1,0),\"\")","v":""},{"$f":"IF($AL$429=1,IF(ISNUMBER(SEARCH($AK$429,'Hide this - Workings'!D127)),1,0),\"\")","v":""},{"$f":"IF($AL$430=1,IF(ISNUMBER(SEARCH($AK$430,'Hide this - Workings'!D127)),1,0),\"\")","v":""},{"$f":"IF($AL$431=1,IF(ISNUMBER(SEARCH($AK$431,'Hide this - Workings'!D127)),1,0),\"\")","v":""},{"$f":"IF($AL$432=1,IF(ISNUMBER(SEARCH($AK$432,'Hide this - Workings'!D127)),1,0),\"\")","v":""},{"$f":"IF($AL$433=1,IF(ISNUMBER(SEARCH($AK$433,'Hide this - Workings'!D127)),1,0),\"\")","v":""},0,"A123",0,0,0,0]
[null,null,null,null,null,null,null,null,null,null,null,null,null,{"$f":"IF($AL$417=1,IF(ISNUMBER(SEARCH($AK$417,'Hide this - Workings'!D128)),1,0),\"\")","v":""},{"$f":"IF($AL$418=1,IF(ISNUMBER(SEARCH($AK$418,'Hide this - Workings'!D128)),1,0),\"\")","v":""},{"$f":"IF($AL$419=1,IF(ISNUMBER(SEARCH($AK$419,'Hide this - Workings'!D128)),1,0),\"\")","v":""},{"$f":"IF($AL$420=1,IF(ISNUMBER(SEARCH($AK$420,'Hide this - Workings'!D128)),1,0),\"\")","v":""},{"$f":"IF($AL$421=1,IF(ISNUMBER(SEARCH($AK$421,'Hide this - Workings'!D128)),1,0),\"\")","v":""},{"$f":"IF($AL$422=1,IF(ISNUMBER(SEARCH($AK$422,'Hide this - Workings'!D128)),1,0),\"\")","v":""},{"$f":"IF($AL$423=1,IF(ISNUMBER(SEARCH($AK$423,'Hide this - Workings'!D128)),1,0),\"\")","v":""},{"$f":"IF($AL$424=1,IF(ISNUMBER(SEARCH($AK$424,'Hide this - Workings'!D128)),1,0),\"\")","v":""},{"$f":"IF($AL$425=1,IF(ISNUMBER(SEARCH($AK$425,'Hide this - Workings'!D128)),1,0),\"\")","v":""},{"$f":"IF($AL$426=1,IF(ISNUMBER(SEARCH($AK$426,'Hide this - Workings'!D128)),1,0),\"\")","v":""},{"$f":"IF($AL$427=1,IF(ISNUMBER(SEARCH($AK$427,'Hide this - Workings'!D128)),1,0),\"\")","v":""},{"$f":"IF($AL$428=1,IF(ISNUMBER(SEARCH($AK$428,'Hide this - Workings'!D128)),1,0),\"\")","v":""},{"$f":"IF($AL$429=1,IF(ISNUMBER(SEARCH($AK$429,'Hide this - Workings'!D128)),1,0),\"\")","v":""},{"$f":"IF($AL$430=1,IF(ISNUMBER(SEARCH($AK$430,'Hide this - Workings'!D128)),1,0),\"\")","v":""},{"$f":"IF($AL$431=1,IF(ISNUMBER(SEARCH($AK$431,'Hide this - Workings'!D128)),1,0),\"\")","v":""},{"$f":"IF($AL$432=1,IF(ISNUMBER(SEARCH($AK$432,'Hide this - Workings'!D128)),1,0),\"\")","v":""},{"$f":"IF($AL$433=1,IF(ISNUMBER(SEARCH($AK$433,'Hide this - Workings'!D128)),1,0),\"\")","v":""},0,"A124",0,0,0,0]
[null,null,null,null,null,null,null,null,null,null,null,null,null,{"$f":"IF($AL$417=1,IF(ISNUMBER(SEARCH($AK$417,'Hide this - Workings'!D129)),1,0),\"\")","v":""},{"$f":"IF($AL$418=1,IF(ISNUMBER(SEARCH($AK$418,'Hide this - Workings'!D129)),1,0),\"\")","v":""},{"$f":"IF($AL$419=1,IF(ISNUMBER(SEARCH($AK$419,'Hide this - Workings'!D129)),1,0),\"\")","v":""},{"$f":"IF($AL$420=1,IF(ISNUMBER(SEARCH($AK$420,'Hide this - Workings'!D129)),1,0),\"\")","v":""},{"$f":"IF($AL$421=1,IF(ISNUMBER(SEARCH($AK$421,'Hide this - Workings'!D129)),1,0),\"\")","v":""},{"$f":"IF($AL$422=1,IF(ISNUMBER(SEARCH($AK$422,'Hide this - Workings'!D129)),1,0),\"\")","v":""},{"$f":"IF($AL$423=1,IF(ISNUMBER(SEARCH($AK$423,'Hide this - Workings'!D129)),1,0),\"\")","v":""},{"$f":"IF($AL$424=1,IF(ISNUMBER(SEARCH($AK$424,'Hide this - Workings'!D129)),1,0),\"\")","v":""},{"$f":"IF($AL$425=1,IF(ISNUMBER(SEARCH($AK$425,'Hide this - Workings'!D129)),1,0),\"\")","v":""},{"$f":"IF($AL$426=1,IF(ISNUMBER(SEARCH($AK$426,'Hide this - Workings'!D129)),1,0),\"\")","v":""},{"$f":"IF($AL$427=1,IF(ISNUMBER(SEARCH($AK$427,'Hide this - Workings'!D129)),1,0),\"\")","v":""},{"$f":"IF($AL$428=1,IF(ISNUMBER(SEARCH($AK$428,'Hide this - Workings'!D129)),1,0),\"\")","v":""},{"$f":"IF($AL$429=1,IF(ISNUMBER(SEARCH($AK$429,'Hide this - Workings'!D129)),1,0),\"\")","v":""},{"$f":"IF($AL$430=1,IF(ISNUMBER(SEARCH($AK$430,'Hide this - Workings'!D129)),1,0),\"\")","v":""},{"$f":"IF($AL$431=1,IF(ISNUMBER(SEARCH($AK$431,'Hide this - Workings'!D129)),1,0),\"\")","v":""},{"$f":"IF($AL$432=1,IF(ISNUMBER(SEARCH($AK$432,'Hide this - Workings'!D129)),1,0),\"\")","v":""},{"$f":"IF($AL$433=1,IF(ISNUMBER(SEARCH($AK$433,'Hide this - Workings'!D129)),1,0),\"\")","v":""},0,"A125",0,0,0,0]
[null,null,null,null,null,null,null,null,null,null,null,null,null,{"$f":"IF($AL$417=1,IF(ISNUMBER(SEARCH($AK$417,'Hide this - Workings'!D130)),1,0),\"\")","v":""},{"$f":"IF($AL$418=1,IF(ISNUMBER(SEARCH($AK$418,'Hide this - Workings'!D130)),1,0),\"\")","v":""},{"$f":"IF($AL$419=1,IF(ISNUMBER(SEARCH($AK$419,'Hide this - Workings'!D130)),1,0),\"\")","v":""},{"$f":"IF($AL$420=1,IF(ISNUMBER(SEARCH($AK$420,'Hide this - Workings'!D130)),1,0),\"\")","v":""},{"$f":"IF($AL$421=1,IF(ISNUMBER(SEARCH($AK$421,'Hide this - Workings'!D130)),1,0),\"\")","v":""},{"$f":"IF($AL$422=1,IF(ISNUMBER(SEARCH($AK$422,'Hide this - Workings'!D130)),1,0),\"\")","v":""},{"$f":"IF($AL$423=1,IF(ISNUMBER(SEARCH($AK$423,'Hide this - Workings'!D130)),1,0),\"\")","v":""},{"$f":"IF($AL$424=1,IF(ISNUMBER(SEARCH($AK$424,'Hide this - Workings'!D130)),1,0),\"\")","v":""},{"$f":"IF($AL$425=1,IF(ISNUMBER(SEARCH($AK$425,'Hide this - Workings'!D130)),1,0),\"\")","v":""},{"$f":"IF($AL$426=1,IF(ISNUMBER(SEARCH($AK$426,'Hide this - Workings'!D130)),1,0),\"\")","v":""},{"$f":"IF($AL$427=1,IF(ISNUMBER(SEARCH($AK$427,'Hide this - Workings'!D130)),1,0),\"\")","v":""},{"$f":"IF($AL$428=1,IF(ISNUMBER(SEARCH($AK$428,'Hide this - Workings'!D130)),1,0),\"\")","v":""},{"$f":"IF($AL$429=1,IF(ISNUMBER(SEARCH($AK$429,'Hide this - Workings'!D130)),1,0),\"\")","v":""},{"$f":"IF($AL$430=1,IF(ISNUMBER(SEARCH($AK$430,'Hide this - Workings'!D130)),1,0),\"\")","v":""},{"$f":"IF($AL$431=1,IF(ISNUMBER(SEARCH($AK$431,'Hide this - Workings'!D130)),1,0),\"\")","v":""},{"$f":"IF($AL$432=1,IF(ISNUMBER(SEARCH($AK$432,'Hide this - Workings'!D130)),1,0),\"\")","v":""},{"$f":"IF($AL$433=1,IF(ISNUMBER(SEARCH($AK$433,'Hide this - Workings'!D130)),1,0),\"\")","v":""},0,"A126",0,0,0,0]
[null,null,null,null,null,null,null,null,null,null,null,null,null,{"$f":"IF($AL$417=1,IF(ISNUMBER(SEARCH($AK$417,'Hide this - Workings'!D131)),1,0),\"\")","v":""},{"$f":"IF($AL$418=1,IF(ISNUMBER(SEARCH($AK$418,'Hide this - Workings'!D131)),1,0),\"\")","v":""},{"$f":"IF($AL$419=1,IF(ISNUMBER(SEARCH($AK$419,'Hide this - Workings'!D131)),1,0),\"\")","v":""},{"$f":"IF($AL$420=1,IF(ISNUMBER(SEARCH($AK$420,'Hide this - Workings'!D131)),1,0),\"\")","v":""},{"$f":"IF($AL$421=1,IF(ISNUMBER(SEARCH($AK$421,'Hide this - Workings'!D131)),1,0),\"\")","v":""},{"$f":"IF($AL$422=1,IF(ISNUMBER(SEARCH($AK$422,'Hide this - Workings'!D131)),1,0),\"\")","v":""},{"$f":"IF($AL$423=1,IF(ISNUMBER(SEARCH($AK$423,'Hide this - Workings'!D131)),1,0),\"\")","v":""},{"$f":"IF($AL$424=1,IF(ISNUMBER(SEARCH($AK$424,'Hide this - Workings'!D131)),1,0),\"\")","v":""},{"$f":"IF($AL$425=1,IF(ISNUMBER(SEARCH($AK$425,'Hide this - Workings'!D131)),1,0),\"\")","v":""},{"$f":"IF($AL$426=1,IF(ISNUMBER(SEARCH($AK$426,'Hide this - Workings'!D131)),1,0),\"\")","v":""},{"$f":"IF($AL$427=1,IF(ISNUMBER(SEARCH($AK$427,'Hide this - Workings'!D131)),1,0),\"\")","v":""},{"$f":"IF($AL$428=1,IF(ISNUMBER(SEARCH($AK$428,'Hide this - Workings'!D131)),1,0),\"\")","v":""},{"$f":"IF($AL$429=1,IF(ISNUMBER(SEARCH($AK$429,'Hide this - Workings'!D131)),1,0),\"\")","v":""},{"$f":"IF($AL$430=1,IF(ISNUMBER(SEARCH($AK$430,'Hide this - Workings'!D131)),1,0),\"\")","v":""},{"$f":"IF($AL$431=1,IF(ISNUMBER(SEARCH($AK$431,'Hide this - Workings'!D131)),1,0),\"\")","v":""},{"$f":"IF($AL$432=1,IF(ISNUMBER(SEARCH($AK$432,'Hide this - Workings'!D131)),1,0),\"\")","v":""},{"$f":"IF($AL$433=1,IF(ISNUMBER(SEARCH($AK$433,'Hide this - Workings'!D131)),1,0),\"\")","v":""},0,"A127",0,0,0,0]
[null,null,null,null,null,null,null,null,null,null,null,null,null,{"$f":"IF($AL$417=1,IF(ISNUMBER(SEARCH($AK$417,'Hide this - Workings'!D132)),1,0),\"\")","v":""},{"$f":"IF($AL$418=1,IF(ISNUMBER(SEARCH($AK$418,'Hide this - Workings'!D132)),1,0),\"\")","v":""},{"$f":"IF($AL$419=1,IF(ISNUMBER(SEARCH($AK$419,'Hide this - Workings'!D132)),1,0),\"\")","v":""},{"$f":"IF($AL$420=1,IF(ISNUMBER(SEARCH($AK$420,'Hide this - Workings'!D132)),1,0),\"\")","v":""},{"$f":"IF($AL$421=1,IF(ISNUMBER(SEARCH($AK$421,'Hide this - Workings'!D132)),1,0),\"\")","v":""},{"$f":"IF($AL$422=1,IF(ISNUMBER(SEARCH($AK$422,'Hide this - Workings'!D132)),1,0),\"\")","v":""},{"$f":"IF($AL$423=1,IF(ISNUMBER(SEARCH($AK$423,'Hide this - Workings'!D132)),1,0),\"\")","v":""},{"$f":"IF($AL$424=1,IF(ISNUMBER(SEARCH($AK$424,'Hide this - Workings'!D132)),1,0),\"\")","v":""},{"$f":"IF($AL$425=1,IF(ISNUMBER(SEARCH($AK$425,'Hide this - Workings'!D132)),1,0),\"\")","v":""},{"$f":"IF($AL$426=1,IF(ISNUMBER(SEARCH($AK$426,'Hide this - Workings'!D132)),1,0),\"\")","v":""},{"$f":"IF($AL$427=1,IF(ISNUMBER(SEARCH($AK$427,'Hide this - Workings'!D132)),1,0),\"\")","v":""},{"$f":"IF($AL$428=1,IF(ISNUMBER(SEARCH($AK$428,'Hide this - Workings'!D132)),1,0),\"\")","v":""},{"$f":"IF($AL$429=1,IF(ISNUMBER(SEARCH($AK$429,'Hide this - Workings'!D132)),1,0),\"\")","v":""},{"$f":"IF($AL$430=1,IF(ISNUMBER(SEARCH($AK$430,'Hide this - Workings'!D132)),1,0),\"\")","v":""},{"$f":"IF($AL$431=1,IF(ISNUMBER(SEARCH($AK$431,'Hide this - Workings'!D132)),1,0),\"\")","v":""},{"$f":"IF($AL$432=1,IF(ISNUMBER(SEARCH($AK$432,'Hide this - Workings'!D132)),1,0),\"\")","v":""},{"$f":"IF($AL$433=1,IF(ISNUMBER(SEARCH($AK$433,'Hide this - Workings'!D132)),1,0),\"\")","v":""},0,"A128",0,0,0,0]
[null,null,null,null,null,null,null,null,null,null,null,null,null,{"$f":"IF($AL$417=1,IF(ISNUMBER(SEARCH($AK$417,'Hide this - Workings'!D133)),1,0),\"\")","v":""},{"$f":"IF($AL$418=1,IF(ISNUMBER(SEARCH($AK$418,'Hide this - Workings'!D133)),1,0),\"\")","v":""},{"$f":"IF($AL$419=1,IF(ISNUMBER(SEARCH($AK$419,'Hide this - Workings'!D133)),1,0),\"\")","v":""},{"$f":"IF($AL$420=1,IF(ISNUMBER(SEARCH($AK$420,'Hide this - Workings'!D133)),1,0),\"\")","v":""},{"$f":"IF($AL$421=1,IF(ISNUMBER(SEARCH($AK$421,'Hide this - Workings'!D133)),1,0),\"\")","v":""},{"$f":"IF($AL$422=1,IF(ISNUMBER(SEARCH($AK$422,'Hide this - Workings'!D133)),1,0),\"\")","v":""},{"$f":"IF($AL$423=1,IF(ISNUMBER(SEARCH($AK$423,'Hide this - Workings'!D133)),1,0),\"\")","v":""},{"$f":"IF($AL$424=1,IF(ISNUMBER(SEARCH($AK$424,'Hide this - Workings'!D133)),1,0),\"\")","v":""},{"$f":"IF($AL$425=1,IF(ISNUMBER(SEARCH($AK$425,'Hide this - Workings'!D133)),1,0),\"\")","v":""},{"$f":"IF($AL$426=1,IF(ISNUMBER(SEARCH($AK$426,'Hide this - Workings'!D133)),1,0),\"\")","v":""},{"$f":"IF($AL$427=1,IF(ISNUMBER(SEARCH($AK$427,'Hide this - Workings'!D133)),1,0),\"\")","v":""},{"$f":"IF($AL$428=1,IF(ISNUMBER(SEARCH($AK$428,'Hide this - Workings'!D133)),1,0),\"\")","v":""},{"$f":"IF($AL$429=1,IF(ISNUMBER(SEARCH($AK$429,'Hide this - Workings'!D133)),1,0),\"\")","v":""},{"$f":"IF($AL$430=1,IF(ISNUMBER(SEARCH($AK$430,'Hide this - Workings'!D133)),1,0),\"\")","v":""},{"$f":"IF($AL$431=1,IF(ISNUMBER(SEARCH($AK$431,'Hide this - Workings'!D133)),1,0),\"\")","v":""},{"$f":"IF($AL$432=1,IF(ISNUMBER(SEARCH($AK$432,'Hide this - Workings'!D133)),1,0),\"\")","v":""},{"$f":"IF($AL$433=1,IF(ISNUMBER(SEARCH($AK$433,'Hide this - Workings'!D133)),1,0),\"\")","v":""},0,"A129",0,0,0,0]
[null,null,null,null,null,null,null,null,null,null,null,null,null,{"$f":"IF($AL$417=1,IF(ISNUMBER(SEARCH($AK$417,'Hide this - Workings'!D134)),1,0),\"\")","v":""},{"$f":"IF($AL$418=1,IF(ISNUMBER(SEARCH($AK$418,'Hide this - Workings'!D134)),1,0),\"\")","v":""},{"$f":"IF($AL$419=1,IF(ISNUMBER(SEARCH($AK$419,'Hide this - Workings'!D134)),1,0),\"\")","v":""},{"$f":"IF($AL$420=1,IF(ISNUMBER(SEARCH($AK$420,'Hide this - Workings'!D134)),1,0),\"\")","v":""},{"$f":"IF($AL$421=1,IF(ISNUMBER(SEARCH($AK$421,'Hide this - Workings'!D134)),1,0),\"\")","v":""},{"$f":"IF($AL$422=1,IF(ISNUMBER(SEARCH($AK$422,'Hide this - Workings'!D134)),1,0),\"\")","v":""},{"$f":"IF($AL$423=1,IF(ISNUMBER(SEARCH($AK$423,'Hide this - Workings'!D134)),1,0),\"\")","v":""},{"$f":"IF($AL$424=1,IF(ISNUMBER(SEARCH($AK$424,'Hide this - Workings'!D134)),1,0),\"\")","v":""},{"$f":"IF($AL$425=1,IF(ISNUMBER(SEARCH($AK$425,'Hide this - Workings'!D134)),1,0),\"\")","v":""},{"$f":"IF($AL$426=1,IF(ISNUMBER(SEARCH($AK$426,'Hide this - Workings'!D134)),1,0),\"\")","v":""},{"$f":"IF($AL$427=1,IF(ISNUMBER(SEARCH($AK$427,'Hide this - Workings'!D134)),1,0),\"\")","v":""},{"$f":"IF($AL$428=1,IF(ISNUMBER(SEARCH($AK$428,'Hide this - Workings'!D134)),1,0),\"\")","v":""},{"$f":"IF($AL$429=1,IF(ISNUMBER(SEARCH($AK$429,'Hide this - Workings'!D134)),1,0),\"\")","v":""},{"$f":"IF($AL$430=1,IF(ISNUMBER(SEARCH($AK$430,'Hide this - Workings'!D134)),1,0),\"\")","v":""},{"$f":"IF($AL$431=1,IF(ISNUMBER(SEARCH($AK$431,'Hide this - Workings'!D134)),1,0),\"\")","v":""},{"$f":"IF($AL$432=1,IF(ISNUMBER(SEARCH($AK$432,'Hide this - Workings'!D134)),1,0),\"\")","v":""},{"$f":"IF($AL$433=1,IF(ISNUMBER(SEARCH($AK$433,'Hide this - Workings'!D134)),1,0),\"\")","v":""},0,"A130",0,0,0,0]
[null,null,null,null,null,null,null,null,null,null,null,null,null,{"$f":"IF($AL$417=1,IF(ISNUMBER(SEARCH($AK$417,'Hide this - Workings'!D135)),1,0),\"\")","v":""},{"$f":"IF($AL$418=1,IF(ISNUMBER(SEARCH($AK$418,'Hide this - Workings'!D135)),1,0),\"\")","v":""},{"$f":"IF($AL$419=1,IF(ISNUMBER(SEARCH($AK$419,'Hide this - Workings'!D135)),1,0),\"\")","v":""},{"$f":"IF($AL$420=1,IF(ISNUMBER(SEARCH($AK$420,'Hide this - Workings'!D135)),1,0),\"\")","v":""},{"$f":"IF($AL$421=1,IF(ISNUMBER(SEARCH($AK$421,'Hide this - Workings'!D135)),1,0),\"\")","v":""},{"$f":"IF($AL$422=1,IF(ISNUMBER(SEARCH($AK$422,'Hide this - Workings'!D135)),1,0),\"\")","v":""},{"$f":"IF($AL$423=1,IF(ISNUMBER(SEARCH($AK$423,'Hide this - Workings'!D135)),1,0),\"\")","v":""},{"$f":"IF($AL$424=1,IF(ISNUMBER(SEARCH($AK$424,'Hide this - Workings'!D135)),1,0),\"\")","v":""},{"$f":"IF($AL$425=1,IF(ISNUMBER(SEARCH($AK$425,'Hide this - Workings'!D135)),1,0),\"\")","v":""},{"$f":"IF($AL$426=1,IF(ISNUMBER(SEARCH($AK$426,'Hide this - Workings'!D135)),1,0),\"\")","v":""},{"$f":"IF($AL$427=1,IF(ISNUMBER(SEARCH($AK$427,'Hide this - Workings'!D135)),1,0),\"\")","v":""},{"$f":"IF($AL$428=1,IF(ISNUMBER(SEARCH($AK$428,'Hide this - Workings'!D135)),1,0),\"\")","v":""},{"$f":"IF($AL$429=1,IF(ISNUMBER(SEARCH($AK$429,'Hide this - Workings'!D135)),1,0),\"\")","v":""},{"$f":"IF($AL$430=1,IF(ISNUMBER(SEARCH($AK$430,'Hide this - Workings'!D135)),1,0),\"\")","v":""},{"$f":"IF($AL$431=1,IF(ISNUMBER(SEARCH($AK$431,'Hide this - Workings'!D135)),1,0),\"\")","v":""},{"$f":"IF($AL$432=1,IF(ISNUMBER(SEARCH($AK$432,'Hide this - Workings'!D135)),1,0),\"\")","v":""},{"$f":"IF($AL$433=1,IF(ISNUMBER(SEARCH($AK$433,'Hide this - Workings'!D135)),1,0),\"\")","v":""},0,"A131",0,0,0,0]
[null,null,null,null,null,null,null,null,null,null,null,null,null,{"$f":"IF($AL$417=1,IF(ISNUMBER(SEARCH($AK$417,'Hide this - Workings'!D136)),1,0),\"\")","v":""},{"$f":"IF($AL$418=1,IF(ISNUMBER(SEARCH($AK$418,'Hide this - Workings'!D136)),1,0),\"\")","v":""},{"$f":"IF($AL$419=1,IF(ISNUMBER(SEARCH($AK$419,'Hide this - Workings'!D136)),1,0),\"\")","v":""},{"$f":"IF($AL$420=1,IF(ISNUMBER(SEARCH($AK$420,'Hide this - Workings'!D136)),1,0),\"\")","v":""},{"$f":"IF($AL$421=1,IF(ISNUMBER(SEARCH($AK$421,'Hide this - Workings'!D136)),1,0),\"\")","v":""},{"$f":"IF($AL$422=1,IF(ISNUMBER(SEARCH($AK$422,'Hide this - Workings'!D136)),1,0),\"\")","v":""},{"$f":"IF($AL$423=1,IF(ISNUMBER(SEARCH($AK$423,'Hide this - Workings'!D136)),1,0),\"\")","v":""},{"$f":"IF($AL$424=1,IF(ISNUMBER(SEARCH($AK$424,'Hide this - Workings'!D136)),1,0),\"\")","v":""},{"$f":"IF($AL$425=1,IF(ISNUMBER(SEARCH($AK$425,'Hide this - Workings'!D136)),1,0),\"\")","v":""},{"$f":"IF($AL$426=1,IF(ISNUMBER(SEARCH($AK$426,'Hide this - Workings'!D136)),1,0),\"\")","v":""},{"$f":"IF($AL$427=1,IF(ISNUMBER(SEARCH($AK$427,'Hide this - Workings'!D136)),1,0),\"\")","v":""},{"$f":"IF($AL$428=1,IF(ISNUMBER(SEARCH($AK$428,'Hide this - Workings'!D136)),1,0),\"\")","v":""},{"$f":"IF($AL$429=1,IF(ISNUMBER(SEARCH($AK$429,'Hide this - Workings'!D136)),1,0),\"\")","v":""},{"$f":"IF($AL$430=1,IF(ISNUMBER(SEARCH($AK$430,'Hide this - Workings'!D136)),1,0),\"\")","v":""},{"$f":"IF($AL$431=1,IF(ISNUMBER(SEARCH($AK$431,'Hide this - Workings'!D136)),1,0),\"\")","v":""},{"$f":"IF($AL$432=1,IF(ISNUMBER(SEARCH($AK$432,'Hide this - Workings'!D136)),1,0),\"\")","v":""},{"$f":"IF($AL$433=1,IF(ISNUMBER(SEARCH($AK$433,'Hide this - Workings'!D136)),1,0),\"\")","v":""},0,"A132",0,0,0,0]
[null,null,null,null,null,null,null,null,null,null,null,null,null,{"$f":"IF($AL$417=1,IF(ISNUMBER(SEARCH($AK$417,'Hide this - Workings'!D137)),1,0),\"\")","v":""},{"$f":"IF($AL$418=1,IF(ISNUMBER(SEARCH($AK$418,'Hide this - Workings'!D137)),1,0),\"\")","v":""},{"$f":"IF($AL$419=1,IF(ISNUMBER(SEARCH($AK$419,'Hide this - Workings'!D137)),1,0),\"\")","v":""},{"$f":"IF($AL$420=1,IF(ISNUMBER(SEARCH($AK$420,'Hide this - Workings'!D137)),1,0),\"\")","v":""},{"$f":"IF($AL$421=1,IF(ISNUMBER(SEARCH($AK$421,'Hide this - Workings'!D137)),1,0),\"\")","v":""},{"$f":"IF($AL$422=1,IF(ISNUMBER(SEARCH($AK$422,'Hide this - Workings'!D137)),1,0),\"\")","v":""},{"$f":"IF($AL$423=1,IF(ISNUMBER(SEARCH($AK$423,'Hide this - Workings'!D137)),1,0),\"\")","v":""},{"$f":"IF($AL$424=1,IF(ISNUMBER(SEARCH($AK$424,'Hide this - Workings'!D137)),1,0),\"\")","v":""},{"$f":"IF($AL$425=1,IF(ISNUMBER(SEARCH($AK$425,'Hide this - Workings'!D137)),1,0),\"\")","v":""},{"$f":"IF($AL$426=1,IF(ISNUMBER(SEARCH($AK$426,'Hide this - Workings'!D137)),1,0),\"\")","v":""},{"$f":"IF($AL$427=1,IF(ISNUMBER(SEARCH($AK$427,'Hide this - Workings'!D137)),1,0),\"\")","v":""},{"$f":"IF($AL$428=1,IF(ISNUMBER(SEARCH($AK$428,'Hide this - Workings'!D137)),1,0),\"\")","v":""},{"$f":"IF($AL$429=1,IF(ISNUMBER(SEARCH($AK$429,'Hide this - Workings'!D137)),1,0),\"\")","v":""},{"$f":"IF($AL$430=1,IF(ISNUMBER(SEARCH($AK$430,'Hide this - Workings'!D137)),1,0),\"\")","v":""},{"$f":"IF($AL$431=1,IF(ISNUMBER(SEARCH($AK$431,'Hide this - Workings'!D137)),1,0),\"\")","v":""},{"$f":"IF($AL$432=1,IF(ISNUMBER(SEARCH($AK$432,'Hide this - Workings'!D137)),1,0),\"\")","v":""},{"$f":"IF($AL$433=1,IF(ISNUMBER(SEARCH($AK$433,'Hide this - Workings'!D137)),1,0),\"\")","v":""},0,"A133",0,0,0,0]
[null,null,null,null,null,null,null,null,null,null,null,null,null,{"$f":"IF($AL$417=1,IF(ISNUMBER(SEARCH($AK$417,'Hide this - Workings'!D138)),1,0),\"\")","v":""},{"$f":"IF($AL$418=1,IF(ISNUMBER(SEARCH($AK$418,'Hide this - Workings'!D138)),1,0),\"\")","v":""},{"$f":"IF($AL$419=1,IF(ISNUMBER(SEARCH($AK$419,'Hide this - Workings'!D138)),1,0),\"\")","v":""},{"$f":"IF($AL$420=1,IF(ISNUMBER(SEARCH($AK$420,'Hide this - Workings'!D138)),1,0),\"\")","v":""},{"$f":"IF($AL$421=1,IF(ISNUMBER(SEARCH($AK$421,'Hide this - Workings'!D138)),1,0),\"\")","v":""},{"$f":"IF($AL$422=1,IF(ISNUMBER(SEARCH($AK$422,'Hide this - Workings'!D138)),1,0),\"\")","v":""},{"$f":"IF($AL$423=1,IF(ISNUMBER(SEARCH($AK$423,'Hide this - Workings'!D138)),1,0),\"\")","v":""},{"$f":"IF($AL$424=1,IF(ISNUMBER(SEARCH($AK$424,'Hide this - Workings'!D138)),1,0),\"\")","v":""},{"$f":"IF($AL$425=1,IF(ISNUMBER(SEARCH($AK$425,'Hide this - Workings'!D138)),1,0),\"\")","v":""},{"$f":"IF($AL$426=1,IF(ISNUMBER(SEARCH($AK$426,'Hide this - Workings'!D138)),1,0),\"\")","v":""},{"$f":"IF($AL$427=1,IF(ISNUMBER(SEARCH($AK$427,'Hide this - Workings'!D138)),1,0),\"\")","v":""},{"$f":"IF($AL$428=1,IF(ISNUMBER(SEARCH($AK$428,'Hide this - Workings'!D138)),1,0),\"\")","v":""},{"$f":"IF($AL$429=1,IF(ISNUMBER(SEARCH($AK$429,'Hide this - Workings'!D138)),1,0),\"\")","v":""},{"$f":"IF($AL$430=1,IF(ISNUMBER(SEARCH($AK$430,'Hide this - Workings'!D138)),1,0),\"\")","v":""},{"$f":"IF($AL$431=1,IF(ISNUMBER(SEARCH($AK$431,'Hide this - Workings'!D138)),1,0),\"\")","v":""},{"$f":"IF($AL$432=1,IF(ISNUMBER(SEARCH($AK$432,'Hide this - Workings'!D138)),1,0),\"\")","v":""},{"$f":"IF($AL$433=1,IF(ISNUMBER(SEARCH($AK$433,'Hide this - Workings'!D138)),1,0),\"\")","v":""},0,"A134",0,0,0,0]
[null,null,null,null,null,null,null,null,null,null,null,null,null,{"$f":"IF($AL$417=1,IF(ISNUMBER(SEARCH($AK$417,'Hide this - Workings'!D139)),1,0),\"\")","v":""},{"$f":"IF($AL$418=1,IF(ISNUMBER(SEARCH($AK$418,'Hide this - Workings'!D139)),1,0),\"\")","v":""},{"$f":"IF($AL$419=1,IF(ISNUMBER(SEARCH($AK$419,'Hide this - Workings'!D139)),1,0),\"\")","v":""},{"$f":"IF($AL$420=1,IF(ISNUMBER(SEARCH($AK$420,'Hide this - Workings'!D139)),1,0),\"\")","v":""},{"$f":"IF($AL$421=1,IF(ISNUMBER(SEARCH($AK$421,'Hide this - Workings'!D139)),1,0),\"\")","v":""},{"$f":"IF($AL$422=1,IF(ISNUMBER(SEARCH($AK$422,'Hide this - Workings'!D139)),1,0),\"\")","v":""},{"$f":"IF($AL$423=1,IF(ISNUMBER(SEARCH($AK$423,'Hide this - Workings'!D139)),1,0),\"\")","v":""},{"$f":"IF($AL$424=1,IF(ISNUMBER(SEARCH($AK$424,'Hide this - Workings'!D139)),1,0),\"\")","v":""},{"$f":"IF($AL$425=1,IF(ISNUMBER(SEARCH($AK$425,'Hide this - Workings'!D139)),1,0),\"\")","v":""},{"$f":"IF($AL$426=1,IF(ISNUMBER(SEARCH($AK$426,'Hide this - Workings'!D139)),1,0),\"\")","v":""},{"$f":"IF($AL$427=1,IF(ISNUMBER(SEARCH($AK$427,'Hide this - Workings'!D139)),1,0),\"\")","v":""},{"$f":"IF($AL$428=1,IF(ISNUMBER(SEARCH($AK$428,'Hide this - Workings'!D139)),1,0),\"\")","v":""},{"$f":"IF($AL$429=1,IF(ISNUMBER(SEARCH($AK$429,'Hide this - Workings'!D139)),1,0),\"\")","v":""},{"$f":"IF($AL$430=1,IF(ISNUMBER(SEARCH($AK$430,'Hide this - Workings'!D139)),1,0),\"\")","v":""},{"$f":"IF($AL$431=1,IF(ISNUMBER(SEARCH($AK$431,'Hide this - Workings'!D139)),1,0),\"\")","v":""},{"$f":"IF($AL$432=1,IF(ISNUMBER(SEARCH($AK$432,'Hide this - Workings'!D139)),1,0),\"\")","v":""},{"$f":"IF($AL$433=1,IF(ISNUMBER(SEARCH($AK$433,'Hide this - Workings'!D139)),1,0),\"\")","v":""},0,"A135",0,0,0,0]
[null,null,null,null,null,null,null,null,null,null,null,null,null,{"$f":"IF($AL$417=1,IF(ISNUMBER(SEARCH($AK$417,'Hide this - Workings'!D140)),1,0),\"\")","v":""},{"$f":"IF($AL$418=1,IF(ISNUMBER(SEARCH($AK$418,'Hide this - Workings'!D140)),1,0),\"\")","v":""},{"$f":"IF($AL$419=1,IF(ISNUMBER(SEARCH($AK$419,'Hide this - Workings'!D140)),1,0),\"\")","v":""},{"$f":"IF($AL$420=1,IF(ISNUMBER(SEARCH($AK$420,'Hide this - Workings'!D140)),1,0),\"\")","v":""},{"$f":"IF($AL$421=1,IF(ISNUMBER(SEARCH($AK$421,'Hide this - Workings'!D140)),1,0),\"\")","v":""},{"$f":"IF($AL$422=1,IF(ISNUMBER(SEARCH($AK$422,'Hide this - Workings'!D140)),1,0),\"\")","v":""},{"$f":"IF($AL$423=1,IF(ISNUMBER(SEARCH($AK$423,'Hide this - Workings'!D140)),1,0),\"\")","v":""},{"$f":"IF($AL$424=1,IF(ISNUMBER(SEARCH($AK$424,'Hide this - Workings'!D140)),1,0),\"\")","v":""},{"$f":"IF($AL$425=1,IF(ISNUMBER(SEARCH($AK$425,'Hide this - Workings'!D140)),1,0),\"\")","v":""},{"$f":"IF($AL$426=1,IF(ISNUMBER(SEARCH($AK$426,'Hide this - Workings'!D140)),1,0),\"\")","v":""},{"$f":"IF($AL$427=1,IF(ISNUMBER(SEARCH($AK$427,'Hide this - Workings'!D140)),1,0),\"\")","v":""},{"$f":"IF($AL$428=1,IF(ISNUMBER(SEARCH($AK$428,'Hide this - Workings'!D140)),1,0),\"\")","v":""},{"$f":"IF($AL$429=1,IF(ISNUMBER(SEARCH($AK$429,'Hide this - Workings'!D140)),1,0),\"\")","v":""},{"$f":"IF($AL$430=1,IF(ISNUMBER(SEARCH($AK$430,'Hide this - Workings'!D140)),1,0),\"\")","v":""},{"$f":"IF($AL$431=1,IF(ISNUMBER(SEARCH($AK$431,'Hide this - Workings'!D140)),1,0),\"\")","v":""},{"$f":"IF($AL$432=1,IF(ISNUMBER(SEARCH($AK$432,'Hide this - Workings'!D140)),1,0),\"\")","v":""},{"$f":"IF($AL$433=1,IF(ISNUMBER(SEARCH($AK$433,'Hide this - Workings'!D140)),1,0),\"\")","v":""},0,"A136",0,0,0,0]
[null,null,null,null,null,null,null,null,null,null,null,null,null,{"$f":"IF($AL$417=1,IF(ISNUMBER(SEARCH($AK$417,'Hide this - Workings'!D141)),1,0),\"\")","v":""},{"$f":"IF($AL$418=1,IF(ISNUMBER(SEARCH($AK$418,'Hide this - Workings'!D141)),1,0),\"\")","v":""},{"$f":"IF($AL$419=1,IF(ISNUMBER(SEARCH($AK$419,'Hide this - Workings'!D141)),1,0),\"\")","v":""},{"$f":"IF($AL$420=1,IF(ISNUMBER(SEARCH($AK$420,'Hide this - Workings'!D141)),1,0),\"\")","v":""},{"$f":"IF($AL$421=1,IF(ISNUMBER(SEARCH($AK$421,'Hide this - Workings'!D141)),1,0),\"\")","v":""},{"$f":"IF($AL$422=1,IF(ISNUMBER(SEARCH($AK$422,'Hide this - Workings'!D141)),1,0),\"\")","v":""},{"$f":"IF($AL$423=1,IF(ISNUMBER(SEARCH($AK$423,'Hide this - Workings'!D141)),1,0),\"\")","v":""},{"$f":"IF($AL$424=1,IF(ISNUMBER(SEARCH($AK$424,'Hide this - Workings'!D141)),1,0),\"\")","v":""},{"$f":"IF($AL$425=1,IF(ISNUMBER(SEARCH($AK$425,'Hide this - Workings'!D141)),1,0),\"\")","v":""},{"$f":"IF($AL$426=1,IF(ISNUMBER(SEARCH($AK$426,'Hide this - Workings'!D141)),1,0),\"\")","v":""},{"$f":"IF($AL$427=1,IF(ISNUMBER(SEARCH($AK$427,'Hide this - Workings'!D141)),1,0),\"\")","v":""},{"$f":"IF($AL$428=1,IF(ISNUMBER(SEARCH($AK$428,'Hide this - Workings'!D141)),1,0),\"\")","v":""},{"$f":"IF($AL$429=1,IF(ISNUMBER(SEARCH($AK$429,'Hide this - Workings'!D141)),1,0),\"\")","v":""},{"$f":"IF($AL$430=1,IF(ISNUMBER(SEARCH($AK$430,'Hide this - Workings'!D141)),1,0),\"\")","v":""},{"$f":"IF($AL$431=1,IF(ISNUMBER(SEARCH($AK$431,'Hide this - Workings'!D141)),1,0),\"\")","v":""},{"$f":"IF($AL$432=1,IF(ISNUMBER(SEARCH($AK$432,'Hide this - Workings'!D141)),1,0),\"\")","v":""},{"$f":"IF($AL$433=1,IF(ISNUMBER(SEARCH($AK$433,'Hide this - Workings'!D141)),1,0),\"\")","v":""},0,"A137",0,0,0,0]
[null,null,null,null,null,null,null,null,null,null,null,null,null,{"$f":"IF($AL$417=1,IF(ISNUMBER(SEARCH($AK$417,'Hide this - Workings'!D142)),1,0),\"\")","v":""},{"$f":"IF($AL$418=1,IF(ISNUMBER(SEARCH($AK$418,'Hide this - Workings'!D142)),1,0),\"\")","v":""},{"$f":"IF($AL$419=1,IF(ISNUMBER(SEARCH($AK$419,'Hide this - Workings'!D142)),1,0),\"\")","v":""},{"$f":"IF($AL$420=1,IF(ISNUMBER(SEARCH($AK$420,'Hide this - Workings'!D142)),1,0),\"\")","v":""},{"$f":"IF($AL$421=1,IF(ISNUMBER(SEARCH($AK$421,'Hide this - Workings'!D142)),1,0),\"\")","v":""},{"$f":"IF($AL$422=1,IF(ISNUMBER(SEARCH($AK$422,'Hide this - Workings'!D142)),1,0),\"\")","v":""},{"$f":"IF($AL$423=1,IF(ISNUMBER(SEARCH($AK$423,'Hide this - Workings'!D142)),1,0),\"\")","v":""},{"$f":"IF($AL$424=1,IF(ISNUMBER(SEARCH($AK$424,'Hide this - Workings'!D142)),1,0),\"\")","v":""},{"$f":"IF($AL$425=1,IF(ISNUMBER(SEARCH($AK$425,'Hide this - Workings'!D142)),1,0),\"\")","v":""},{"$f":"IF($AL$426=1,IF(ISNUMBER(SEARCH($AK$426,'Hide this - Workings'!D142)),1,0),\"\")","v":""},{"$f":"IF($AL$427=1,IF(ISNUMBER(SEARCH($AK$427,'Hide this - Workings'!D142)),1,0),\"\")","v":""},{"$f":"IF($AL$428=1,IF(ISNUMBER(SEARCH($AK$428,'Hide this - Workings'!D142)),1,0),\"\")","v":""},{"$f":"IF($AL$429=1,IF(ISNUMBER(SEARCH($AK$429,'Hide this - Workings'!D142)),1,0),\"\")","v":""},{"$f":"IF($AL$430=1,IF(ISNUMBER(SEARCH($AK$430,'Hide this - Workings'!D142)),1,0),\"\")","v":""},{"$f":"IF($AL$431=1,IF(ISNUMBER(SEARCH($AK$431,'Hide this - Workings'!D142)),1,0),\"\")","v":""},{"$f":"IF($AL$432=1,IF(ISNUMBER(SEARCH($AK$432,'Hide this - Workings'!D142)),1,0),\"\")","v":""},{"$f":"IF($AL$433=1,IF(ISNUMBER(SEARCH($AK$433,'Hide this - Workings'!D142)),1,0),\"\")","v":""},0,"A138",0,0,0,0]
[null,null,null,null,null,null,null,null,null,null,null,null,null,{"$f":"IF($AL$417=1,IF(ISNUMBER(SEARCH($AK$417,'Hide this - Workings'!D143)),1,0),\"\")","v":""},{"$f":"IF($AL$418=1,IF(ISNUMBER(SEARCH($AK$418,'Hide this - Workings'!D143)),1,0),\"\")","v":""},{"$f":"IF($AL$419=1,IF(ISNUMBER(SEARCH($AK$419,'Hide this - Workings'!D143)),1,0),\"\")","v":""},{"$f":"IF($AL$420=1,IF(ISNUMBER(SEARCH($AK$420,'Hide this - Workings'!D143)),1,0),\"\")","v":""},{"$f":"IF($AL$421=1,IF(ISNUMBER(SEARCH($AK$421,'Hide this - Workings'!D143)),1,0),\"\")","v":""},{"$f":"IF($AL$422=1,IF(ISNUMBER(SEARCH($AK$422,'Hide this - Workings'!D143)),1,0),\"\")","v":""},{"$f":"IF($AL$423=1,IF(ISNUMBER(SEARCH($AK$423,'Hide this - Workings'!D143)),1,0),\"\")","v":""},{"$f":"IF($AL$424=1,IF(ISNUMBER(SEARCH($AK$424,'Hide this - Workings'!D143)),1,0),\"\")","v":""},{"$f":"IF($AL$425=1,IF(ISNUMBER(SEARCH($AK$425,'Hide this - Workings'!D143)),1,0),\"\")","v":""},{"$f":"IF($AL$426=1,IF(ISNUMBER(SEARCH($AK$426,'Hide this - Workings'!D143)),1,0),\"\")","v":""},{"$f":"IF($AL$427=1,IF(ISNUMBER(SEARCH($AK$427,'Hide this - Workings'!D143)),1,0),\"\")","v":""},{"$f":"IF($AL$428=1,IF(ISNUMBER(SEARCH($AK$428,'Hide this - Workings'!D143)),1,0),\"\")","v":""},{"$f":"IF($AL$429=1,IF(ISNUMBER(SEARCH($AK$429,'Hide this - Workings'!D143)),1,0),\"\")","v":""},{"$f":"IF($AL$430=1,IF(ISNUMBER(SEARCH($AK$430,'Hide this - Workings'!D143)),1,0),\"\")","v":""},{"$f":"IF($AL$431=1,IF(ISNUMBER(SEARCH($AK$431,'Hide this - Workings'!D143)),1,0),\"\")","v":""},{"$f":"IF($AL$432=1,IF(ISNUMBER(SEARCH($AK$432,'Hide this - Workings'!D143)),1,0),\"\")","v":""},{"$f":"IF($AL$433=1,IF(ISNUMBER(SEARCH($AK$433,'Hide this - Workings'!D143)),1,0),\"\")","v":""},0,"A139",0,0,0,0]
[null,null,null,null,null,null,null,null,null,null,null,null,null,{"$f":"IF($AL$417=1,IF(ISNUMBER(SEARCH($AK$417,'Hide this - Workings'!D144)),1,0),\"\")","v":""},{"$f":"IF($AL$418=1,IF(ISNUMBER(SEARCH($AK$418,'Hide this - Workings'!D144)),1,0),\"\")","v":""},{"$f":"IF($AL$419=1,IF(ISNUMBER(SEARCH($AK$419,'Hide this - Workings'!D144)),1,0),\"\")","v":""},{"$f":"IF($AL$420=1,IF(ISNUMBER(SEARCH($AK$420,'Hide this - Workings'!D144)),1,0),\"\")","v":""},{"$f":"IF($AL$421=1,IF(ISNUMBER(SEARCH($AK$421,'Hide this - Workings'!D144)),1,0),\"\")","v":""},{"$f":"IF($AL$422=1,IF(ISNUMBER(SEARCH($AK$422,'Hide this - Workings'!D144)),1,0),\"\")","v":""},{"$f":"IF($AL$423=1,IF(ISNUMBER(SEARCH($AK$423,'Hide this - Workings'!D144)),1,0),\"\")","v":""},{"$f":"IF($AL$424=1,IF(ISNUMBER(SEARCH($AK$424,'Hide this - Workings'!D144)),1,0),\"\")","v":""},{"$f":"IF($AL$425=1,IF(ISNUMBER(SEARCH($AK$425,'Hide this - Workings'!D144)),1,0),\"\")","v":""},{"$f":"IF($AL$426=1,IF(ISNUMBER(SEARCH($AK$426,'Hide this - Workings'!D144)),1,0),\"\")","v":""},{"$f":"IF($AL$427=1,IF(ISNUMBER(SEARCH($AK$427,'Hide this - Workings'!D144)),1,0),\"\")","v":""},{"$f":"IF($AL$428=1,IF(ISNUMBER(SEARCH($AK$428,'Hide this - Workings'!D144)),1,0),\"\")","v":""},{"$f":"IF($AL$429=1,IF(ISNUMBER(SEARCH($AK$429,'Hide this - Workings'!D144)),1,0),\"\")","v":""},{"$f":"IF($AL$430=1,IF(ISNUMBER(SEARCH($AK$430,'Hide this - Workings'!D144)),1,0),\"\")","v":""},{"$f":"IF($AL$431=1,IF(ISNUMBER(SEARCH($AK$431,'Hide this - Workings'!D144)),1,0),\"\")","v":""},{"$f":"IF($AL$432=1,IF(ISNUMBER(SEARCH($AK$432,'Hide this - Workings'!D144)),1,0),\"\")","v":""},{"$f":"IF($AL$433=1,IF(ISNUMBER(SEARCH($AK$433,'Hide this - Workings'!D144)),1,0),\"\")","v":""},0,"A140",0,0,0,0]
[null,null,null,null,null,null,null,null,null,null,null,null,null,{"$f":"IF($AL$417=1,IF(ISNUMBER(SEARCH($AK$417,'Hide this - Workings'!D145)),1,0),\"\")","v":""},{"$f":"IF($AL$418=1,IF(ISNUMBER(SEARCH($AK$418,'Hide this - Workings'!D145)),1,0),\"\")","v":""},{"$f":"IF($AL$419=1,IF(ISNUMBER(SEARCH($AK$419,'Hide this - Workings'!D145)),1,0),\"\")","v":""},{"$f":"IF($AL$420=1,IF(ISNUMBER(SEARCH($AK$420,'Hide this - Workings'!D145)),1,0),\"\")","v":""},{"$f":"IF($AL$421=1,IF(ISNUMBER(SEARCH($AK$421,'Hide this - Workings'!D145)),1,0),\"\")","v":""},{"$f":"IF($AL$422=1,IF(ISNUMBER(SEARCH($AK$422,'Hide this - Workings'!D145)),1,0),\"\")","v":""},{"$f":"IF($AL$423=1,IF(ISNUMBER(SEARCH($AK$423,'Hide this - Workings'!D145)),1,0),\"\")","v":""},{"$f":"IF($AL$424=1,IF(ISNUMBER(SEARCH($AK$424,'Hide this - Workings'!D145)),1,0),\"\")","v":""},{"$f":"IF($AL$425=1,IF(ISNUMBER(SEARCH($AK$425,'Hide this - Workings'!D145)),1,0),\"\")","v":""},{"$f":"IF($AL$426=1,IF(ISNUMBER(SEARCH($AK$426,'Hide this - Workings'!D145)),1,0),\"\")","v":""},{"$f":"IF($AL$427=1,IF(ISNUMBER(SEARCH($AK$427,'Hide this - Workings'!D145)),1,0),\"\")","v":""},{"$f":"IF($AL$428=1,IF(ISNUMBER(SEARCH($AK$428,'Hide this - Workings'!D145)),1,0),\"\")","v":""},{"$f":"IF($AL$429=1,IF(ISNUMBER(SEARCH($AK$429,'Hide this - Workings'!D145)),1,0),\"\")","v":""},{"$f":"IF($AL$430=1,IF(ISNUMBER(SEARCH($AK$430,'Hide this - Workings'!D145)),1,0),\"\")","v":""},{"$f":"IF($AL$431=1,IF(ISNUMBER(SEARCH($AK$431,'Hide this - Workings'!D145)),1,0),\"\")","v":""},{"$f":"IF($AL$432=1,IF(ISNUMBER(SEARCH($AK$432,'Hide this - Workings'!D145)),1,0),\"\")","v":""},{"$f":"IF($AL$433=1,IF(ISNUMBER(SEARCH($AK$433,'Hide this - Workings'!D145)),1,0),\"\")","v":""},0,"A141",0,0,0,0]
[null,null,null,null,null,null,null,null,null,null,null,null,null,{"$f":"IF($AL$417=1,IF(ISNUMBER(SEARCH($AK$417,'Hide this - Workings'!D146)),1,0),\"\")","v":""},{"$f":"IF($AL$418=1,IF(ISNUMBER(SEARCH($AK$418,'Hide this - Workings'!D146)),1,0),\"\")","v":""},{"$f":"IF($AL$419=1,IF(ISNUMBER(SEARCH($AK$419,'Hide this - Workings'!D146)),1,0),\"\")","v":""},{"$f":"IF($AL$420=1,IF(ISNUMBER(SEARCH($AK$420,'Hide this - Workings'!D146)),1,0),\"\")","v":""},{"$f":"IF($AL$421=1,IF(ISNUMBER(SEARCH($AK$421,'Hide this - Workings'!D146)),1,0),\"\")","v":""},{"$f":"IF($AL$422=1,IF(ISNUMBER(SEARCH($AK$422,'Hide this - Workings'!D146)),1,0),\"\")","v":""},{"$f":"IF($AL$423=1,IF(ISNUMBER(SEARCH($AK$423,'Hide this - Workings'!D146)),1,0),\"\")","v":""},{"$f":"IF($AL$424=1,IF(ISNUMBER(SEARCH($AK$424,'Hide this - Workings'!D146)),1,0),\"\")","v":""},{"$f":"IF($AL$425=1,IF(ISNUMBER(SEARCH($AK$425,'Hide this - Workings'!D146)),1,0),\"\")","v":""},{"$f":"IF($AL$426=1,IF(ISNUMBER(SEARCH($AK$426,'Hide this - Workings'!D146)),1,0),\"\")","v":""},{"$f":"IF($AL$427=1,IF(ISNUMBER(SEARCH($AK$427,'Hide this - Workings'!D146)),1,0),\"\")","v":""},{"$f":"IF($AL$428=1,IF(ISNUMBER(SEARCH($AK$428,'Hide this - Workings'!D146)),1,0),\"\")","v":""},{"$f":"IF($AL$429=1,IF(ISNUMBER(SEARCH($AK$429,'Hide this - Workings'!D146)),1,0),\"\")","v":""},{"$f":"IF($AL$430=1,IF(ISNUMBER(SEARCH($AK$430,'Hide this - Workings'!D146)),1,0),\"\")","v":""},{"$f":"IF($AL$431=1,IF(ISNUMBER(SEARCH($AK$431,'Hide this - Workings'!D146)),1,0),\"\")","v":""},{"$f":"IF($AL$432=1,IF(ISNUMBER(SEARCH($AK$432,'Hide this - Workings'!D146)),1,0),\"\")","v":""},{"$f":"IF($AL$433=1,IF(ISNUMBER(SEARCH($AK$433,'Hide this - Workings'!D146)),1,0),\"\")","v":""},0,"A142",0,0,0,0]
[null,null,null,null,null,null,null,null,null,null,null,null,null,{"$f":"IF($AL$417=1,IF(ISNUMBER(SEARCH($AK$417,'Hide this - Workings'!D147)),1,0),\"\")","v":""},{"$f":"IF($AL$418=1,IF(ISNUMBER(SEARCH($AK$418,'Hide this - Workings'!D147)),1,0),\"\")","v":""},{"$f":"IF($AL$419=1,IF(ISNUMBER(SEARCH($AK$419,'Hide this - Workings'!D147)),1,0),\"\")","v":""},{"$f":"IF($AL$420=1,IF(ISNUMBER(SEARCH($AK$420,'Hide this - Workings'!D147)),1,0),\"\")","v":""},{"$f":"IF($AL$421=1,IF(ISNUMBER(SEARCH($AK$421,'Hide this - Workings'!D147)),1,0),\"\")","v":""},{"$f":"IF($AL$422=1,IF(ISNUMBER(SEARCH($AK$422,'Hide this - Workings'!D147)),1,0),\"\")","v":""},{"$f":"IF($AL$423=1,IF(ISNUMBER(SEARCH($AK$423,'Hide this - Workings'!D147)),1,0),\"\")","v":""},{"$f":"IF($AL$424=1,IF(ISNUMBER(SEARCH($AK$424,'Hide this - Workings'!D147)),1,0),\"\")","v":""},{"$f":"IF($AL$425=1,IF(ISNUMBER(SEARCH($AK$425,'Hide this - Workings'!D147)),1,0),\"\")","v":""},{"$f":"IF($AL$426=1,IF(ISNUMBER(SEARCH($AK$426,'Hide this - Workings'!D147)),1,0),\"\")","v":""},{"$f":"IF($AL$427=1,IF(ISNUMBER(SEARCH($AK$427,'Hide this - Workings'!D147)),1,0),\"\")","v":""},{"$f":"IF($AL$428=1,IF(ISNUMBER(SEARCH($AK$428,'Hide this - Workings'!D147)),1,0),\"\")","v":""},{"$f":"IF($AL$429=1,IF(ISNUMBER(SEARCH($AK$429,'Hide this - Workings'!D147)),1,0),\"\")","v":""},{"$f":"IF($AL$430=1,IF(ISNUMBER(SEARCH($AK$430,'Hide this - Workings'!D147)),1,0),\"\")","v":""},{"$f":"IF($AL$431=1,IF(ISNUMBER(SEARCH($AK$431,'Hide this - Workings'!D147)),1,0),\"\")","v":""},{"$f":"IF($AL$432=1,IF(ISNUMBER(SEARCH($AK$432,'Hide this - Workings'!D147)),1,0),\"\")","v":""},{"$f":"IF($AL$433=1,IF(ISNUMBER(SEARCH($AK$433,'Hide this - Workings'!D147)),1,0),\"\")","v":""},0,"A143",0,0,0,0]
[null,null,null,null,null,null,null,null,null,null,null,null,null,{"$f":"IF($AL$417=1,IF(ISNUMBER(SEARCH($AK$417,'Hide this - Workings'!D148)),1,0),\"\")","v":""},{"$f":"IF($AL$418=1,IF(ISNUMBER(SEARCH($AK$418,'Hide this - Workings'!D148)),1,0),\"\")","v":""},{"$f":"IF($AL$419=1,IF(ISNUMBER(SEARCH($AK$419,'Hide this - Workings'!D148)),1,0),\"\")","v":""},{"$f":"IF($AL$420=1,IF(ISNUMBER(SEARCH($AK$420,'Hide this - Workings'!D148)),1,0),\"\")","v":""},{"$f":"IF($AL$421=1,IF(ISNUMBER(SEARCH($AK$421,'Hide this - Workings'!D148)),1,0),\"\")","v":""},{"$f":"IF($AL$422=1,IF(ISNUMBER(SEARCH($AK$422,'Hide this - Workings'!D148)),1,0),\"\")","v":""},{"$f":"IF($AL$423=1,IF(ISNUMBER(SEARCH($AK$423,'Hide this - Workings'!D148)),1,0),\"\")","v":""},{"$f":"IF($AL$424=1,IF(ISNUMBER(SEARCH($AK$424,'Hide this - Workings'!D148)),1,0),\"\")","v":""},{"$f":"IF($AL$425=1,IF(ISNUMBER(SEARCH($AK$425,'Hide this - Workings'!D148)),1,0),\"\")","v":""},{"$f":"IF($AL$426=1,IF(ISNUMBER(SEARCH($AK$426,'Hide this - Workings'!D148)),1,0),\"\")","v":""},{"$f":"IF($AL$427=1,IF(ISNUMBER(SEARCH($AK$427,'Hide this - Workings'!D148)),1,0),\"\")","v":""},{"$f":"IF($AL$428=1,IF(ISNUMBER(SEARCH($AK$428,'Hide this - Workings'!D148)),1,0),\"\")","v":""},{"$f":"IF($AL$429=1,IF(ISNUMBER(SEARCH($AK$429,'Hide this - Workings'!D148)),1,0),\"\")","v":""},{"$f":"IF($AL$430=1,IF(ISNUMBER(SEARCH($AK$430,'Hide this - Workings'!D148)),1,0),\"\")","v":""},{"$f":"IF($AL$431=1,IF(ISNUMBER(SEARCH($AK$431,'Hide this - Workings'!D148)),1,0),\"\")","v":""},{"$f":"IF($AL$432=1,IF(ISNUMBER(SEARCH($AK$432,'Hide this - Workings'!D148)),1,0),\"\")","v":""},{"$f":"IF($AL$433=1,IF(ISNUMBER(SEARCH($AK$433,'Hide this - Workings'!D148)),1,0),\"\")","v":""},0,"A144",0,0,0,0]
[null,null,null,null,null,null,null,null,null,null,null,null,null,{"$f":"IF($AL$417=1,IF(ISNUMBER(SEARCH($AK$417,'Hide this - Workings'!D149)),1,0),\"\")","v":""},{"$f":"IF($AL$418=1,IF(ISNUMBER(SEARCH($AK$418,'Hide this - Workings'!D149)),1,0),\"\")","v":""},{"$f":"IF($AL$419=1,IF(ISNUMBER(SEARCH($AK$419,'Hide this - Workings'!D149)),1,0),\"\")","v":""},{"$f":"IF($AL$420=1,IF(ISNUMBER(SEARCH($AK$420,'Hide this - Workings'!D149)),1,0),\"\")","v":""},{"$f":"IF($AL$421=1,IF(ISNUMBER(SEARCH($AK$421,'Hide this - Workings'!D149)),1,0),\"\")","v":""},{"$f":"IF($AL$422=1,IF(ISNUMBER(SEARCH($AK$422,'Hide this - Workings'!D149)),1,0),\"\")","v":""},{"$f":"IF($AL$423=1,IF(ISNUMBER(SEARCH($AK$423,'Hide this - Workings'!D149)),1,0),\"\")","v":""},{"$f":"IF($AL$424=1,IF(ISNUMBER(SEARCH($AK$424,'Hide this - Workings'!D149)),1,0),\"\")","v":""},{"$f":"IF($AL$425=1,IF(ISNUMBER(SEARCH($AK$425,'Hide this - Workings'!D149)),1,0),\"\")","v":""},{"$f":"IF($AL$426=1,IF(ISNUMBER(SEARCH($AK$426,'Hide this - Workings'!D149)),1,0),\"\")","v":""},{"$f":"IF($AL$427=1,IF(ISNUMBER(SEARCH($AK$427,'Hide this - Workings'!D149)),1,0),\"\")","v":""},{"$f":"IF($AL$428=1,IF(ISNUMBER(SEARCH($AK$428,'Hide this - Workings'!D149)),1,0),\"\")","v":""},{"$f":"IF($AL$429=1,IF(ISNUMBER(SEARCH($AK$429,'Hide this - Workings'!D149)),1,0),\"\")","v":""},{"$f":"IF($AL$430=1,IF(ISNUMBER(SEARCH($AK$430,'Hide this - Workings'!D149)),1,0),\"\")","v":""},{"$f":"IF($AL$431=1,IF(ISNUMBER(SEARCH($AK$431,'Hide this - Workings'!D149)),1,0),\"\")","v":""},{"$f":"IF($AL$432=1,IF(ISNUMBER(SEARCH($AK$432,'Hide this - Workings'!D149)),1,0),\"\")","v":""},{"$f":"IF($AL$433=1,IF(ISNUMBER(SEARCH($AK$433,'Hide this - Workings'!D149)),1,0),\"\")","v":""},0,"A145",0,0,0,0]
[null,null,null,null,null,null,null,null,null,null,null,null,null,{"$f":"IF($AL$417=1,IF(ISNUMBER(SEARCH($AK$417,'Hide this - Workings'!D150)),1,0),\"\")","v":""},{"$f":"IF($AL$418=1,IF(ISNUMBER(SEARCH($AK$418,'Hide this - Workings'!D150)),1,0),\"\")","v":""},{"$f":"IF($AL$419=1,IF(ISNUMBER(SEARCH($AK$419,'Hide this - Workings'!D150)),1,0),\"\")","v":""},{"$f":"IF($AL$420=1,IF(ISNUMBER(SEARCH($AK$420,'Hide this - Workings'!D150)),1,0),\"\")","v":""},{"$f":"IF($AL$421=1,IF(ISNUMBER(SEARCH($AK$421,'Hide this - Workings'!D150)),1,0),\"\")","v":""},{"$f":"IF($AL$422=1,IF(ISNUMBER(SEARCH($AK$422,'Hide this - Workings'!D150)),1,0),\"\")","v":""},{"$f":"IF($AL$423=1,IF(ISNUMBER(SEARCH($AK$423,'Hide this - Workings'!D150)),1,0),\"\")","v":""},{"$f":"IF($AL$424=1,IF(ISNUMBER(SEARCH($AK$424,'Hide this - Workings'!D150)),1,0),\"\")","v":""},{"$f":"IF($AL$425=1,IF(ISNUMBER(SEARCH($AK$425,'Hide this - Workings'!D150)),1,0),\"\")","v":""},{"$f":"IF($AL$426=1,IF(ISNUMBER(SEARCH($AK$426,'Hide this - Workings'!D150)),1,0),\"\")","v":""},{"$f":"IF($AL$427=1,IF(ISNUMBER(SEARCH($AK$427,'Hide this - Workings'!D150)),1,0),\"\")","v":""},{"$f":"IF($AL$428=1,IF(ISNUMBER(SEARCH($AK$428,'Hide this - Workings'!D150)),1,0),\"\")","v":""},{"$f":"IF($AL$429=1,IF(ISNUMBER(SEARCH($AK$429,'Hide this - Workings'!D150)),1,0),\"\")","v":""},{"$f":"IF($AL$430=1,IF(ISNUMBER(SEARCH($AK$430,'Hide this - Workings'!D150)),1,0),\"\")","v":""},{"$f":"IF($AL$431=1,IF(ISNUMBER(SEARCH($AK$431,'Hide this - Workings'!D150)),1,0),\"\")","v":""},{"$f":"IF($AL$432=1,IF(ISNUMBER(SEARCH($AK$432,'Hide this - Workings'!D150)),1,0),\"\")","v":""},{"$f":"IF($AL$433=1,IF(ISNUMBER(SEARCH($AK$433,'Hide this - Workings'!D150)),1,0),\"\")","v":""},0,"A146",0,0,0,0]
[null,null,null,null,null,null,null,null,null,null,null,null,null,{"$f":"IF($AL$417=1,IF(ISNUMBER(SEARCH($AK$417,'Hide this - Workings'!D151)),1,0),\"\")","v":""},{"$f":"IF($AL$418=1,IF(ISNUMBER(SEARCH($AK$418,'Hide this - Workings'!D151)),1,0),\"\")","v":""},{"$f":"IF($AL$419=1,IF(ISNUMBER(SEARCH($AK$419,'Hide this - Workings'!D151)),1,0),\"\")","v":""},{"$f":"IF($AL$420=1,IF(ISNUMBER(SEARCH($AK$420,'Hide this - Workings'!D151)),1,0),\"\")","v":""},{"$f":"IF($AL$421=1,IF(ISNUMBER(SEARCH($AK$421,'Hide this - Workings'!D151)),1,0),\"\")","v":""},{"$f":"IF($AL$422=1,IF(ISNUMBER(SEARCH($AK$422,'Hide this - Workings'!D151)),1,0),\"\")","v":""},{"$f":"IF($AL$423=1,IF(ISNUMBER(SEARCH($AK$423,'Hide this - Workings'!D151)),1,0),\"\")","v":""},{"$f":"IF($AL$424=1,IF(ISNUMBER(SEARCH($AK$424,'Hide this - Workings'!D151)),1,0),\"\")","v":""},{"$f":"IF($AL$425=1,IF(ISNUMBER(SEARCH($AK$425,'Hide this - Workings'!D151)),1,0),\"\")","v":""},{"$f":"IF($AL$426=1,IF(ISNUMBER(SEARCH($AK$426,'Hide this - Workings'!D151)),1,0),\"\")","v":""},{"$f":"IF($AL$427=1,IF(ISNUMBER(SEARCH($AK$427,'Hide this - Workings'!D151)),1,0),\"\")","v":""},{"$f":"IF($AL$428=1,IF(ISNUMBER(SEARCH($AK$428,'Hide this - Workings'!D151)),1,0),\"\")","v":""},{"$f":"IF($AL$429=1,IF(ISNUMBER(SEARCH($AK$429,'Hide this - Workings'!D151)),1,0),\"\")","v":""},{"$f":"IF($AL$430=1,IF(ISNUMBER(SEARCH($AK$430,'Hide this - Workings'!D151)),1,0),\"\")","v":""},{"$f":"IF($AL$431=1,IF(ISNUMBER(SEARCH($AK$431,'Hide this - Workings'!D151)),1,0),\"\")","v":""},{"$f":"IF($AL$432=1,IF(ISNUMBER(SEARCH($AK$432,'Hide this - Workings'!D151)),1,0),\"\")","v":""},{"$f":"IF($AL$433=1,IF(ISNUMBER(SEARCH($AK$433,'Hide this - Workings'!D151)),1,0),\"\")","v":""},0,"A147",0,0,0,0]
[null,null,null,null,null,null,null,null,null,null,null,null,null,{"$f":"IF($AL$417=1,IF(ISNUMBER(SEARCH($AK$417,'Hide this - Workings'!D152)),1,0),\"\")","v":""},{"$f":"IF($AL$418=1,IF(ISNUMBER(SEARCH($AK$418,'Hide this - Workings'!D152)),1,0),\"\")","v":""},{"$f":"IF($AL$419=1,IF(ISNUMBER(SEARCH($AK$419,'Hide this - Workings'!D152)),1,0),\"\")","v":""},{"$f":"IF($AL$420=1,IF(ISNUMBER(SEARCH($AK$420,'Hide this - Workings'!D152)),1,0),\"\")","v":""},{"$f":"IF($AL$421=1,IF(ISNUMBER(SEARCH($AK$421,'Hide this - Workings'!D152)),1,0),\"\")","v":""},{"$f":"IF($AL$422=1,IF(ISNUMBER(SEARCH($AK$422,'Hide this - Workings'!D152)),1,0),\"\")","v":""},{"$f":"IF($AL$423=1,IF(ISNUMBER(SEARCH($AK$423,'Hide this - Workings'!D152)),1,0),\"\")","v":""},{"$f":"IF($AL$424=1,IF(ISNUMBER(SEARCH($AK$424,'Hide this - Workings'!D152)),1,0),\"\")","v":""},{"$f":"IF($AL$425=1,IF(ISNUMBER(SEARCH($AK$425,'Hide this - Workings'!D152)),1,0),\"\")","v":""},{"$f":"IF($AL$426=1,IF(ISNUMBER(SEARCH($AK$426,'Hide this - Workings'!D152)),1,0),\"\")","v":""},{"$f":"IF($AL$427=1,IF(ISNUMBER(SEARCH($AK$427,'Hide this - Workings'!D152)),1,0),\"\")","v":""},{"$f":"IF($AL$428=1,IF(ISNUMBER(SEARCH($AK$428,'Hide this - Workings'!D152)),1,0),\"\")","v":""},{"$f":"IF($AL$429=1,IF(ISNUMBER(SEARCH($AK$429,'Hide this - Workings'!D152)),1,0),\"\")","v":""},{"$f":"IF($AL$430=1,IF(ISNUMBER(SEARCH($AK$430,'Hide this - Workings'!D152)),1,0),\"\")","v":""},{"$f":"IF($AL$431=1,IF(ISNUMBER(SEARCH($AK$431,'Hide this - Workings'!D152)),1,0),\"\")","v":""},{"$f":"IF($AL$432=1,IF(ISNUMBER(SEARCH($AK$432,'Hide this - Workings'!D152)),1,0),\"\")","v":""},{"$f":"IF($AL$433=1,IF(ISNUMBER(SEARCH($AK$433,'Hide this - Workings'!D152)),1,0),\"\")","v":""},0,"A148",0,0,0,0]
[null,null,null,null,null,null,null,null,null,null,null,null,null,{"$f":"IF($AL$417=1,IF(ISNUMBER(SEARCH($AK$417,'Hide this - Workings'!D153)),1,0),\"\")","v":""},{"$f":"IF($AL$418=1,IF(ISNUMBER(SEARCH($AK$418,'Hide this - Workings'!D153)),1,0),\"\")","v":""},{"$f":"IF($AL$419=1,IF(ISNUMBER(SEARCH($AK$419,'Hide this - Workings'!D153)),1,0),\"\")","v":""},{"$f":"IF($AL$420=1,IF(ISNUMBER(SEARCH($AK$420,'Hide this - Workings'!D153)),1,0),\"\")","v":""},{"$f":"IF($AL$421=1,IF(ISNUMBER(SEARCH($AK$421,'Hide this - Workings'!D153)),1,0),\"\")","v":""},{"$f":"IF($AL$422=1,IF(ISNUMBER(SEARCH($AK$422,'Hide this - Workings'!D153)),1,0),\"\")","v":""},{"$f":"IF($AL$423=1,IF(ISNUMBER(SEARCH($AK$423,'Hide this - Workings'!D153)),1,0),\"\")","v":""},{"$f":"IF($AL$424=1,IF(ISNUMBER(SEARCH($AK$424,'Hide this - Workings'!D153)),1,0),\"\")","v":""},{"$f":"IF($AL$425=1,IF(ISNUMBER(SEARCH($AK$425,'Hide this - Workings'!D153)),1,0),\"\")","v":""},{"$f":"IF($AL$426=1,IF(ISNUMBER(SEARCH($AK$426,'Hide this - Workings'!D153)),1,0),\"\")","v":""},{"$f":"IF($AL$427=1,IF(ISNUMBER(SEARCH($AK$427,'Hide this - Workings'!D153)),1,0),\"\")","v":""},{"$f":"IF($AL$428=1,IF(ISNUMBER(SEARCH($AK$428,'Hide this - Workings'!D153)),1,0),\"\")","v":""},{"$f":"IF($AL$429=1,IF(ISNUMBER(SEARCH($AK$429,'Hide this - Workings'!D153)),1,0),\"\")","v":""},{"$f":"IF($AL$430=1,IF(ISNUMBER(SEARCH($AK$430,'Hide this - Workings'!D153)),1,0),\"\")","v":""},{"$f":"IF($AL$431=1,IF(ISNUMBER(SEARCH($AK$431,'Hide this - Workings'!D153)),1,0),\"\")","v":""},{"$f":"IF($AL$432=1,IF(ISNUMBER(SEARCH($AK$432,'Hide this - Workings'!D153)),1,0),\"\")","v":""},{"$f":"IF($AL$433=1,IF(ISNUMBER(SEARCH($AK$433,'Hide this - Workings'!D153)),1,0),\"\")","v":""},0,"A149",0,0,0,0]
[null,null,null,null,null,null,null,null,null,null,null,null,null,{"$f":"IF($AL$417=1,IF(ISNUMBER(SEARCH($AK$417,'Hide this - Workings'!D154)),1,0),\"\")","v":""},{"$f":"IF($AL$418=1,IF(ISNUMBER(SEARCH($AK$418,'Hide this - Workings'!D154)),1,0),\"\")","v":""},{"$f":"IF($AL$419=1,IF(ISNUMBER(SEARCH($AK$419,'Hide this - Workings'!D154)),1,0),\"\")","v":""},{"$f":"IF($AL$420=1,IF(ISNUMBER(SEARCH($AK$420,'Hide this - Workings'!D154)),1,0),\"\")","v":""},{"$f":"IF($AL$421=1,IF(ISNUMBER(SEARCH($AK$421,'Hide this - Workings'!D154)),1,0),\"\")","v":""},{"$f":"IF($AL$422=1,IF(ISNUMBER(SEARCH($AK$422,'Hide this - Workings'!D154)),1,0),\"\")","v":""},{"$f":"IF($AL$423=1,IF(ISNUMBER(SEARCH($AK$423,'Hide this - Workings'!D154)),1,0),\"\")","v":""},{"$f":"IF($AL$424=1,IF(ISNUMBER(SEARCH($AK$424,'Hide this - Workings'!D154)),1,0),\"\")","v":""},{"$f":"IF($AL$425=1,IF(ISNUMBER(SEARCH($AK$425,'Hide this - Workings'!D154)),1,0),\"\")","v":""},{"$f":"IF($AL$426=1,IF(ISNUMBER(SEARCH($AK$426,'Hide this - Workings'!D154)),1,0),\"\")","v":""},{"$f":"IF($AL$427=1,IF(ISNUMBER(SEARCH($AK$427,'Hide this - Workings'!D154)),1,0),\"\")","v":""},{"$f":"IF($AL$428=1,IF(ISNUMBER(SEARCH($AK$428,'Hide this - Workings'!D154)),1,0),\"\")","v":""},{"$f":"IF($AL$429=1,IF(ISNUMBER(SEARCH($AK$429,'Hide this - Workings'!D154)),1,0),\"\")","v":""},{"$f":"IF($AL$430=1,IF(ISNUMBER(SEARCH($AK$430,'Hide this - Workings'!D154)),1,0),\"\")","v":""},{"$f":"IF($AL$431=1,IF(ISNUMBER(SEARCH($AK$431,'Hide this - Workings'!D154)),1,0),\"\")","v":""},{"$f":"IF($AL$432=1,IF(ISNUMBER(SEARCH($AK$432,'Hide this - Workings'!D154)),1,0),\"\")","v":""},{"$f":"IF($AL$433=1,IF(ISNUMBER(SEARCH($AK$433,'Hide this - Workings'!D154)),1,0),\"\")","v":""},0,"A150",0,0,0,0]
[null,null,null,null,null,null,null,null,null,null,null,null,null,{"$f":"IF($AL$417=1,IF(ISNUMBER(SEARCH($AK$417,'Hide this - Workings'!D155)),1,0),\"\")","v":""},{"$f":"IF($AL$418=1,IF(ISNUMBER(SEARCH($AK$418,'Hide this - Workings'!D155)),1,0),\"\")","v":""},{"$f":"IF($AL$419=1,IF(ISNUMBER(SEARCH($AK$419,'Hide this - Workings'!D155)),1,0),\"\")","v":""},{"$f":"IF($AL$420=1,IF(ISNUMBER(SEARCH($AK$420,'Hide this - Workings'!D155)),1,0),\"\")","v":""},{"$f":"IF($AL$421=1,IF(ISNUMBER(SEARCH($AK$421,'Hide this - Workings'!D155)),1,0),\"\")","v":""},{"$f":"IF($AL$422=1,IF(ISNUMBER(SEARCH($AK$422,'Hide this - Workings'!D155)),1,0),\"\")","v":""},{"$f":"IF($AL$423=1,IF(ISNUMBER(SEARCH($AK$423,'Hide this - Workings'!D155)),1,0),\"\")","v":""},{"$f":"IF($AL$424=1,IF(ISNUMBER(SEARCH($AK$424,'Hide this - Workings'!D155)),1,0),\"\")","v":""},{"$f":"IF($AL$425=1,IF(ISNUMBER(SEARCH($AK$425,'Hide this - Workings'!D155)),1,0),\"\")","v":""},{"$f":"IF($AL$426=1,IF(ISNUMBER(SEARCH($AK$426,'Hide this - Workings'!D155)),1,0),\"\")","v":""},{"$f":"IF($AL$427=1,IF(ISNUMBER(SEARCH($AK$427,'Hide this - Workings'!D155)),1,0),\"\")","v":""},{"$f":"IF($AL$428=1,IF(ISNUMBER(SEARCH($AK$428,'Hide this - Workings'!D155)),1,0),\"\")","v":""},{"$f":"IF($AL$429=1,IF(ISNUMBER(SEARCH($AK$429,'Hide this - Workings'!D155)),1,0),\"\")","v":""},{"$f":"IF($AL$430=1,IF(ISNUMBER(SEARCH($AK$430,'Hide this - Workings'!D155)),1,0),\"\")","v":""},{"$f":"IF($AL$431=1,IF(ISNUMBER(SEARCH($AK$431,'Hide this - Workings'!D155)),1,0),\"\")","v":""},{"$f":"IF($AL$432=1,IF(ISNUMBER(SEARCH($AK$432,'Hide this - Workings'!D155)),1,0),\"\")","v":""},{"$f":"IF($AL$433=1,IF(ISNUMBER(SEARCH($AK$433,'Hide this - Workings'!D155)),1,0),\"\")","v":""},0,"A151",0,0,0,0]
[null,null,null,null,null,null,null,null,null,null,null,null,null,{"$f":"IF($AL$417=1,IF(ISNUMBER(SEARCH($AK$417,'Hide this - Workings'!D156)),1,0),\"\")","v":""},{"$f":"IF($AL$418=1,IF(ISNUMBER(SEARCH($AK$418,'Hide this - Workings'!D156)),1,0),\"\")","v":""},{"$f":"IF($AL$419=1,IF(ISNUMBER(SEARCH($AK$419,'Hide this - Workings'!D156)),1,0),\"\")","v":""},{"$f":"IF($AL$420=1,IF(ISNUMBER(SEARCH($AK$420,'Hide this - Workings'!D156)),1,0),\"\")","v":""},{"$f":"IF($AL$421=1,IF(ISNUMBER(SEARCH($AK$421,'Hide this - Workings'!D156)),1,0),\"\")","v":""},{"$f":"IF($AL$422=1,IF(ISNUMBER(SEARCH($AK$422,'Hide this - Workings'!D156)),1,0),\"\")","v":""},{"$f":"IF($AL$423=1,IF(ISNUMBER(SEARCH($AK$423,'Hide this - Workings'!D156)),1,0),\"\")","v":""},{"$f":"IF($AL$424=1,IF(ISNUMBER(SEARCH($AK$424,'Hide this - Workings'!D156)),1,0),\"\")","v":""},{"$f":"IF($AL$425=1,IF(ISNUMBER(SEARCH($AK$425,'Hide this - Workings'!D156)),1,0),\"\")","v":""},{"$f":"IF($AL$426=1,IF(ISNUMBER(SEARCH($AK$426,'Hide this - Workings'!D156)),1,0),\"\")","v":""},{"$f":"IF($AL$427=1,IF(ISNUMBER(SEARCH($AK$427,'Hide this - Workings'!D156)),1,0),\"\")","v":""},{"$f":"IF($AL$428=1,IF(ISNUMBER(SEARCH($AK$428,'Hide this - Workings'!D156)),1,0),\"\")","v":""},{"$f":"IF($AL$429=1,IF(ISNUMBER(SEARCH($AK$429,'Hide this - Workings'!D156)),1,0),\"\")","v":""},{"$f":"IF($AL$430=1,IF(ISNUMBER(SEARCH($AK$430,'Hide this - Workings'!D156)),1,0),\"\")","v":""},{"$f":"IF($AL$431=1,IF(ISNUMBER(SEARCH($AK$431,'Hide this - Workings'!D156)),1,0),\"\")","v":""},{"$f":"IF($AL$432=1,IF(ISNUMBER(SEARCH($AK$432,'Hide this - Workings'!D156)),1,0),\"\")","v":""},{"$f":"IF($AL$433=1,IF(ISNUMBER(SEARCH($AK$433,'Hide this - Workings'!D156)),1,0),\"\")","v":""},0,"A152",0,0,0,0]
[null,null,null,null,null,null,null,null,null,null,null,null,null,{"$f":"IF($AL$417=1,IF(ISNUMBER(SEARCH($AK$417,'Hide this - Workings'!D157)),1,0),\"\")","v":""},{"$f":"IF($AL$418=1,IF(ISNUMBER(SEARCH($AK$418,'Hide this - Workings'!D157)),1,0),\"\")","v":""},{"$f":"IF($AL$419=1,IF(ISNUMBER(SEARCH($AK$419,'Hide this - Workings'!D157)),1,0),\"\")","v":""},{"$f":"IF($AL$420=1,IF(ISNUMBER(SEARCH($AK$420,'Hide this - Workings'!D157)),1,0),\"\")","v":""},{"$f":"IF($AL$421=1,IF(ISNUMBER(SEARCH($AK$421,'Hide this - Workings'!D157)),1,0),\"\")","v":""},{"$f":"IF($AL$422=1,IF(ISNUMBER(SEARCH($AK$422,'Hide this - Workings'!D157)),1,0),\"\")","v":""},{"$f":"IF($AL$423=1,IF(ISNUMBER(SEARCH($AK$423,'Hide this - Workings'!D157)),1,0),\"\")","v":""},{"$f":"IF($AL$424=1,IF(ISNUMBER(SEARCH($AK$424,'Hide this - Workings'!D157)),1,0),\"\")","v":""},{"$f":"IF($AL$425=1,IF(ISNUMBER(SEARCH($AK$425,'Hide this - Workings'!D157)),1,0),\"\")","v":""},{"$f":"IF($AL$426=1,IF(ISNUMBER(SEARCH($AK$426,'Hide this - Workings'!D157)),1,0),\"\")","v":""},{"$f":"IF($AL$427=1,IF(ISNUMBER(SEARCH($AK$427,'Hide this - Workings'!D157)),1,0),\"\")","v":""},{"$f":"IF($AL$428=1,IF(ISNUMBER(SEARCH($AK$428,'Hide this - Workings'!D157)),1,0),\"\")","v":""},{"$f":"IF($AL$429=1,IF(ISNUMBER(SEARCH($AK$429,'Hide this - Workings'!D157)),1,0),\"\")","v":""},{"$f":"IF($AL$430=1,IF(ISNUMBER(SEARCH($AK$430,'Hide this - Workings'!D157)),1,0),\"\")","v":""},{"$f":"IF($AL$431=1,IF(ISNUMBER(SEARCH($AK$431,'Hide this - Workings'!D157)),1,0),\"\")","v":""},{"$f":"IF($AL$432=1,IF(ISNUMBER(SEARCH($AK$432,'Hide this - Workings'!D157)),1,0),\"\")","v":""},{"$f":"IF($AL$433=1,IF(ISNUMBER(SEARCH($AK$433,'Hide this - Workings'!D157)),1,0),\"\")","v":""},0,"A153",0,0,0,0]
[null,null,null,null,null,null,null,null,null,null,null,null,null,{"$f":"IF($AL$417=1,IF(ISNUMBER(SEARCH($AK$417,'Hide this - Workings'!D158)),1,0),\"\")","v":""},{"$f":"IF($AL$418=1,IF(ISNUMBER(SEARCH($AK$418,'Hide this - Workings'!D158)),1,0),\"\")","v":""},{"$f":"IF($AL$419=1,IF(ISNUMBER(SEARCH($AK$419,'Hide this - Workings'!D158)),1,0),\"\")","v":""},{"$f":"IF($AL$420=1,IF(ISNUMBER(SEARCH($AK$420,'Hide this - Workings'!D158)),1,0),\"\")","v":""},{"$f":"IF($AL$421=1,IF(ISNUMBER(SEARCH($AK$421,'Hide this - Workings'!D158)),1,0),\"\")","v":""},{"$f":"IF($AL$422=1,IF(ISNUMBER(SEARCH($AK$422,'Hide this - Workings'!D158)),1,0),\"\")","v":""},{"$f":"IF($AL$423=1,IF(ISNUMBER(SEARCH($AK$423,'Hide this - Workings'!D158)),1,0),\"\")","v":""},{"$f":"IF($AL$424=1,IF(ISNUMBER(SEARCH($AK$424,'Hide this - Workings'!D158)),1,0),\"\")","v":""},{"$f":"IF($AL$425=1,IF(ISNUMBER(SEARCH($AK$425,'Hide this - Workings'!D158)),1,0),\"\")","v":""},{"$f":"IF($AL$426=1,IF(ISNUMBER(SEARCH($AK$426,'Hide this - Workings'!D158)),1,0),\"\")","v":""},{"$f":"IF($AL$427=1,IF(ISNUMBER(SEARCH($AK$427,'Hide this - Workings'!D158)),1,0),\"\")","v":""},{"$f":"IF($AL$428=1,IF(ISNUMBER(SEARCH($AK$428,'Hide this - Workings'!D158)),1,0),\"\")","v":""},{"$f":"IF($AL$429=1,IF(ISNUMBER(SEARCH($AK$429,'Hide this - Workings'!D158)),1,0),\"\")","v":""},{"$f":"IF($AL$430=1,IF(ISNUMBER(SEARCH($AK$430,'Hide this - Workings'!D158)),1,0),\"\")","v":""},{"$f":"IF($AL$431=1,IF(ISNUMBER(SEARCH($AK$431,'Hide this - Workings'!D158)),1,0),\"\")","v":""},{"$f":"IF($AL$432=1,IF(ISNUMBER(SEARCH($AK$432,'Hide this - Workings'!D158)),1,0),\"\")","v":""},{"$f":"IF($AL$433=1,IF(ISNUMBER(SEARCH($AK$433,'Hide this - Workings'!D158)),1,0),\"\")","v":""},0,"A154",0,0,0,0]
[null,null,null,null,null,null,null,null,null,null,null,null,null,{"$f":"IF($AL$417=1,IF(ISNUMBER(SEARCH($AK$417,'Hide this - Workings'!D159)),1,0),\"\")","v":""},{"$f":"IF($AL$418=1,IF(ISNUMBER(SEARCH($AK$418,'Hide this - Workings'!D159)),1,0),\"\")","v":""},{"$f":"IF($AL$419=1,IF(ISNUMBER(SEARCH($AK$419,'Hide this - Workings'!D159)),1,0),\"\")","v":""},{"$f":"IF($AL$420=1,IF(ISNUMBER(SEARCH($AK$420,'Hide this - Workings'!D159)),1,0),\"\")","v":""},{"$f":"IF($AL$421=1,IF(ISNUMBER(SEARCH($AK$421,'Hide this - Workings'!D159)),1,0),\"\")","v":""},{"$f":"IF($AL$422=1,IF(ISNUMBER(SEARCH($AK$422,'Hide this - Workings'!D159)),1,0),\"\")","v":""},{"$f":"IF($AL$423=1,IF(ISNUMBER(SEARCH($AK$423,'Hide this - Workings'!D159)),1,0),\"\")","v":""},{"$f":"IF($AL$424=1,IF(ISNUMBER(SEARCH($AK$424,'Hide this - Workings'!D159)),1,0),\"\")","v":""},{"$f":"IF($AL$425=1,IF(ISNUMBER(SEARCH($AK$425,'Hide this - Workings'!D159)),1,0),\"\")","v":""},{"$f":"IF($AL$426=1,IF(ISNUMBER(SEARCH($AK$426,'Hide this - Workings'!D159)),1,0),\"\")","v":""},{"$f":"IF($AL$427=1,IF(ISNUMBER(SEARCH($AK$427,'Hide this - Workings'!D159)),1,0),\"\")","v":""},{"$f":"IF($AL$428=1,IF(ISNUMBER(SEARCH($AK$428,'Hide this - Workings'!D159)),1,0),\"\")","v":""},{"$f":"IF($AL$429=1,IF(ISNUMBER(SEARCH($AK$429,'Hide this - Workings'!D159)),1,0),\"\")","v":""},{"$f":"IF($AL$430=1,IF(ISNUMBER(SEARCH($AK$430,'Hide this - Workings'!D159)),1,0),\"\")","v":""},{"$f":"IF($AL$431=1,IF(ISNUMBER(SEARCH($AK$431,'Hide this - Workings'!D159)),1,0),\"\")","v":""},{"$f":"IF($AL$432=1,IF(ISNUMBER(SEARCH($AK$432,'Hide this - Workings'!D159)),1,0),\"\")","v":""},{"$f":"IF($AL$433=1,IF(ISNUMBER(SEARCH($AK$433,'Hide this - Workings'!D159)),1,0),\"\")","v":""},0,"A155",0,0,0,0]
[null,null,null,null,null,null,null,null,null,null,null,null,null,{"$f":"IF($AL$417=1,IF(ISNUMBER(SEARCH($AK$417,'Hide this - Workings'!D160)),1,0),\"\")","v":""},{"$f":"IF($AL$418=1,IF(ISNUMBER(SEARCH($AK$418,'Hide this - Workings'!D160)),1,0),\"\")","v":""},{"$f":"IF($AL$419=1,IF(ISNUMBER(SEARCH($AK$419,'Hide this - Workings'!D160)),1,0),\"\")","v":""},{"$f":"IF($AL$420=1,IF(ISNUMBER(SEARCH($AK$420,'Hide this - Workings'!D160)),1,0),\"\")","v":""},{"$f":"IF($AL$421=1,IF(ISNUMBER(SEARCH($AK$421,'Hide this - Workings'!D160)),1,0),\"\")","v":""},{"$f":"IF($AL$422=1,IF(ISNUMBER(SEARCH($AK$422,'Hide this - Workings'!D160)),1,0),\"\")","v":""},{"$f":"IF($AL$423=1,IF(ISNUMBER(SEARCH($AK$423,'Hide this - Workings'!D160)),1,0),\"\")","v":""},{"$f":"IF($AL$424=1,IF(ISNUMBER(SEARCH($AK$424,'Hide this - Workings'!D160)),1,0),\"\")","v":""},{"$f":"IF($AL$425=1,IF(ISNUMBER(SEARCH($AK$425,'Hide this - Workings'!D160)),1,0),\"\")","v":""},{"$f":"IF($AL$426=1,IF(ISNUMBER(SEARCH($AK$426,'Hide this - Workings'!D160)),1,0),\"\")","v":""},{"$f":"IF($AL$427=1,IF(ISNUMBER(SEARCH($AK$427,'Hide this - Workings'!D160)),1,0),\"\")","v":""},{"$f":"IF($AL$428=1,IF(ISNUMBER(SEARCH($AK$428,'Hide this - Workings'!D160)),1,0),\"\")","v":""},{"$f":"IF($AL$429=1,IF(ISNUMBER(SEARCH($AK$429,'Hide this - Workings'!D160)),1,0),\"\")","v":""},{"$f":"IF($AL$430=1,IF(ISNUMBER(SEARCH($AK$430,'Hide this - Workings'!D160)),1,0),\"\")","v":""},{"$f":"IF($AL$431=1,IF(ISNUMBER(SEARCH($AK$431,'Hide this - Workings'!D160)),1,0),\"\")","v":""},{"$f":"IF($AL$432=1,IF(ISNUMBER(SEARCH($AK$432,'Hide this - Workings'!D160)),1,0),\"\")","v":""},{"$f":"IF($AL$433=1,IF(ISNUMBER(SEARCH($AK$433,'Hide this - Workings'!D160)),1,0),\"\")","v":""},{"$f":"SUM(N160:AD160)","v":0},"A156",{"$f":"AE160","v":0},0,0,0]
[null,null,null,null,null,null,null,null,null,null,null,null,null,{"$f":"IF($AL$417=1,IF(ISNUMBER(SEARCH($AK$417,'Hide this - Workings'!D161)),1,0),\"\")","v":""},{"$f":"IF($AL$418=1,IF(ISNUMBER(SEARCH($AK$418,'Hide this - Workings'!D161)),1,0),\"\")","v":""},{"$f":"IF($AL$419=1,IF(ISNUMBER(SEARCH($AK$419,'Hide this - Workings'!D161)),1,0),\"\")","v":""},{"$f":"IF($AL$420=1,IF(ISNUMBER(SEARCH($AK$420,'Hide this - Workings'!D161)),1,0),\"\")","v":""},{"$f":"IF($AL$421=1,IF(ISNUMBER(SEARCH($AK$421,'Hide this - Workings'!D161)),1,0),\"\")","v":""},{"$f":"IF($AL$422=1,IF(ISNUMBER(SEARCH($AK$422,'Hide this - Workings'!D161)),1,0),\"\")","v":""},{"$f":"IF($AL$423=1,IF(ISNUMBER(SEARCH($AK$423,'Hide this - Workings'!D161)),1,0),\"\")","v":""},{"$f":"IF($AL$424=1,IF(ISNUMBER(SEARCH($AK$424,'Hide this - Workings'!D161)),1,0),\"\")","v":""},{"$f":"IF($AL$425=1,IF(ISNUMBER(SEARCH($AK$425,'Hide this - Workings'!D161)),1,0),\"\")","v":""},{"$f":"IF($AL$426=1,IF(ISNUMBER(SEARCH($AK$426,'Hide this - Workings'!D161)),1,0),\"\")","v":""},{"$f":"IF($AL$427=1,IF(ISNUMBER(SEARCH($AK$427,'Hide this - Workings'!D161)),1,0),\"\")","v":""},{"$f":"IF($AL$428=1,IF(ISNUMBER(SEARCH($AK$428,'Hide this - Workings'!D161)),1,0),\"\")","v":""},{"$f":"IF($AL$429=1,IF(ISNUMBER(SEARCH($AK$429,'Hide this - Workings'!D161)),1,0),\"\")","v":""},{"$f":"IF($AL$430=1,IF(ISNUMBER(SEARCH($AK$430,'Hide this - Workings'!D161)),1,0),\"\")","v":""},{"$f":"IF($AL$431=1,IF(ISNUMBER(SEARCH($AK$431,'Hide this - Workings'!D161)),1,0),\"\")","v":""},{"$f":"IF($AL$432=1,IF(ISNUMBER(SEARCH($AK$432,'Hide this - Workings'!D161)),1,0),\"\")","v":""},{"$f":"IF($AL$433=1,IF(ISNUMBER(SEARCH($AK$433,'Hide this - Workings'!D161)),1,0),\"\")","v":""},0,"A157",0,0,0,0]
[null,null,null,null,null,null,null,null,null,null,null,null,null,{"$f":"IF($AL$417=1,IF(ISNUMBER(SEARCH($AK$417,'Hide this - Workings'!D162)),1,0),\"\")","v":""},{"$f":"IF($AL$418=1,IF(ISNUMBER(SEARCH($AK$418,'Hide this - Workings'!D162)),1,0),\"\")","v":""},{"$f":"IF($AL$419=1,IF(ISNUMBER(SEARCH($AK$419,'Hide this - Workings'!D162)),1,0),\"\")","v":""},{"$f":"IF($AL$420=1,IF(ISNUMBER(SEARCH($AK$420,'Hide this - Workings'!D162)),1,0),\"\")","v":""},{"$f":"IF($AL$421=1,IF(ISNUMBER(SEARCH($AK$421,'Hide this - Workings'!D162)),1,0),\"\")","v":""},{"$f":"IF($AL$422=1,IF(ISNUMBER(SEARCH($AK$422,'Hide this - Workings'!D162)),1,0),\"\")","v":""},{"$f":"IF($AL$423=1,IF(ISNUMBER(SEARCH($AK$423,'Hide this - Workings'!D162)),1,0),\"\")","v":""},{"$f":"IF($AL$424=1,IF(ISNUMBER(SEARCH($AK$424,'Hide this - Workings'!D162)),1,0),\"\")","v":""},{"$f":"IF($AL$425=1,IF(ISNUMBER(SEARCH($AK$425,'Hide this - Workings'!D162)),1,0),\"\")","v":""},{"$f":"IF($AL$426=1,IF(ISNUMBER(SEARCH($AK$426,'Hide this - Workings'!D162)),1,0),\"\")","v":""},{"$f":"IF($AL$427=1,IF(ISNUMBER(SEARCH($AK$427,'Hide this - Workings'!D162)),1,0),\"\")","v":""},{"$f":"IF($AL$428=1,IF(ISNUMBER(SEARCH($AK$428,'Hide this - Workings'!D162)),1,0),\"\")","v":""},{"$f":"IF($AL$429=1,IF(ISNUMBER(SEARCH($AK$429,'Hide this - Workings'!D162)),1,0),\"\")","v":""},{"$f":"IF($AL$430=1,IF(ISNUMBER(SEARCH($AK$430,'Hide this - Workings'!D162)),1,0),\"\")","v":""},{"$f":"IF($AL$431=1,IF(ISNUMBER(SEARCH($AK$431,'Hide this - Workings'!D162)),1,0),\"\")","v":""},{"$f":"IF($AL$432=1,IF(ISNUMBER(SEARCH($AK$432,'Hide this - Workings'!D162)),1,0),\"\")","v":""},{"$f":"IF($AL$433=1,IF(ISNUMBER(SEARCH($AK$433,'Hide this - Workings'!D162)),1,0),\"\")","v":""},0,"A158",0,0,0,0]
[null,null,null,null,null,null,null,null,null,null,null,null,null,{"$f":"IF($AL$417=1,IF(ISNUMBER(SEARCH($AK$417,'Hide this - Workings'!D163)),1,0),\"\")","v":""},{"$f":"IF($AL$418=1,IF(ISNUMBER(SEARCH($AK$418,'Hide this - Workings'!D163)),1,0),\"\")","v":""},{"$f":"IF($AL$419=1,IF(ISNUMBER(SEARCH($AK$419,'Hide this - Workings'!D163)),1,0),\"\")","v":""},{"$f":"IF($AL$420=1,IF(ISNUMBER(SEARCH($AK$420,'Hide this - Workings'!D163)),1,0),\"\")","v":""},{"$f":"IF($AL$421=1,IF(ISNUMBER(SEARCH($AK$421,'Hide this - Workings'!D163)),1,0),\"\")","v":""},{"$f":"IF($AL$422=1,IF(ISNUMBER(SEARCH($AK$422,'Hide this - Workings'!D163)),1,0),\"\")","v":""},{"$f":"IF($AL$423=1,IF(ISNUMBER(SEARCH($AK$423,'Hide this - Workings'!D163)),1,0),\"\")","v":""},{"$f":"IF($AL$424=1,IF(ISNUMBER(SEARCH($AK$424,'Hide this - Workings'!D163)),1,0),\"\")","v":""},{"$f":"IF($AL$425=1,IF(ISNUMBER(SEARCH($AK$425,'Hide this - Workings'!D163)),1,0),\"\")","v":""},{"$f":"IF($AL$426=1,IF(ISNUMBER(SEARCH($AK$426,'Hide this - Workings'!D163)),1,0),\"\")","v":""},{"$f":"IF($AL$427=1,IF(ISNUMBER(SEARCH($AK$427,'Hide this - Workings'!D163)),1,0),\"\")","v":""},{"$f":"IF($AL$428=1,IF(ISNUMBER(SEARCH($AK$428,'Hide this - Workings'!D163)),1,0),\"\")","v":""},{"$f":"IF($AL$429=1,IF(ISNUMBER(SEARCH($AK$429,'Hide this - Workings'!D163)),1,0),\"\")","v":""},{"$f":"IF($AL$430=1,IF(ISNUMBER(SEARCH($AK$430,'Hide this - Workings'!D163)),1,0),\"\")","v":""},{"$f":"IF($AL$431=1,IF(ISNUMBER(SEARCH($AK$431,'Hide this - Workings'!D163)),1,0),\"\")","v":""},{"$f":"IF($AL$432=1,IF(ISNUMBER(SEARCH($AK$432,'Hide this - Workings'!D163)),1,0),\"\")","v":""},{"$f":"IF($AL$433=1,IF(ISNUMBER(SEARCH($AK$433,'Hide this - Workings'!D163)),1,0),\"\")","v":""},0,"A159",0,{"$f":"IF((IFERROR(N163,0))>1,D163,\"\")","v":0},{"$f":"IF((IFERROR(N163,0))>1,L163,\"\")","v":0},{"$f":"IF((IFERROR(N163,0))>1,M163,\"\")","v":0}]
[null,null,null,null,null,null,null,null,null,null,null,null,null,{"$f":"IF($AL$417=1,IF(ISNUMBER(SEARCH($AK$417,'Hide this - Workings'!D164)),1,0),\"\")","v":""},{"$f":"IF($AL$418=1,IF(ISNUMBER(SEARCH($AK$418,'Hide this - Workings'!D164)),1,0),\"\")","v":""},{"$f":"IF($AL$419=1,IF(ISNUMBER(SEARCH($AK$419,'Hide this - Workings'!D164)),1,0),\"\")","v":""},{"$f":"IF($AL$420=1,IF(ISNUMBER(SEARCH($AK$420,'Hide this - Workings'!D164)),1,0),\"\")","v":""},{"$f":"IF($AL$421=1,IF(ISNUMBER(SEARCH($AK$421,'Hide this - Workings'!D164)),1,0),\"\")","v":""},{"$f":"IF($AL$422=1,IF(ISNUMBER(SEARCH($AK$422,'Hide this - Workings'!D164)),1,0),\"\")","v":""},{"$f":"IF($AL$423=1,IF(ISNUMBER(SEARCH($AK$423,'Hide this - Workings'!D164)),1,0),\"\")","v":""},{"$f":"IF($AL$424=1,IF(ISNUMBER(SEARCH($AK$424,'Hide this - Workings'!D164)),1,0),\"\")","v":""},{"$f":"IF($AL$425=1,IF(ISNUMBER(SEARCH($AK$425,'Hide this - Workings'!D164)),1,0),\"\")","v":""},{"$f":"IF($AL$426=1,IF(ISNUMBER(SEARCH($AK$426,'Hide this - Workings'!D164)),1,0),\"\")","v":""},{"$f":"IF($AL$427=1,IF(ISNUMBER(SEARCH($AK$427,'Hide this - Workings'!D164)),1,0),\"\")","v":""},{"$f":"IF($AL$428=1,IF(ISNUMBER(SEARCH($AK$428,'Hide this - Workings'!D164)),1,0),\"\")","v":""},{"$f":"IF($AL$429=1,IF(ISNUMBER(SEARCH($AK$429,'Hide this - Workings'!D164)),1,0),\"\")","v":""},{"$f":"IF($AL$430=1,IF(ISNUMBER(SEARCH($AK$430,'Hide this - Workings'!D164)),1,0),\"\")","v":""},{"$f":"IF($AL$431=1,IF(ISNUMBER(SEARCH($AK$431,'Hide this - Workings'!D164)),1,0),\"\")","v":""},{"$f":"IF($AL$432=1,IF(ISNUMBER(SEARCH($AK$432,'Hide this - Workings'!D164)),1,0),\"\")","v":""},{"$f":"IF($AL$433=1,IF(ISNUMBER(SEARCH($AK$433,'Hide this - Workings'!D164)),1,0),\"\")","v":""},0,"A160",0,0,0,0]
[null,null,null,null,null,null,null,null,null,null,null,null,null,{"$f":"IF($AL$417=1,IF(ISNUMBER(SEARCH($AK$417,'Hide this - Workings'!D165)),1,0),\"\")","v":""},{"$f":"IF($AL$418=1,IF(ISNUMBER(SEARCH($AK$418,'Hide this - Workings'!D165)),1,0),\"\")","v":""},{"$f":"IF($AL$419=1,IF(ISNUMBER(SEARCH($AK$419,'Hide this - Workings'!D165)),1,0),\"\")","v":""},{"$f":"IF($AL$420=1,IF(ISNUMBER(SEARCH($AK$420,'Hide this - Workings'!D165)),1,0),\"\")","v":""},{"$f":"IF($AL$421=1,IF(ISNUMBER(SEARCH($AK$421,'Hide this - Workings'!D165)),1,0),\"\")","v":""},{"$f":"IF($AL$422=1,IF(ISNUMBER(SEARCH($AK$422,'Hide this - Workings'!D165)),1,0),\"\")","v":""},{"$f":"IF($AL$423=1,IF(ISNUMBER(SEARCH($AK$423,'Hide this - Workings'!D165)),1,0),\"\")","v":""},{"$f":"IF($AL$424=1,IF(ISNUMBER(SEARCH($AK$424,'Hide this - Workings'!D165)),1,0),\"\")","v":""},{"$f":"IF($AL$425=1,IF(ISNUMBER(SEARCH($AK$425,'Hide this - Workings'!D165)),1,0),\"\")","v":""},{"$f":"IF($AL$426=1,IF(ISNUMBER(SEARCH($AK$426,'Hide this - Workings'!D165)),1,0),\"\")","v":""},{"$f":"IF($AL$427=1,IF(ISNUMBER(SEARCH($AK$427,'Hide this - Workings'!D165)),1,0),\"\")","v":""},{"$f":"IF($AL$428=1,IF(ISNUMBER(SEARCH($AK$428,'Hide this - Workings'!D165)),1,0),\"\")","v":""},{"$f":"IF($AL$429=1,IF(ISNUMBER(SEARCH($AK$429,'Hide this - Workings'!D165)),1,0),\"\")","v":""},{"$f":"IF($AL$430=1,IF(ISNUMBER(SEARCH($AK$430,'Hide this - Workings'!D165)),1,0),\"\")","v":""},{"$f":"IF($AL$431=1,IF(ISNUMBER(SEARCH($AK$431,'Hide this - Workings'!D165)),1,0),\"\")","v":""},{"$f":"IF($AL$432=1,IF(ISNUMBER(SEARCH($AK$432,'Hide this - Workings'!D165)),1,0),\"\")","v":""},{"$f":"IF($AL$433=1,IF(ISNUMBER(SEARCH($AK$433,'Hide this - Workings'!D165)),1,0),\"\")","v":""},0,"A161",0,0,0,0]
[null,null,null,null,null,null,null,null,null,null,null,null,null,{"$f":"IF($AL$417=1,IF(ISNUMBER(SEARCH($AK$417,'Hide this - Workings'!D166)),1,0),\"\")","v":""},{"$f":"IF($AL$418=1,IF(ISNUMBER(SEARCH($AK$418,'Hide this - Workings'!D166)),1,0),\"\")","v":""},{"$f":"IF($AL$419=1,IF(ISNUMBER(SEARCH($AK$419,'Hide this - Workings'!D166)),1,0),\"\")","v":""},{"$f":"IF($AL$420=1,IF(ISNUMBER(SEARCH($AK$420,'Hide this - Workings'!D166)),1,0),\"\")","v":""},{"$f":"IF($AL$421=1,IF(ISNUMBER(SEARCH($AK$421,'Hide this - Workings'!D166)),1,0),\"\")","v":""},{"$f":"IF($AL$422=1,IF(ISNUMBER(SEARCH($AK$422,'Hide this - Workings'!D166)),1,0),\"\")","v":""},{"$f":"IF($AL$423=1,IF(ISNUMBER(SEARCH($AK$423,'Hide this - Workings'!D166)),1,0),\"\")","v":""},{"$f":"IF($AL$424=1,IF(ISNUMBER(SEARCH($AK$424,'Hide this - Workings'!D166)),1,0),\"\")","v":""},{"$f":"IF($AL$425=1,IF(ISNUMBER(SEARCH($AK$425,'Hide this - Workings'!D166)),1,0),\"\")","v":""},{"$f":"IF($AL$426=1,IF(ISNUMBER(SEARCH($AK$426,'Hide this - Workings'!D166)),1,0),\"\")","v":""},{"$f":"IF($AL$427=1,IF(ISNUMBER(SEARCH($AK$427,'Hide this - Workings'!D166)),1,0),\"\")","v":""},{"$f":"IF($AL$428=1,IF(ISNUMBER(SEARCH($AK$428,'Hide this - Workings'!D166)),1,0),\"\")","v":""},{"$f":"IF($AL$429=1,IF(ISNUMBER(SEARCH($AK$429,'Hide this - Workings'!D166)),1,0),\"\")","v":""},{"$f":"IF($AL$430=1,IF(ISNUMBER(SEARCH($AK$430,'Hide this - Workings'!D166)),1,0),\"\")","v":""},{"$f":"IF($AL$431=1,IF(ISNUMBER(SEARCH($AK$431,'Hide this - Workings'!D166)),1,0),\"\")","v":""},{"$f":"IF($AL$432=1,IF(ISNUMBER(SEARCH($AK$432,'Hide this - Workings'!D166)),1,0),\"\")","v":""},{"$f":"IF($AL$433=1,IF(ISNUMBER(SEARCH($AK$433,'Hide this - Workings'!D166)),1,0),\"\")","v":""},0,"A162",0,0,0,0]
[null,null,null,null,null,null,null,null,null,null,null,null,null,{"$f":"IF($AL$417=1,IF(ISNUMBER(SEARCH($AK$417,'Hide this - Workings'!D167)),1,0),\"\")","v":""},{"$f":"IF($AL$418=1,IF(ISNUMBER(SEARCH($AK$418,'Hide this - Workings'!D167)),1,0),\"\")","v":""},{"$f":"IF($AL$419=1,IF(ISNUMBER(SEARCH($AK$419,'Hide this - Workings'!D167)),1,0),\"\")","v":""},{"$f":"IF($AL$420=1,IF(ISNUMBER(SEARCH($AK$420,'Hide this - Workings'!D167)),1,0),\"\")","v":""},{"$f":"IF($AL$421=1,IF(ISNUMBER(SEARCH($AK$421,'Hide this - Workings'!D167)),1,0),\"\")","v":""},{"$f":"IF($AL$422=1,IF(ISNUMBER(SEARCH($AK$422,'Hide this - Workings'!D167)),1,0),\"\")","v":""},{"$f":"IF($AL$423=1,IF(ISNUMBER(SEARCH($AK$423,'Hide this - Workings'!D167)),1,0),\"\")","v":""},{"$f":"IF($AL$424=1,IF(ISNUMBER(SEARCH($AK$424,'Hide this - Workings'!D167)),1,0),\"\")","v":""},{"$f":"IF($AL$425=1,IF(ISNUMBER(SEARCH($AK$425,'Hide this - Workings'!D167)),1,0),\"\")","v":""},{"$f":"IF($AL$426=1,IF(ISNUMBER(SEARCH($AK$426,'Hide this - Workings'!D167)),1,0),\"\")","v":""},{"$f":"IF($AL$427=1,IF(ISNUMBER(SEARCH($AK$427,'Hide this - Workings'!D167)),1,0),\"\")","v":""},{"$f":"IF($AL$428=1,IF(ISNUMBER(SEARCH($AK$428,'Hide this - Workings'!D167)),1,0),\"\")","v":""},{"$f":"IF($AL$429=1,IF(ISNUMBER(SEARCH($AK$429,'Hide this - Workings'!D167)),1,0),\"\")","v":""},{"$f":"IF($AL$430=1,IF(ISNUMBER(SEARCH($AK$430,'Hide this - Workings'!D167)),1,0),\"\")","v":""},{"$f":"IF($AL$431=1,IF(ISNUMBER(SEARCH($AK$431,'Hide this - Workings'!D167)),1,0),\"\")","v":""},{"$f":"IF($AL$432=1,IF(ISNUMBER(SEARCH($AK$432,'Hide this - Workings'!D167)),1,0),\"\")","v":""},{"$f":"IF($AL$433=1,IF(ISNUMBER(SEARCH($AK$433,'Hide this - Workings'!D167)),1,0),\"\")","v":""},0,"A163",0,0,0,0]
[null,null,null,null,null,null,null,null,null,null,null,null,null,{"$f":"IF($AL$417=1,IF(ISNUMBER(SEARCH($AK$417,'Hide this - Workings'!D168)),1,0),\"\")","v":""},{"$f":"IF($AL$418=1,IF(ISNUMBER(SEARCH($AK$418,'Hide this - Workings'!D168)),1,0),\"\")","v":""},{"$f":"IF($AL$419=1,IF(ISNUMBER(SEARCH($AK$419,'Hide this - Workings'!D168)),1,0),\"\")","v":""},{"$f":"IF($AL$420=1,IF(ISNUMBER(SEARCH($AK$420,'Hide this - Workings'!D168)),1,0),\"\")","v":""},{"$f":"IF($AL$421=1,IF(ISNUMBER(SEARCH($AK$421,'Hide this - Workings'!D168)),1,0),\"\")","v":""},{"$f":"IF($AL$422=1,IF(ISNUMBER(SEARCH($AK$422,'Hide this - Workings'!D168)),1,0),\"\")","v":""},{"$f":"IF($AL$423=1,IF(ISNUMBER(SEARCH($AK$423,'Hide this - Workings'!D168)),1,0),\"\")","v":""},{"$f":"IF($AL$424=1,IF(ISNUMBER(SEARCH($AK$424,'Hide this - Workings'!D168)),1,0),\"\")","v":""},{"$f":"IF($AL$425=1,IF(ISNUMBER(SEARCH($AK$425,'Hide this - Workings'!D168)),1,0),\"\")","v":""},{"$f":"IF($AL$426=1,IF(ISNUMBER(SEARCH($AK$426,'Hide this - Workings'!D168)),1,0),\"\")","v":""},{"$f":"IF($AL$427=1,IF(ISNUMBER(SEARCH($AK$427,'Hide this - Workings'!D168)),1,0),\"\")","v":""},{"$f":"IF($AL$428=1,IF(ISNUMBER(SEARCH($AK$428,'Hide this - Workings'!D168)),1,0),\"\")","v":""},{"$f":"IF($AL$429=1,IF(ISNUMBER(SEARCH($AK$429,'Hide this - Workings'!D168)),1,0),\"\")","v":""},{"$f":"IF($AL$430=1,IF(ISNUMBER(SEARCH($AK$430,'Hide this - Workings'!D168)),1,0),\"\")","v":""},{"$f":"IF($AL$431=1,IF(ISNUMBER(SEARCH($AK$431,'Hide this - Workings'!D168)),1,0),\"\")","v":""},{"$f":"IF($AL$432=1,IF(ISNUMBER(SEARCH($AK$432,'Hide this - Workings'!D168)),1,0),\"\")","v":""},{"$f":"IF($AL$433=1,IF(ISNUMBER(SEARCH($AK$433,'Hide this - Workings'!D168)),1,0),\"\")","v":""},0,"A164",0,0,0,0]
[null,null,null,null,null,null,null,null,null,null,null,null,null,{"$f":"IF($AL$417=1,IF(ISNUMBER(SEARCH($AK$417,'Hide this - Workings'!D169)),1,0),\"\")","v":""},{"$f":"IF($AL$418=1,IF(ISNUMBER(SEARCH($AK$418,'Hide this - Workings'!D169)),1,0),\"\")","v":""},{"$f":"IF($AL$419=1,IF(ISNUMBER(SEARCH($AK$419,'Hide this - Workings'!D169)),1,0),\"\")","v":""},{"$f":"IF($AL$420=1,IF(ISNUMBER(SEARCH($AK$420,'Hide this - Workings'!D169)),1,0),\"\")","v":""},{"$f":"IF($AL$421=1,IF(ISNUMBER(SEARCH($AK$421,'Hide this - Workings'!D169)),1,0),\"\")","v":""},{"$f":"IF($AL$422=1,IF(ISNUMBER(SEARCH($AK$422,'Hide this - Workings'!D169)),1,0),\"\")","v":""},{"$f":"IF($AL$423=1,IF(ISNUMBER(SEARCH($AK$423,'Hide this - Workings'!D169)),1,0),\"\")","v":""},{"$f":"IF($AL$424=1,IF(ISNUMBER(SEARCH($AK$424,'Hide this - Workings'!D169)),1,0),\"\")","v":""},{"$f":"IF($AL$425=1,IF(ISNUMBER(SEARCH($AK$425,'Hide this - Workings'!D169)),1,0),\"\")","v":""},{"$f":"IF($AL$426=1,IF(ISNUMBER(SEARCH($AK$426,'Hide this - Workings'!D169)),1,0),\"\")","v":""},{"$f":"IF($AL$427=1,IF(ISNUMBER(SEARCH($AK$427,'Hide this - Workings'!D169)),1,0),\"\")","v":""},{"$f":"IF($AL$428=1,IF(ISNUMBER(SEARCH($AK$428,'Hide this - Workings'!D169)),1,0),\"\")","v":""},{"$f":"IF($AL$429=1,IF(ISNUMBER(SEARCH($AK$429,'Hide this - Workings'!D169)),1,0),\"\")","v":""},{"$f":"IF($AL$430=1,IF(ISNUMBER(SEARCH($AK$430,'Hide this - Workings'!D169)),1,0),\"\")","v":""},{"$f":"IF($AL$431=1,IF(ISNUMBER(SEARCH($AK$431,'Hide this - Workings'!D169)),1,0),\"\")","v":""},{"$f":"IF($AL$432=1,IF(ISNUMBER(SEARCH($AK$432,'Hide this - Workings'!D169)),1,0),\"\")","v":""},{"$f":"IF($AL$433=1,IF(ISNUMBER(SEARCH($AK$433,'Hide this - Workings'!D169)),1,0),\"\")","v":""},0,"A165",0,0,0,0]
[null,null,null,null,null,null,null,null,null,null,null,null,null,{"$f":"IF($AL$417=1,IF(ISNUMBER(SEARCH($AK$417,'Hide this - Workings'!D170)),1,0),\"\")","v":""},{"$f":"IF($AL$418=1,IF(ISNUMBER(SEARCH($AK$418,'Hide this - Workings'!D170)),1,0),\"\")","v":""},{"$f":"IF($AL$419=1,IF(ISNUMBER(SEARCH($AK$419,'Hide this - Workings'!D170)),1,0),\"\")","v":""},{"$f":"IF($AL$420=1,IF(ISNUMBER(SEARCH($AK$420,'Hide this - Workings'!D170)),1,0),\"\")","v":""},{"$f":"IF($AL$421=1,IF(ISNUMBER(SEARCH($AK$421,'Hide this - Workings'!D170)),1,0),\"\")","v":""},{"$f":"IF($AL$422=1,IF(ISNUMBER(SEARCH($AK$422,'Hide this - Workings'!D170)),1,0),\"\")","v":""},{"$f":"IF($AL$423=1,IF(ISNUMBER(SEARCH($AK$423,'Hide this - Workings'!D170)),1,0),\"\")","v":""},{"$f":"IF($AL$424=1,IF(ISNUMBER(SEARCH($AK$424,'Hide this - Workings'!D170)),1,0),\"\")","v":""},{"$f":"IF($AL$425=1,IF(ISNUMBER(SEARCH($AK$425,'Hide this - Workings'!D170)),1,0),\"\")","v":""},{"$f":"IF($AL$426=1,IF(ISNUMBER(SEARCH($AK$426,'Hide this - Workings'!D170)),1,0),\"\")","v":""},{"$f":"IF($AL$427=1,IF(ISNUMBER(SEARCH($AK$427,'Hide this - Workings'!D170)),1,0),\"\")","v":""},{"$f":"IF($AL$428=1,IF(ISNUMBER(SEARCH($AK$428,'Hide this - Workings'!D170)),1,0),\"\")","v":""},{"$f":"IF($AL$429=1,IF(ISNUMBER(SEARCH($AK$429,'Hide this - Workings'!D170)),1,0),\"\")","v":""},{"$f":"IF($AL$430=1,IF(ISNUMBER(SEARCH($AK$430,'Hide this - Workings'!D170)),1,0),\"\")","v":""},{"$f":"IF($AL$431=1,IF(ISNUMBER(SEARCH($AK$431,'Hide this - Workings'!D170)),1,0),\"\")","v":""},{"$f":"IF($AL$432=1,IF(ISNUMBER(SEARCH($AK$432,'Hide this - Workings'!D170)),1,0),\"\")","v":""},{"$f":"IF($AL$433=1,IF(ISNUMBER(SEARCH($AK$433,'Hide this - Workings'!D170)),1,0),\"\")","v":""},0,"A166",0,0,0,0]
[null,null,null,null,null,null,null,null,null,null,null,null,null,{"$f":"IF($AL$417=1,IF(ISNUMBER(SEARCH($AK$417,'Hide this - Workings'!D171)),1,0),\"\")","v":""},{"$f":"IF($AL$418=1,IF(ISNUMBER(SEARCH($AK$418,'Hide this - Workings'!D171)),1,0),\"\")","v":""},{"$f":"IF($AL$419=1,IF(ISNUMBER(SEARCH($AK$419,'Hide this - Workings'!D171)),1,0),\"\")","v":""},{"$f":"IF($AL$420=1,IF(ISNUMBER(SEARCH($AK$420,'Hide this - Workings'!D171)),1,0),\"\")","v":""},{"$f":"IF($AL$421=1,IF(ISNUMBER(SEARCH($AK$421,'Hide this - Workings'!D171)),1,0),\"\")","v":""},{"$f":"IF($AL$422=1,IF(ISNUMBER(SEARCH($AK$422,'Hide this - Workings'!D171)),1,0),\"\")","v":""},{"$f":"IF($AL$423=1,IF(ISNUMBER(SEARCH($AK$423,'Hide this - Workings'!D171)),1,0),\"\")","v":""},{"$f":"IF($AL$424=1,IF(ISNUMBER(SEARCH($AK$424,'Hide this - Workings'!D171)),1,0),\"\")","v":""},{"$f":"IF($AL$425=1,IF(ISNUMBER(SEARCH($AK$425,'Hide this - Workings'!D171)),1,0),\"\")","v":""},{"$f":"IF($AL$426=1,IF(ISNUMBER(SEARCH($AK$426,'Hide this - Workings'!D171)),1,0),\"\")","v":""},{"$f":"IF($AL$427=1,IF(ISNUMBER(SEARCH($AK$427,'Hide this - Workings'!D171)),1,0),\"\")","v":""},{"$f":"IF($AL$428=1,IF(ISNUMBER(SEARCH($AK$428,'Hide this - Workings'!D171)),1,0),\"\")","v":""},{"$f":"IF($AL$429=1,IF(ISNUMBER(SEARCH($AK$429,'Hide this - Workings'!D171)),1,0),\"\")","v":""},{"$f":"IF($AL$430=1,IF(ISNUMBER(SEARCH($AK$430,'Hide this - Workings'!D171)),1,0),\"\")","v":""},{"$f":"IF($AL$431=1,IF(ISNUMBER(SEARCH($AK$431,'Hide this - Workings'!D171)),1,0),\"\")","v":""},{"$f":"IF($AL$432=1,IF(ISNUMBER(SEARCH($AK$432,'Hide this - Workings'!D171)),1,0),\"\")","v":""},{"$f":"IF($AL$433=1,IF(ISNUMBER(SEARCH($AK$433,'Hide this - Workings'!D171)),1,0),\"\")","v":""},0,"A167",0,0,0,0]
[null,null,null,null,null,null,null,null,null,null,null,null,null,{"$f":"IF($AL$417=1,IF(ISNUMBER(SEARCH($AK$417,'Hide this - Workings'!D172)),1,0),\"\")","v":""},{"$f":"IF($AL$418=1,IF(ISNUMBER(SEARCH($AK$418,'Hide this - Workings'!D172)),1,0),\"\")","v":""},{"$f":"IF($AL$419=1,IF(ISNUMBER(SEARCH($AK$419,'Hide this - Workings'!D172)),1,0),\"\")","v":""},{"$f":"IF($AL$420=1,IF(ISNUMBER(SEARCH($AK$420,'Hide this - Workings'!D172)),1,0),\"\")","v":""},{"$f":"IF($AL$421=1,IF(ISNUMBER(SEARCH($AK$421,'Hide this - Workings'!D172)),1,0),\"\")","v":""},{"$f":"IF($AL$422=1,IF(ISNUMBER(SEARCH($AK$422,'Hide this - Workings'!D172)),1,0),\"\")","v":""},{"$f":"IF($AL$423=1,IF(ISNUMBER(SEARCH($AK$423,'Hide this - Workings'!D172)),1,0),\"\")","v":""},{"$f":"IF($AL$424=1,IF(ISNUMBER(SEARCH($AK$424,'Hide this - Workings'!D172)),1,0),\"\")","v":""},{"$f":"IF($AL$425=1,IF(ISNUMBER(SEARCH($AK$425,'Hide this - Workings'!D172)),1,0),\"\")","v":""},{"$f":"IF($AL$426=1,IF(ISNUMBER(SEARCH($AK$426,'Hide this - Workings'!D172)),1,0),\"\")","v":""},{"$f":"IF($AL$427=1,IF(ISNUMBER(SEARCH($AK$427,'Hide this - Workings'!D172)),1,0),\"\")","v":""},{"$f":"IF($AL$428=1,IF(ISNUMBER(SEARCH($AK$428,'Hide this - Workings'!D172)),1,0),\"\")","v":""},{"$f":"IF($AL$429=1,IF(ISNUMBER(SEARCH($AK$429,'Hide this - Workings'!D172)),1,0),\"\")","v":""},{"$f":"IF($AL$430=1,IF(ISNUMBER(SEARCH($AK$430,'Hide this - Workings'!D172)),1,0),\"\")","v":""},{"$f":"IF($AL$431=1,IF(ISNUMBER(SEARCH($AK$431,'Hide this - Workings'!D172)),1,0),\"\")","v":""},{"$f":"IF($AL$432=1,IF(ISNUMBER(SEARCH($AK$432,'Hide this - Workings'!D172)),1,0),\"\")","v":""},{"$f":"IF($AL$433=1,IF(ISNUMBER(SEARCH($AK$433,'Hide this - Workings'!D172)),1,0),\"\")","v":""},0,"A168",0,0,0,0]
[null,null,null,null,null,null,null,null,null,null,null,null,null,{"$f":"IF($AL$417=1,IF(ISNUMBER(SEARCH($AK$417,'Hide this - Workings'!D173)),1,0),\"\")","v":""},{"$f":"IF($AL$418=1,IF(ISNUMBER(SEARCH($AK$418,'Hide this - Workings'!D173)),1,0),\"\")","v":""},{"$f":"IF($AL$419=1,IF(ISNUMBER(SEARCH($AK$419,'Hide this - Workings'!D173)),1,0),\"\")","v":""},{"$f":"IF($AL$420=1,IF(ISNUMBER(SEARCH($AK$420,'Hide this - Workings'!D173)),1,0),\"\")","v":""},{"$f":"IF($AL$421=1,IF(ISNUMBER(SEARCH($AK$421,'Hide this - Workings'!D173)),1,0),\"\")","v":""},{"$f":"IF($AL$422=1,IF(ISNUMBER(SEARCH($AK$422,'Hide this - Workings'!D173)),1,0),\"\")","v":""},{"$f":"IF($AL$423=1,IF(ISNUMBER(SEARCH($AK$423,'Hide this - Workings'!D173)),1,0),\"\")","v":""},{"$f":"IF($AL$424=1,IF(ISNUMBER(SEARCH($AK$424,'Hide this - Workings'!D173)),1,0),\"\")","v":""},{"$f":"IF($AL$425=1,IF(ISNUMBER(SEARCH($AK$425,'Hide this - Workings'!D173)),1,0),\"\")","v":""},{"$f":"IF($AL$426=1,IF(ISNUMBER(SEARCH($AK$426,'Hide this - Workings'!D173)),1,0),\"\")","v":""},{"$f":"IF($AL$427=1,IF(ISNUMBER(SEARCH($AK$427,'Hide this - Workings'!D173)),1,0),\"\")","v":""},{"$f":"IF($AL$428=1,IF(ISNUMBER(SEARCH($AK$428,'Hide this - Workings'!D173)),1,0),\"\")","v":""},{"$f":"IF($AL$429=1,IF(ISNUMBER(SEARCH($AK$429,'Hide this - Workings'!D173)),1,0),\"\")","v":""},{"$f":"IF($AL$430=1,IF(ISNUMBER(SEARCH($AK$430,'Hide this - Workings'!D173)),1,0),\"\")","v":""},{"$f":"IF($AL$431=1,IF(ISNUMBER(SEARCH($AK$431,'Hide this - Workings'!D173)),1,0),\"\")","v":""},{"$f":"IF($AL$432=1,IF(ISNUMBER(SEARCH($AK$432,'Hide this - Workings'!D173)),1,0),\"\")","v":""},{"$f":"IF($AL$433=1,IF(ISNUMBER(SEARCH($AK$433,'Hide this - Workings'!D173)),1,0),\"\")","v":""},0,"A169",0,0,0,0]
[null,null,null,null,null,null,null,null,null,null,null,null,null,{"$f":"IF($AL$417=1,IF(ISNUMBER(SEARCH($AK$417,'Hide this - Workings'!D174)),1,0),\"\")","v":""},{"$f":"IF($AL$418=1,IF(ISNUMBER(SEARCH($AK$418,'Hide this - Workings'!D174)),1,0),\"\")","v":""},{"$f":"IF($AL$419=1,IF(ISNUMBER(SEARCH($AK$419,'Hide this - Workings'!D174)),1,0),\"\")","v":""},{"$f":"IF($AL$420=1,IF(ISNUMBER(SEARCH($AK$420,'Hide this - Workings'!D174)),1,0),\"\")","v":""},{"$f":"IF($AL$421=1,IF(ISNUMBER(SEARCH($AK$421,'Hide this - Workings'!D174)),1,0),\"\")","v":""},{"$f":"IF($AL$422=1,IF(ISNUMBER(SEARCH($AK$422,'Hide this - Workings'!D174)),1,0),\"\")","v":""},{"$f":"IF($AL$423=1,IF(ISNUMBER(SEARCH($AK$423,'Hide this - Workings'!D174)),1,0),\"\")","v":""},{"$f":"IF($AL$424=1,IF(ISNUMBER(SEARCH($AK$424,'Hide this - Workings'!D174)),1,0),\"\")","v":""},{"$f":"IF($AL$425=1,IF(ISNUMBER(SEARCH($AK$425,'Hide this - Workings'!D174)),1,0),\"\")","v":""},{"$f":"IF($AL$426=1,IF(ISNUMBER(SEARCH($AK$426,'Hide this - Workings'!D174)),1,0),\"\")","v":""},{"$f":"IF($AL$427=1,IF(ISNUMBER(SEARCH($AK$427,'Hide this - Workings'!D174)),1,0),\"\")","v":""},{"$f":"IF($AL$428=1,IF(ISNUMBER(SEARCH($AK$428,'Hide this - Workings'!D174)),1,0),\"\")","v":""},{"$f":"IF($AL$429=1,IF(ISNUMBER(SEARCH($AK$429,'Hide this - Workings'!D174)),1,0),\"\")","v":""},{"$f":"IF($AL$430=1,IF(ISNUMBER(SEARCH($AK$430,'Hide this - Workings'!D174)),1,0),\"\")","v":""},{"$f":"IF($AL$431=1,IF(ISNUMBER(SEARCH($AK$431,'Hide this - Workings'!D174)),1,0),\"\")","v":""},{"$f":"IF($AL$432=1,IF(ISNUMBER(SEARCH($AK$432,'Hide this - Workings'!D174)),1,0),\"\")","v":""},{"$f":"IF($AL$433=1,IF(ISNUMBER(SEARCH($AK$433,'Hide this - Workings'!D174)),1,0),\"\")","v":""},0,"A170",0,0,0,0]
[null,null,null,null,null,null,null,null,null,null,null,null,null,{"$f":"IF($AL$417=1,IF(ISNUMBER(SEARCH($AK$417,'Hide this - Workings'!D175)),1,0),\"\")","v":""},{"$f":"IF($AL$418=1,IF(ISNUMBER(SEARCH($AK$418,'Hide this - Workings'!D175)),1,0),\"\")","v":""},{"$f":"IF($AL$419=1,IF(ISNUMBER(SEARCH($AK$419,'Hide this - Workings'!D175)),1,0),\"\")","v":""},{"$f":"IF($AL$420=1,IF(ISNUMBER(SEARCH($AK$420,'Hide this - Workings'!D175)),1,0),\"\")","v":""},{"$f":"IF($AL$421=1,IF(ISNUMBER(SEARCH($AK$421,'Hide this - Workings'!D175)),1,0),\"\")","v":""},{"$f":"IF($AL$422=1,IF(ISNUMBER(SEARCH($AK$422,'Hide this - Workings'!D175)),1,0),\"\")","v":""},{"$f":"IF($AL$423=1,IF(ISNUMBER(SEARCH($AK$423,'Hide this - Workings'!D175)),1,0),\"\")","v":""},{"$f":"IF($AL$424=1,IF(ISNUMBER(SEARCH($AK$424,'Hide this - Workings'!D175)),1,0),\"\")","v":""},{"$f":"IF($AL$425=1,IF(ISNUMBER(SEARCH($AK$425,'Hide this - Workings'!D175)),1,0),\"\")","v":""},{"$f":"IF($AL$426=1,IF(ISNUMBER(SEARCH($AK$426,'Hide this - Workings'!D175)),1,0),\"\")","v":""},{"$f":"IF($AL$427=1,IF(ISNUMBER(SEARCH($AK$427,'Hide this - Workings'!D175)),1,0),\"\")","v":""},{"$f":"IF($AL$428=1,IF(ISNUMBER(SEARCH($AK$428,'Hide this - Workings'!D175)),1,0),\"\")","v":""},{"$f":"IF($AL$429=1,IF(ISNUMBER(SEARCH($AK$429,'Hide this - Workings'!D175)),1,0),\"\")","v":""},{"$f":"IF($AL$430=1,IF(ISNUMBER(SEARCH($AK$430,'Hide this - Workings'!D175)),1,0),\"\")","v":""},{"$f":"IF($AL$431=1,IF(ISNUMBER(SEARCH($AK$431,'Hide this - Workings'!D175)),1,0),\"\")","v":""},{"$f":"IF($AL$432=1,IF(ISNUMBER(SEARCH($AK$432,'Hide this - Workings'!D175)),1,0),\"\")","v":""},{"$f":"IF($AL$433=1,IF(ISNUMBER(SEARCH($AK$433,'Hide this - Workings'!D175)),1,0),\"\")","v":""},0,"A171",0,0,0,0]
[null,null,null,null,null,null,null,null,null,null,null,null,null,{"$f":"IF($AL$417=1,IF(ISNUMBER(SEARCH($AK$417,'Hide this - Workings'!D176)),1,0),\"\")","v":""},{"$f":"IF($AL$418=1,IF(ISNUMBER(SEARCH($AK$418,'Hide this - Workings'!D176)),1,0),\"\")","v":""},{"$f":"IF($AL$419=1,IF(ISNUMBER(SEARCH($AK$419,'Hide this - Workings'!D176)),1,0),\"\")","v":""},{"$f":"IF($AL$420=1,IF(ISNUMBER(SEARCH($AK$420,'Hide this - Workings'!D176)),1,0),\"\")","v":""},{"$f":"IF($AL$421=1,IF(ISNUMBER(SEARCH($AK$421,'Hide this - Workings'!D176)),1,0),\"\")","v":""},{"$f":"IF($AL$422=1,IF(ISNUMBER(SEARCH($AK$422,'Hide this - Workings'!D176)),1,0),\"\")","v":""},{"$f":"IF($AL$423=1,IF(ISNUMBER(SEARCH($AK$423,'Hide this - Workings'!D176)),1,0),\"\")","v":""},{"$f":"IF($AL$424=1,IF(ISNUMBER(SEARCH($AK$424,'Hide this - Workings'!D176)),1,0),\"\")","v":""},{"$f":"IF($AL$425=1,IF(ISNUMBER(SEARCH($AK$425,'Hide this - Workings'!D176)),1,0),\"\")","v":""},{"$f":"IF($AL$426=1,IF(ISNUMBER(SEARCH($AK$426,'Hide this - Workings'!D176)),1,0),\"\")","v":""},{"$f":"IF($AL$427=1,IF(ISNUMBER(SEARCH($AK$427,'Hide this - Workings'!D176)),1,0),\"\")","v":""},{"$f":"IF($AL$428=1,IF(ISNUMBER(SEARCH($AK$428,'Hide this - Workings'!D176)),1,0),\"\")","v":""},{"$f":"IF($AL$429=1,IF(ISNUMBER(SEARCH($AK$429,'Hide this - Workings'!D176)),1,0),\"\")","v":""},{"$f":"IF($AL$430=1,IF(ISNUMBER(SEARCH($AK$430,'Hide this - Workings'!D176)),1,0),\"\")","v":""},{"$f":"IF($AL$431=1,IF(ISNUMBER(SEARCH($AK$431,'Hide this - Workings'!D176)),1,0),\"\")","v":""},{"$f":"IF($AL$432=1,IF(ISNUMBER(SEARCH($AK$432,'Hide this - Workings'!D176)),1,0),\"\")","v":""},{"$f":"IF($AL$433=1,IF(ISNUMBER(SEARCH($AK$433,'Hide this - Workings'!D176)),1,0),\"\")","v":""},0,"A172",0,0,0,0]
[null,null,null,null,null,null,null,null,null,null,null,null,null,{"$f":"IF($AL$417=1,IF(ISNUMBER(SEARCH($AK$417,'Hide this - Workings'!D177)),1,0),\"\")","v":""},{"$f":"IF($AL$418=1,IF(ISNUMBER(SEARCH($AK$418,'Hide this - Workings'!D177)),1,0),\"\")","v":""},{"$f":"IF($AL$419=1,IF(ISNUMBER(SEARCH($AK$419,'Hide this - Workings'!D177)),1,0),\"\")","v":""},{"$f":"IF($AL$420=1,IF(ISNUMBER(SEARCH($AK$420,'Hide this - Workings'!D177)),1,0),\"\")","v":""},{"$f":"IF($AL$421=1,IF(ISNUMBER(SEARCH($AK$421,'Hide this - Workings'!D177)),1,0),\"\")","v":""},{"$f":"IF($AL$422=1,IF(ISNUMBER(SEARCH($AK$422,'Hide this - Workings'!D177)),1,0),\"\")","v":""},{"$f":"IF($AL$423=1,IF(ISNUMBER(SEARCH($AK$423,'Hide this - Workings'!D177)),1,0),\"\")","v":""},{"$f":"IF($AL$424=1,IF(ISNUMBER(SEARCH($AK$424,'Hide this - Workings'!D177)),1,0),\"\")","v":""},{"$f":"IF($AL$425=1,IF(ISNUMBER(SEARCH($AK$425,'Hide this - Workings'!D177)),1,0),\"\")","v":""},{"$f":"IF($AL$426=1,IF(ISNUMBER(SEARCH($AK$426,'Hide this - Workings'!D177)),1,0),\"\")","v":""},{"$f":"IF($AL$427=1,IF(ISNUMBER(SEARCH($AK$427,'Hide this - Workings'!D177)),1,0),\"\")","v":""},{"$f":"IF($AL$428=1,IF(ISNUMBER(SEARCH($AK$428,'Hide this - Workings'!D177)),1,0),\"\")","v":""},{"$f":"IF($AL$429=1,IF(ISNUMBER(SEARCH($AK$429,'Hide this - Workings'!D177)),1,0),\"\")","v":""},{"$f":"IF($AL$430=1,IF(ISNUMBER(SEARCH($AK$430,'Hide this - Workings'!D177)),1,0),\"\")","v":""},{"$f":"IF($AL$431=1,IF(ISNUMBER(SEARCH($AK$431,'Hide this - Workings'!D177)),1,0),\"\")","v":""},{"$f":"IF($AL$432=1,IF(ISNUMBER(SEARCH($AK$432,'Hide this - Workings'!D177)),1,0),\"\")","v":""},{"$f":"IF($AL$433=1,IF(ISNUMBER(SEARCH($AK$433,'Hide this - Workings'!D177)),1,0),\"\")","v":""},0,"A173",0,0,0,0]
[null,null,null,null,null,null,null,null,null,null,null,null,null,{"$f":"IF($AL$417=1,IF(ISNUMBER(SEARCH($AK$417,'Hide this - Workings'!D178)),1,0),\"\")","v":""},{"$f":"IF($AL$418=1,IF(ISNUMBER(SEARCH($AK$418,'Hide this - Workings'!D178)),1,0),\"\")","v":""},{"$f":"IF($AL$419=1,IF(ISNUMBER(SEARCH($AK$419,'Hide this - Workings'!D178)),1,0),\"\")","v":""},{"$f":"IF($AL$420=1,IF(ISNUMBER(SEARCH($AK$420,'Hide this - Workings'!D178)),1,0),\"\")","v":""},{"$f":"IF($AL$421=1,IF(ISNUMBER(SEARCH($AK$421,'Hide this - Workings'!D178)),1,0),\"\")","v":""},{"$f":"IF($AL$422=1,IF(ISNUMBER(SEARCH($AK$422,'Hide this - Workings'!D178)),1,0),\"\")","v":""},{"$f":"IF($AL$423=1,IF(ISNUMBER(SEARCH($AK$423,'Hide this - Workings'!D178)),1,0),\"\")","v":""},{"$f":"IF($AL$424=1,IF(ISNUMBER(SEARCH($AK$424,'Hide this - Workings'!D178)),1,0),\"\")","v":""},{"$f":"IF($AL$425=1,IF(ISNUMBER(SEARCH($AK$425,'Hide this - Workings'!D178)),1,0),\"\")","v":""},{"$f":"IF($AL$426=1,IF(ISNUMBER(SEARCH($AK$426,'Hide this - Workings'!D178)),1,0),\"\")","v":""},{"$f":"IF($AL$427=1,IF(ISNUMBER(SEARCH($AK$427,'Hide this - Workings'!D178)),1,0),\"\")","v":""},{"$f":"IF($AL$428=1,IF(ISNUMBER(SEARCH($AK$428,'Hide this - Workings'!D178)),1,0),\"\")","v":""},{"$f":"IF($AL$429=1,IF(ISNUMBER(SEARCH($AK$429,'Hide this - Workings'!D178)),1,0),\"\")","v":""},{"$f":"IF($AL$430=1,IF(ISNUMBER(SEARCH($AK$430,'Hide this - Workings'!D178)),1,0),\"\")","v":""},{"$f":"IF($AL$431=1,IF(ISNUMBER(SEARCH($AK$431,'Hide this - Workings'!D178)),1,0),\"\")","v":""},{"$f":"IF($AL$432=1,IF(ISNUMBER(SEARCH($AK$432,'Hide this - Workings'!D178)),1,0),\"\")","v":""},{"$f":"IF($AL$433=1,IF(ISNUMBER(SEARCH($AK$433,'Hide this - Workings'!D178)),1,0),\"\")","v":""},0,"A174",0,0,0,0]
[null,null,null,null,null,null,null,null,null,null,null,null,null,{"$f":"IF($AL$417=1,IF(ISNUMBER(SEARCH($AK$417,'Hide this - Workings'!D179)),1,0),\"\")","v":""},{"$f":"IF($AL$418=1,IF(ISNUMBER(SEARCH($AK$418,'Hide this - Workings'!D179)),1,0),\"\")","v":""},{"$f":"IF($AL$419=1,IF(ISNUMBER(SEARCH($AK$419,'Hide this - Workings'!D179)),1,0),\"\")","v":""},{"$f":"IF($AL$420=1,IF(ISNUMBER(SEARCH($AK$420,'Hide this - Workings'!D179)),1,0),\"\")","v":""},{"$f":"IF($AL$421=1,IF(ISNUMBER(SEARCH($AK$421,'Hide this - Workings'!D179)),1,0),\"\")","v":""},{"$f":"IF($AL$422=1,IF(ISNUMBER(SEARCH($AK$422,'Hide this - Workings'!D179)),1,0),\"\")","v":""},{"$f":"IF($AL$423=1,IF(ISNUMBER(SEARCH($AK$423,'Hide this - Workings'!D179)),1,0),\"\")","v":""},{"$f":"IF($AL$424=1,IF(ISNUMBER(SEARCH($AK$424,'Hide this - Workings'!D179)),1,0),\"\")","v":""},{"$f":"IF($AL$425=1,IF(ISNUMBER(SEARCH($AK$425,'Hide this - Workings'!D179)),1,0),\"\")","v":""},{"$f":"IF($AL$426=1,IF(ISNUMBER(SEARCH($AK$426,'Hide this - Workings'!D179)),1,0),\"\")","v":""},{"$f":"IF($AL$427=1,IF(ISNUMBER(SEARCH($AK$427,'Hide this - Workings'!D179)),1,0),\"\")","v":""},{"$f":"IF($AL$428=1,IF(ISNUMBER(SEARCH($AK$428,'Hide this - Workings'!D179)),1,0),\"\")","v":""},{"$f":"IF($AL$429=1,IF(ISNUMBER(SEARCH($AK$429,'Hide this - Workings'!D179)),1,0),\"\")","v":""},{"$f":"IF($AL$430=1,IF(ISNUMBER(SEARCH($AK$430,'Hide this - Workings'!D179)),1,0),\"\")","v":""},{"$f":"IF($AL$431=1,IF(ISNUMBER(SEARCH($AK$431,'Hide this - Workings'!D179)),1,0),\"\")","v":""},{"$f":"IF($AL$432=1,IF(ISNUMBER(SEARCH($AK$432,'Hide this - Workings'!D179)),1,0),\"\")","v":""},{"$f":"IF($AL$433=1,IF(ISNUMBER(SEARCH($AK$433,'Hide this - Workings'!D179)),1,0),\"\")","v":""},0,"A175",0,0,0,0]
[null,null,null,null,null,null,null,null,null,null,null,null,null,{"$f":"IF($AL$417=1,IF(ISNUMBER(SEARCH($AK$417,'Hide this - Workings'!D180)),1,0),\"\")","v":""},{"$f":"IF($AL$418=1,IF(ISNUMBER(SEARCH($AK$418,'Hide this - Workings'!D180)),1,0),\"\")","v":""},{"$f":"IF($AL$419=1,IF(ISNUMBER(SEARCH($AK$419,'Hide this - Workings'!D180)),1,0),\"\")","v":""},{"$f":"IF($AL$420=1,IF(ISNUMBER(SEARCH($AK$420,'Hide this - Workings'!D180)),1,0),\"\")","v":""},{"$f":"IF($AL$421=1,IF(ISNUMBER(SEARCH($AK$421,'Hide this - Workings'!D180)),1,0),\"\")","v":""},{"$f":"IF($AL$422=1,IF(ISNUMBER(SEARCH($AK$422,'Hide this - Workings'!D180)),1,0),\"\")","v":""},{"$f":"IF($AL$423=1,IF(ISNUMBER(SEARCH($AK$423,'Hide this - Workings'!D180)),1,0),\"\")","v":""},{"$f":"IF($AL$424=1,IF(ISNUMBER(SEARCH($AK$424,'Hide this - Workings'!D180)),1,0),\"\")","v":""},{"$f":"IF($AL$425=1,IF(ISNUMBER(SEARCH($AK$425,'Hide this - Workings'!D180)),1,0),\"\")","v":""},{"$f":"IF($AL$426=1,IF(ISNUMBER(SEARCH($AK$426,'Hide this - Workings'!D180)),1,0),\"\")","v":""},{"$f":"IF($AL$427=1,IF(ISNUMBER(SEARCH($AK$427,'Hide this - Workings'!D180)),1,0),\"\")","v":""},{"$f":"IF($AL$428=1,IF(ISNUMBER(SEARCH($AK$428,'Hide this - Workings'!D180)),1,0),\"\")","v":""},{"$f":"IF($AL$429=1,IF(ISNUMBER(SEARCH($AK$429,'Hide this - Workings'!D180)),1,0),\"\")","v":""},{"$f":"IF($AL$430=1,IF(ISNUMBER(SEARCH($AK$430,'Hide this - Workings'!D180)),1,0),\"\")","v":""},{"$f":"IF($AL$431=1,IF(ISNUMBER(SEARCH($AK$431,'Hide this - Workings'!D180)),1,0),\"\")","v":""},{"$f":"IF($AL$432=1,IF(ISNUMBER(SEARCH($AK$432,'Hide this - Workings'!D180)),1,0),\"\")","v":""},{"$f":"IF($AL$433=1,IF(ISNUMBER(SEARCH($AK$433,'Hide this - Workings'!D180)),1,0),\"\")","v":""},0,"A176",0,0,0,0]
[null,null,null,null,null,null,null,null,null,null,null,null,null,{"$f":"IF($AL$417=1,IF(ISNUMBER(SEARCH($AK$417,'Hide this - Workings'!D181)),1,0),\"\")","v":""},{"$f":"IF($AL$418=1,IF(ISNUMBER(SEARCH($AK$418,'Hide this - Workings'!D181)),1,0),\"\")","v":""},{"$f":"IF($AL$419=1,IF(ISNUMBER(SEARCH($AK$419,'Hide this - Workings'!D181)),1,0),\"\")","v":""},{"$f":"IF($AL$420=1,IF(ISNUMBER(SEARCH($AK$420,'Hide this - Workings'!D181)),1,0),\"\")","v":""},{"$f":"IF($AL$421=1,IF(ISNUMBER(SEARCH($AK$421,'Hide this - Workings'!D181)),1,0),\"\")","v":""},{"$f":"IF($AL$422=1,IF(ISNUMBER(SEARCH($AK$422,'Hide this - Workings'!D181)),1,0),\"\")","v":""},{"$f":"IF($AL$423=1,IF(ISNUMBER(SEARCH($AK$423,'Hide this - Workings'!D181)),1,0),\"\")","v":""},{"$f":"IF($AL$424=1,IF(ISNUMBER(SEARCH($AK$424,'Hide this - Workings'!D181)),1,0),\"\")","v":""},{"$f":"IF($AL$425=1,IF(ISNUMBER(SEARCH($AK$425,'Hide this - Workings'!D181)),1,0),\"\")","v":""},{"$f":"IF($AL$426=1,IF(ISNUMBER(SEARCH($AK$426,'Hide this - Workings'!D181)),1,0),\"\")","v":""},{"$f":"IF($AL$427=1,IF(ISNUMBER(SEARCH($AK$427,'Hide this - Workings'!D181)),1,0),\"\")","v":""},{"$f":"IF($AL$428=1,IF(ISNUMBER(SEARCH($AK$428,'Hide this - Workings'!D181)),1,0),\"\")","v":""},{"$f":"IF($AL$429=1,IF(ISNUMBER(SEARCH($AK$429,'Hide this - Workings'!D181)),1,0),\"\")","v":""},{"$f":"IF($AL$430=1,IF(ISNUMBER(SEARCH($AK$430,'Hide this - Workings'!D181)),1,0),\"\")","v":""},{"$f":"IF($AL$431=1,IF(ISNUMBER(SEARCH($AK$431,'Hide this - Workings'!D181)),1,0),\"\")","v":""},{"$f":"IF($AL$432=1,IF(ISNUMBER(SEARCH($AK$432,'Hide this - Workings'!D181)),1,0),\"\")","v":""},{"$f":"IF($AL$433=1,IF(ISNUMBER(SEARCH($AK$433,'Hide this - Workings'!D181)),1,0),\"\")","v":""},0,"A177",0,0,0,0]
[null,null,null,null,null,null,null,null,null,null,null,null,null,{"$f":"IF($AL$417=1,IF(ISNUMBER(SEARCH($AK$417,'Hide this - Workings'!D182)),1,0),\"\")","v":""},{"$f":"IF($AL$418=1,IF(ISNUMBER(SEARCH($AK$418,'Hide this - Workings'!D182)),1,0),\"\")","v":""},{"$f":"IF($AL$419=1,IF(ISNUMBER(SEARCH($AK$419,'Hide this - Workings'!D182)),1,0),\"\")","v":""},{"$f":"IF($AL$420=1,IF(ISNUMBER(SEARCH($AK$420,'Hide this - Workings'!D182)),1,0),\"\")","v":""},{"$f":"IF($AL$421=1,IF(ISNUMBER(SEARCH($AK$421,'Hide this - Workings'!D182)),1,0),\"\")","v":""},{"$f":"IF($AL$422=1,IF(ISNUMBER(SEARCH($AK$422,'Hide this - Workings'!D182)),1,0),\"\")","v":""},{"$f":"IF($AL$423=1,IF(ISNUMBER(SEARCH($AK$423,'Hide this - Workings'!D182)),1,0),\"\")","v":""},{"$f":"IF($AL$424=1,IF(ISNUMBER(SEARCH($AK$424,'Hide this - Workings'!D182)),1,0),\"\")","v":""},{"$f":"IF($AL$425=1,IF(ISNUMBER(SEARCH($AK$425,'Hide this - Workings'!D182)),1,0),\"\")","v":""},{"$f":"IF($AL$426=1,IF(ISNUMBER(SEARCH($AK$426,'Hide this - Workings'!D182)),1,0),\"\")","v":""},{"$f":"IF($AL$427=1,IF(ISNUMBER(SEARCH($AK$427,'Hide this - Workings'!D182)),1,0),\"\")","v":""},{"$f":"IF($AL$428=1,IF(ISNUMBER(SEARCH($AK$428,'Hide this - Workings'!D182)),1,0),\"\")","v":""},{"$f":"IF($AL$429=1,IF(ISNUMBER(SEARCH($AK$429,'Hide this - Workings'!D182)),1,0),\"\")","v":""},{"$f":"IF($AL$430=1,IF(ISNUMBER(SEARCH($AK$430,'Hide this - Workings'!D182)),1,0),\"\")","v":""},{"$f":"IF($AL$431=1,IF(ISNUMBER(SEARCH($AK$431,'Hide this - Workings'!D182)),1,0),\"\")","v":""},{"$f":"IF($AL$432=1,IF(ISNUMBER(SEARCH($AK$432,'Hide this - Workings'!D182)),1,0),\"\")","v":""},{"$f":"IF($AL$433=1,IF(ISNUMBER(SEARCH($AK$433,'Hide this - Workings'!D182)),1,0),\"\")","v":""},0,"A178",0,0,0,0]
[null,null,null,null,null,null,null,null,null,null,null,null,null,{"$f":"IF($AL$417=1,IF(ISNUMBER(SEARCH($AK$417,'Hide this - Workings'!D183)),1,0),\"\")","v":""},{"$f":"IF($AL$418=1,IF(ISNUMBER(SEARCH($AK$418,'Hide this - Workings'!D183)),1,0),\"\")","v":""},{"$f":"IF($AL$419=1,IF(ISNUMBER(SEARCH($AK$419,'Hide this - Workings'!D183)),1,0),\"\")","v":""},{"$f":"IF($AL$420=1,IF(ISNUMBER(SEARCH($AK$420,'Hide this - Workings'!D183)),1,0),\"\")","v":""},{"$f":"IF($AL$421=1,IF(ISNUMBER(SEARCH($AK$421,'Hide this - Workings'!D183)),1,0),\"\")","v":""},{"$f":"IF($AL$422=1,IF(ISNUMBER(SEARCH($AK$422,'Hide this - Workings'!D183)),1,0),\"\")","v":""},{"$f":"IF($AL$423=1,IF(ISNUMBER(SEARCH($AK$423,'Hide this - Workings'!D183)),1,0),\"\")","v":""},{"$f":"IF($AL$424=1,IF(ISNUMBER(SEARCH($AK$424,'Hide this - Workings'!D183)),1,0),\"\")","v":""},{"$f":"IF($AL$425=1,IF(ISNUMBER(SEARCH($AK$425,'Hide this - Workings'!D183)),1,0),\"\")","v":""},{"$f":"IF($AL$426=1,IF(ISNUMBER(SEARCH($AK$426,'Hide this - Workings'!D183)),1,0),\"\")","v":""},{"$f":"IF($AL$427=1,IF(ISNUMBER(SEARCH($AK$427,'Hide this - Workings'!D183)),1,0),\"\")","v":""},{"$f":"IF($AL$428=1,IF(ISNUMBER(SEARCH($AK$428,'Hide this - Workings'!D183)),1,0),\"\")","v":""},{"$f":"IF($AL$429=1,IF(ISNUMBER(SEARCH($AK$429,'Hide this - Workings'!D183)),1,0),\"\")","v":""},{"$f":"IF($AL$430=1,IF(ISNUMBER(SEARCH($AK$430,'Hide this - Workings'!D183)),1,0),\"\")","v":""},{"$f":"IF($AL$431=1,IF(ISNUMBER(SEARCH($AK$431,'Hide this - Workings'!D183)),1,0),\"\")","v":""},{"$f":"IF($AL$432=1,IF(ISNUMBER(SEARCH($AK$432,'Hide this - Workings'!D183)),1,0),\"\")","v":""},{"$f":"IF($AL$433=1,IF(ISNUMBER(SEARCH($AK$433,'Hide this - Workings'!D183)),1,0),\"\")","v":""},0,"A179",0,0,0,0]
[null,null,null,null,null,null,null,null,null,null,null,null,null,{"$f":"IF($AL$417=1,IF(ISNUMBER(SEARCH($AK$417,'Hide this - Workings'!D184)),1,0),\"\")","v":""},{"$f":"IF($AL$418=1,IF(ISNUMBER(SEARCH($AK$418,'Hide this - Workings'!D184)),1,0),\"\")","v":""},{"$f":"IF($AL$419=1,IF(ISNUMBER(SEARCH($AK$419,'Hide this - Workings'!D184)),1,0),\"\")","v":""},{"$f":"IF($AL$420=1,IF(ISNUMBER(SEARCH($AK$420,'Hide this - Workings'!D184)),1,0),\"\")","v":""},{"$f":"IF($AL$421=1,IF(ISNUMBER(SEARCH($AK$421,'Hide this - Workings'!D184)),1,0),\"\")","v":""},{"$f":"IF($AL$422=1,IF(ISNUMBER(SEARCH($AK$422,'Hide this - Workings'!D184)),1,0),\"\")","v":""},{"$f":"IF($AL$423=1,IF(ISNUMBER(SEARCH($AK$423,'Hide this - Workings'!D184)),1,0),\"\")","v":""},{"$f":"IF($AL$424=1,IF(ISNUMBER(SEARCH($AK$424,'Hide this - Workings'!D184)),1,0),\"\")","v":""},{"$f":"IF($AL$425=1,IF(ISNUMBER(SEARCH($AK$425,'Hide this - Workings'!D184)),1,0),\"\")","v":""},{"$f":"IF($AL$426=1,IF(ISNUMBER(SEARCH($AK$426,'Hide this - Workings'!D184)),1,0),\"\")","v":""},{"$f":"IF($AL$427=1,IF(ISNUMBER(SEARCH($AK$427,'Hide this - Workings'!D184)),1,0),\"\")","v":""},{"$f":"IF($AL$428=1,IF(ISNUMBER(SEARCH($AK$428,'Hide this - Workings'!D184)),1,0),\"\")","v":""},{"$f":"IF($AL$429=1,IF(ISNUMBER(SEARCH($AK$429,'Hide this - Workings'!D184)),1,0),\"\")","v":""},{"$f":"IF($AL$430=1,IF(ISNUMBER(SEARCH($AK$430,'Hide this - Workings'!D184)),1,0),\"\")","v":""},{"$f":"IF($AL$431=1,IF(ISNUMBER(SEARCH($AK$431,'Hide this - Workings'!D184)),1,0),\"\")","v":""},{"$f":"IF($AL$432=1,IF(ISNUMBER(SEARCH($AK$432,'Hide this - Workings'!D184)),1,0),\"\")","v":""},{"$f":"IF($AL$433=1,IF(ISNUMBER(SEARCH($AK$433,'Hide this - Workings'!D184)),1,0),\"\")","v":""},0,"A180",0,0,0,0]
[null,null,null,null,null,null,null,null,null,null,null,null,null,{"$f":"IF($AL$417=1,IF(ISNUMBER(SEARCH($AK$417,'Hide this - Workings'!D185)),1,0),\"\")","v":""},{"$f":"IF($AL$418=1,IF(ISNUMBER(SEARCH($AK$418,'Hide this - Workings'!D185)),1,0),\"\")","v":""},{"$f":"IF($AL$419=1,IF(ISNUMBER(SEARCH($AK$419,'Hide this - Workings'!D185)),1,0),\"\")","v":""},{"$f":"IF($AL$420=1,IF(ISNUMBER(SEARCH($AK$420,'Hide this - Workings'!D185)),1,0),\"\")","v":""},{"$f":"IF($AL$421=1,IF(ISNUMBER(SEARCH($AK$421,'Hide this - Workings'!D185)),1,0),\"\")","v":""},{"$f":"IF($AL$422=1,IF(ISNUMBER(SEARCH($AK$422,'Hide this - Workings'!D185)),1,0),\"\")","v":""},{"$f":"IF($AL$423=1,IF(ISNUMBER(SEARCH($AK$423,'Hide this - Workings'!D185)),1,0),\"\")","v":""},{"$f":"IF($AL$424=1,IF(ISNUMBER(SEARCH($AK$424,'Hide this - Workings'!D185)),1,0),\"\")","v":""},{"$f":"IF($AL$425=1,IF(ISNUMBER(SEARCH($AK$425,'Hide this - Workings'!D185)),1,0),\"\")","v":""},{"$f":"IF($AL$426=1,IF(ISNUMBER(SEARCH($AK$426,'Hide this - Workings'!D185)),1,0),\"\")","v":""},{"$f":"IF($AL$427=1,IF(ISNUMBER(SEARCH($AK$427,'Hide this - Workings'!D185)),1,0),\"\")","v":""},{"$f":"IF($AL$428=1,IF(ISNUMBER(SEARCH($AK$428,'Hide this - Workings'!D185)),1,0),\"\")","v":""},{"$f":"IF($AL$429=1,IF(ISNUMBER(SEARCH($AK$429,'Hide this - Workings'!D185)),1,0),\"\")","v":""},{"$f":"IF($AL$430=1,IF(ISNUMBER(SEARCH($AK$430,'Hide this - Workings'!D185)),1,0),\"\")","v":""},{"$f":"IF($AL$431=1,IF(ISNUMBER(SEARCH($AK$431,'Hide this - Workings'!D185)),1,0),\"\")","v":""},{"$f":"IF($AL$432=1,IF(ISNUMBER(SEARCH($AK$432,'Hide this - Workings'!D185)),1,0),\"\")","v":""},{"$f":"IF($AL$433=1,IF(ISNUMBER(SEARCH($AK$433,'Hide this - Workings'!D185)),1,0),\"\")","v":""},0,"A181",0,0,0,0]
[null,null,null,null,null,null,null,null,null,null,null,null,null,{"$f":"IF($AL$417=1,IF(ISNUMBER(SEARCH($AK$417,'Hide this - Workings'!D186)),1,0),\"\")","v":""},{"$f":"IF($AL$418=1,IF(ISNUMBER(SEARCH($AK$418,'Hide this - Workings'!D186)),1,0),\"\")","v":""},{"$f":"IF($AL$419=1,IF(ISNUMBER(SEARCH($AK$419,'Hide this - Workings'!D186)),1,0),\"\")","v":""},{"$f":"IF($AL$420=1,IF(ISNUMBER(SEARCH($AK$420,'Hide this - Workings'!D186)),1,0),\"\")","v":""},{"$f":"IF($AL$421=1,IF(ISNUMBER(SEARCH($AK$421,'Hide this - Workings'!D186)),1,0),\"\")","v":""},{"$f":"IF($AL$422=1,IF(ISNUMBER(SEARCH($AK$422,'Hide this - Workings'!D186)),1,0),\"\")","v":""},{"$f":"IF($AL$423=1,IF(ISNUMBER(SEARCH($AK$423,'Hide this - Workings'!D186)),1,0),\"\")","v":""},{"$f":"IF($AL$424=1,IF(ISNUMBER(SEARCH($AK$424,'Hide this - Workings'!D186)),1,0),\"\")","v":""},{"$f":"IF($AL$425=1,IF(ISNUMBER(SEARCH($AK$425,'Hide this - Workings'!D186)),1,0),\"\")","v":""},{"$f":"IF($AL$426=1,IF(ISNUMBER(SEARCH($AK$426,'Hide this - Workings'!D186)),1,0),\"\")","v":""},{"$f":"IF($AL$427=1,IF(ISNUMBER(SEARCH($AK$427,'Hide this - Workings'!D186)),1,0),\"\")","v":""},{"$f":"IF($AL$428=1,IF(ISNUMBER(SEARCH($AK$428,'Hide this - Workings'!D186)),1,0),\"\")","v":""},{"$f":"IF($AL$429=1,IF(ISNUMBER(SEARCH($AK$429,'Hide this - Workings'!D186)),1,0),\"\")","v":""},{"$f":"IF($AL$430=1,IF(ISNUMBER(SEARCH($AK$430,'Hide this - Workings'!D186)),1,0),\"\")","v":""},{"$f":"IF($AL$431=1,IF(ISNUMBER(SEARCH($AK$431,'Hide this - Workings'!D186)),1,0),\"\")","v":""},{"$f":"IF($AL$432=1,IF(ISNUMBER(SEARCH($AK$432,'Hide this - Workings'!D186)),1,0),\"\")","v":""},{"$f":"IF($AL$433=1,IF(ISNUMBER(SEARCH($AK$433,'Hide this - Workings'!D186)),1,0),\"\")","v":""},0,"A182",0,0,0,0]
[null,null,null,null,null,null,null,null,null,null,null,null,null,{"$f":"IF($AL$417=1,IF(ISNUMBER(SEARCH($AK$417,'Hide this - Workings'!D187)),1,0),\"\")","v":""},{"$f":"IF($AL$418=1,IF(ISNUMBER(SEARCH($AK$418,'Hide this - Workings'!D187)),1,0),\"\")","v":""},{"$f":"IF($AL$419=1,IF(ISNUMBER(SEARCH($AK$419,'Hide this - Workings'!D187)),1,0),\"\")","v":""},{"$f":"IF($AL$420=1,IF(ISNUMBER(SEARCH($AK$420,'Hide this - Workings'!D187)),1,0),\"\")","v":""},{"$f":"IF($AL$421=1,IF(ISNUMBER(SEARCH($AK$421,'Hide this - Workings'!D187)),1,0),\"\")","v":""},{"$f":"IF($AL$422=1,IF(ISNUMBER(SEARCH($AK$422,'Hide this - Workings'!D187)),1,0),\"\")","v":""},{"$f":"IF($AL$423=1,IF(ISNUMBER(SEARCH($AK$423,'Hide this - Workings'!D187)),1,0),\"\")","v":""},{"$f":"IF($AL$424=1,IF(ISNUMBER(SEARCH($AK$424,'Hide this - Workings'!D187)),1,0),\"\")","v":""},{"$f":"IF($AL$425=1,IF(ISNUMBER(SEARCH($AK$425,'Hide this - Workings'!D187)),1,0),\"\")","v":""},{"$f":"IF($AL$426=1,IF(ISNUMBER(SEARCH($AK$426,'Hide this - Workings'!D187)),1,0),\"\")","v":""},{"$f":"IF($AL$427=1,IF(ISNUMBER(SEARCH($AK$427,'Hide this - Workings'!D187)),1,0),\"\")","v":""},{"$f":"IF($AL$428=1,IF(ISNUMBER(SEARCH($AK$428,'Hide this - Workings'!D187)),1,0),\"\")","v":""},{"$f":"IF($AL$429=1,IF(ISNUMBER(SEARCH($AK$429,'Hide this - Workings'!D187)),1,0),\"\")","v":""},{"$f":"IF($AL$430=1,IF(ISNUMBER(SEARCH($AK$430,'Hide this - Workings'!D187)),1,0),\"\")","v":""},{"$f":"IF($AL$431=1,IF(ISNUMBER(SEARCH($AK$431,'Hide this - Workings'!D187)),1,0),\"\")","v":""},{"$f":"IF($AL$432=1,IF(ISNUMBER(SEARCH($AK$432,'Hide this - Workings'!D187)),1,0),\"\")","v":""},{"$f":"IF($AL$433=1,IF(ISNUMBER(SEARCH($AK$433,'Hide this - Workings'!D187)),1,0),\"\")","v":""},0,"A183",0,0,0,0]
[null,null,null,null,null,null,null,null,null,null,null,null,null,{"$f":"IF($AL$417=1,IF(ISNUMBER(SEARCH($AK$417,'Hide this - Workings'!D188)),1,0),\"\")","v":""},{"$f":"IF($AL$418=1,IF(ISNUMBER(SEARCH($AK$418,'Hide this - Workings'!D188)),1,0),\"\")","v":""},{"$f":"IF($AL$419=1,IF(ISNUMBER(SEARCH($AK$419,'Hide this - Workings'!D188)),1,0),\"\")","v":""},{"$f":"IF($AL$420=1,IF(ISNUMBER(SEARCH($AK$420,'Hide this - Workings'!D188)),1,0),\"\")","v":""},{"$f":"IF($AL$421=1,IF(ISNUMBER(SEARCH($AK$421,'Hide this - Workings'!D188)),1,0),\"\")","v":""},{"$f":"IF($AL$422=1,IF(ISNUMBER(SEARCH($AK$422,'Hide this - Workings'!D188)),1,0),\"\")","v":""},{"$f":"IF($AL$423=1,IF(ISNUMBER(SEARCH($AK$423,'Hide this - Workings'!D188)),1,0),\"\")","v":""},{"$f":"IF($AL$424=1,IF(ISNUMBER(SEARCH($AK$424,'Hide this - Workings'!D188)),1,0),\"\")","v":""},{"$f":"IF($AL$425=1,IF(ISNUMBER(SEARCH($AK$425,'Hide this - Workings'!D188)),1,0),\"\")","v":""},{"$f":"IF($AL$426=1,IF(ISNUMBER(SEARCH($AK$426,'Hide this - Workings'!D188)),1,0),\"\")","v":""},{"$f":"IF($AL$427=1,IF(ISNUMBER(SEARCH($AK$427,'Hide this - Workings'!D188)),1,0),\"\")","v":""},{"$f":"IF($AL$428=1,IF(ISNUMBER(SEARCH($AK$428,'Hide this - Workings'!D188)),1,0),\"\")","v":""},{"$f":"IF($AL$429=1,IF(ISNUMBER(SEARCH($AK$429,'Hide this - Workings'!D188)),1,0),\"\")","v":""},{"$f":"IF($AL$430=1,IF(ISNUMBER(SEARCH($AK$430,'Hide this - Workings'!D188)),1,0),\"\")","v":""},{"$f":"IF($AL$431=1,IF(ISNUMBER(SEARCH($AK$431,'Hide this - Workings'!D188)),1,0),\"\")","v":""},{"$f":"IF($AL$432=1,IF(ISNUMBER(SEARCH($AK$432,'Hide this - Workings'!D188)),1,0),\"\")","v":""},{"$f":"IF($AL$433=1,IF(ISNUMBER(SEARCH($AK$433,'Hide this - Workings'!D188)),1,0),\"\")","v":""},0,"A184",0,0,0,0]
[null,null,null,null,null,null,null,null,null,null,null,null,null,{"$f":"IF($AL$417=1,IF(ISNUMBER(SEARCH($AK$417,'Hide this - Workings'!D189)),1,0),\"\")","v":""},{"$f":"IF($AL$418=1,IF(ISNUMBER(SEARCH($AK$418,'Hide this - Workings'!D189)),1,0),\"\")","v":""},{"$f":"IF($AL$419=1,IF(ISNUMBER(SEARCH($AK$419,'Hide this - Workings'!D189)),1,0),\"\")","v":""},{"$f":"IF($AL$420=1,IF(ISNUMBER(SEARCH($AK$420,'Hide this - Workings'!D189)),1,0),\"\")","v":""},{"$f":"IF($AL$421=1,IF(ISNUMBER(SEARCH($AK$421,'Hide this - Workings'!D189)),1,0),\"\")","v":""},{"$f":"IF($AL$422=1,IF(ISNUMBER(SEARCH($AK$422,'Hide this - Workings'!D189)),1,0),\"\")","v":""},{"$f":"IF($AL$423=1,IF(ISNUMBER(SEARCH($AK$423,'Hide this - Workings'!D189)),1,0),\"\")","v":""},{"$f":"IF($AL$424=1,IF(ISNUMBER(SEARCH($AK$424,'Hide this - Workings'!D189)),1,0),\"\")","v":""},{"$f":"IF($AL$425=1,IF(ISNUMBER(SEARCH($AK$425,'Hide this - Workings'!D189)),1,0),\"\")","v":""},{"$f":"IF($AL$426=1,IF(ISNUMBER(SEARCH($AK$426,'Hide this - Workings'!D189)),1,0),\"\")","v":""},{"$f":"IF($AL$427=1,IF(ISNUMBER(SEARCH($AK$427,'Hide this - Workings'!D189)),1,0),\"\")","v":""},{"$f":"IF($AL$428=1,IF(ISNUMBER(SEARCH($AK$428,'Hide this - Workings'!D189)),1,0),\"\")","v":""},{"$f":"IF($AL$429=1,IF(ISNUMBER(SEARCH($AK$429,'Hide this - Workings'!D189)),1,0),\"\")","v":""},{"$f":"IF($AL$430=1,IF(ISNUMBER(SEARCH($AK$430,'Hide this - Workings'!D189)),1,0),\"\")","v":""},{"$f":"IF($AL$431=1,IF(ISNUMBER(SEARCH($AK$431,'Hide this - Workings'!D189)),1,0),\"\")","v":""},{"$f":"IF($AL$432=1,IF(ISNUMBER(SEARCH($AK$432,'Hide this - Workings'!D189)),1,0),\"\")","v":""},{"$f":"IF($AL$433=1,IF(ISNUMBER(SEARCH($AK$433,'Hide this - Workings'!D189)),1,0),\"\")","v":""},0,"A185",0,0,0,0]
[null,null,null,null,null,null,null,null,null,null,null,null,null,{"$f":"IF($AL$417=1,IF(ISNUMBER(SEARCH($AK$417,'Hide this - Workings'!D190)),1,0),\"\")","v":""},{"$f":"IF($AL$418=1,IF(ISNUMBER(SEARCH($AK$418,'Hide this - Workings'!D190)),1,0),\"\")","v":""},{"$f":"IF($AL$419=1,IF(ISNUMBER(SEARCH($AK$419,'Hide this - Workings'!D190)),1,0),\"\")","v":""},{"$f":"IF($AL$420=1,IF(ISNUMBER(SEARCH($AK$420,'Hide this - Workings'!D190)),1,0),\"\")","v":""},{"$f":"IF($AL$421=1,IF(ISNUMBER(SEARCH($AK$421,'Hide this - Workings'!D190)),1,0),\"\")","v":""},{"$f":"IF($AL$422=1,IF(ISNUMBER(SEARCH($AK$422,'Hide this - Workings'!D190)),1,0),\"\")","v":""},{"$f":"IF($AL$423=1,IF(ISNUMBER(SEARCH($AK$423,'Hide this - Workings'!D190)),1,0),\"\")","v":""},{"$f":"IF($AL$424=1,IF(ISNUMBER(SEARCH($AK$424,'Hide this - Workings'!D190)),1,0),\"\")","v":""},{"$f":"IF($AL$425=1,IF(ISNUMBER(SEARCH($AK$425,'Hide this - Workings'!D190)),1,0),\"\")","v":""},{"$f":"IF($AL$426=1,IF(ISNUMBER(SEARCH($AK$426,'Hide this - Workings'!D190)),1,0),\"\")","v":""},{"$f":"IF($AL$427=1,IF(ISNUMBER(SEARCH($AK$427,'Hide this - Workings'!D190)),1,0),\"\")","v":""},{"$f":"IF($AL$428=1,IF(ISNUMBER(SEARCH($AK$428,'Hide this - Workings'!D190)),1,0),\"\")","v":""},{"$f":"IF($AL$429=1,IF(ISNUMBER(SEARCH($AK$429,'Hide this - Workings'!D190)),1,0),\"\")","v":""},{"$f":"IF($AL$430=1,IF(ISNUMBER(SEARCH($AK$430,'Hide this - Workings'!D190)),1,0),\"\")","v":""},{"$f":"IF($AL$431=1,IF(ISNUMBER(SEARCH($AK$431,'Hide this - Workings'!D190)),1,0),\"\")","v":""},{"$f":"IF($AL$432=1,IF(ISNUMBER(SEARCH($AK$432,'Hide this - Workings'!D190)),1,0),\"\")","v":""},{"$f":"IF($AL$433=1,IF(ISNUMBER(SEARCH($AK$433,'Hide this - Workings'!D190)),1,0),\"\")","v":""},0,"A186",0,0,0,0]
[null,null,null,null,null,null,null,null,null,null,null,null,null,{"$f":"IF($AL$417=1,IF(ISNUMBER(SEARCH($AK$417,'Hide this - Workings'!D191)),1,0),\"\")","v":""},{"$f":"IF($AL$418=1,IF(ISNUMBER(SEARCH($AK$418,'Hide this - Workings'!D191)),1,0),\"\")","v":""},{"$f":"IF($AL$419=1,IF(ISNUMBER(SEARCH($AK$419,'Hide this - Workings'!D191)),1,0),\"\")","v":""},{"$f":"IF($AL$420=1,IF(ISNUMBER(SEARCH($AK$420,'Hide this - Workings'!D191)),1,0),\"\")","v":""},{"$f":"IF($AL$421=1,IF(ISNUMBER(SEARCH($AK$421,'Hide this - Workings'!D191)),1,0),\"\")","v":""},{"$f":"IF($AL$422=1,IF(ISNUMBER(SEARCH($AK$422,'Hide this - Workings'!D191)),1,0),\"\")","v":""},{"$f":"IF($AL$423=1,IF(ISNUMBER(SEARCH($AK$423,'Hide this - Workings'!D191)),1,0),\"\")","v":""},{"$f":"IF($AL$424=1,IF(ISNUMBER(SEARCH($AK$424,'Hide this - Workings'!D191)),1,0),\"\")","v":""},{"$f":"IF($AL$425=1,IF(ISNUMBER(SEARCH($AK$425,'Hide this - Workings'!D191)),1,0),\"\")","v":""},{"$f":"IF($AL$426=1,IF(ISNUMBER(SEARCH($AK$426,'Hide this - Workings'!D191)),1,0),\"\")","v":""},{"$f":"IF($AL$427=1,IF(ISNUMBER(SEARCH($AK$427,'Hide this - Workings'!D191)),1,0),\"\")","v":""},{"$f":"IF($AL$428=1,IF(ISNUMBER(SEARCH($AK$428,'Hide this - Workings'!D191)),1,0),\"\")","v":""},{"$f":"IF($AL$429=1,IF(ISNUMBER(SEARCH($AK$429,'Hide this - Workings'!D191)),1,0),\"\")","v":""},{"$f":"IF($AL$430=1,IF(ISNUMBER(SEARCH($AK$430,'Hide this - Workings'!D191)),1,0),\"\")","v":""},{"$f":"IF($AL$431=1,IF(ISNUMBER(SEARCH($AK$431,'Hide this - Workings'!D191)),1,0),\"\")","v":""},{"$f":"IF($AL$432=1,IF(ISNUMBER(SEARCH($AK$432,'Hide this - Workings'!D191)),1,0),\"\")","v":""},{"$f":"IF($AL$433=1,IF(ISNUMBER(SEARCH($AK$433,'Hide this - Workings'!D191)),1,0),\"\")","v":""},0,"A187",0,0,0,0]
[null,null,null,null,null,null,null,null,null,null,null,null,null,{"$f":"IF($AL$417=1,IF(ISNUMBER(SEARCH($AK$417,'Hide this - Workings'!D192)),1,0),\"\")","v":""},{"$f":"IF($AL$418=1,IF(ISNUMBER(SEARCH($AK$418,'Hide this - Workings'!D192)),1,0),\"\")","v":""},{"$f":"IF($AL$419=1,IF(ISNUMBER(SEARCH($AK$419,'Hide this - Workings'!D192)),1,0),\"\")","v":""},{"$f":"IF($AL$420=1,IF(ISNUMBER(SEARCH($AK$420,'Hide this - Workings'!D192)),1,0),\"\")","v":""},{"$f":"IF($AL$421=1,IF(ISNUMBER(SEARCH($AK$421,'Hide this - Workings'!D192)),1,0),\"\")","v":""},{"$f":"IF($AL$422=1,IF(ISNUMBER(SEARCH($AK$422,'Hide this - Workings'!D192)),1,0),\"\")","v":""},{"$f":"IF($AL$423=1,IF(ISNUMBER(SEARCH($AK$423,'Hide this - Workings'!D192)),1,0),\"\")","v":""},{"$f":"IF($AL$424=1,IF(ISNUMBER(SEARCH($AK$424,'Hide this - Workings'!D192)),1,0),\"\")","v":""},{"$f":"IF($AL$425=1,IF(ISNUMBER(SEARCH($AK$425,'Hide this - Workings'!D192)),1,0),\"\")","v":""},{"$f":"IF($AL$426=1,IF(ISNUMBER(SEARCH($AK$426,'Hide this - Workings'!D192)),1,0),\"\")","v":""},{"$f":"IF($AL$427=1,IF(ISNUMBER(SEARCH($AK$427,'Hide this - Workings'!D192)),1,0),\"\")","v":""},{"$f":"IF($AL$428=1,IF(ISNUMBER(SEARCH($AK$428,'Hide this - Workings'!D192)),1,0),\"\")","v":""},{"$f":"IF($AL$429=1,IF(ISNUMBER(SEARCH($AK$429,'Hide this - Workings'!D192)),1,0),\"\")","v":""},{"$f":"IF($AL$430=1,IF(ISNUMBER(SEARCH($AK$430,'Hide this - Workings'!D192)),1,0),\"\")","v":""},{"$f":"IF($AL$431=1,IF(ISNUMBER(SEARCH($AK$431,'Hide this - Workings'!D192)),1,0),\"\")","v":""},{"$f":"IF($AL$432=1,IF(ISNUMBER(SEARCH($AK$432,'Hide this - Workings'!D192)),1,0),\"\")","v":""},{"$f":"IF($AL$433=1,IF(ISNUMBER(SEARCH($AK$433,'Hide this - Workings'!D192)),1,0),\"\")","v":""},0,"A188",0,0,0,0]
[null,null,null,null,null,null,null,null,null,null,null,null,null,{"$f":"IF($AL$417=1,IF(ISNUMBER(SEARCH($AK$417,'Hide this - Workings'!D193)),1,0),\"\")","v":""},{"$f":"IF($AL$418=1,IF(ISNUMBER(SEARCH($AK$418,'Hide this - Workings'!D193)),1,0),\"\")","v":""},{"$f":"IF($AL$419=1,IF(ISNUMBER(SEARCH($AK$419,'Hide this - Workings'!D193)),1,0),\"\")","v":""},{"$f":"IF($AL$420=1,IF(ISNUMBER(SEARCH($AK$420,'Hide this - Workings'!D193)),1,0),\"\")","v":""},{"$f":"IF($AL$421=1,IF(ISNUMBER(SEARCH($AK$421,'Hide this - Workings'!D193)),1,0),\"\")","v":""},{"$f":"IF($AL$422=1,IF(ISNUMBER(SEARCH($AK$422,'Hide this - Workings'!D193)),1,0),\"\")","v":""},{"$f":"IF($AL$423=1,IF(ISNUMBER(SEARCH($AK$423,'Hide this - Workings'!D193)),1,0),\"\")","v":""},{"$f":"IF($AL$424=1,IF(ISNUMBER(SEARCH($AK$424,'Hide this - Workings'!D193)),1,0),\"\")","v":""},{"$f":"IF($AL$425=1,IF(ISNUMBER(SEARCH($AK$425,'Hide this - Workings'!D193)),1,0),\"\")","v":""},{"$f":"IF($AL$426=1,IF(ISNUMBER(SEARCH($AK$426,'Hide this - Workings'!D193)),1,0),\"\")","v":""},{"$f":"IF($AL$427=1,IF(ISNUMBER(SEARCH($AK$427,'Hide this - Workings'!D193)),1,0),\"\")","v":""},{"$f":"IF($AL$428=1,IF(ISNUMBER(SEARCH($AK$428,'Hide this - Workings'!D193)),1,0),\"\")","v":""},{"$f":"IF($AL$429=1,IF(ISNUMBER(SEARCH($AK$429,'Hide this - Workings'!D193)),1,0),\"\")","v":""},{"$f":"IF($AL$430=1,IF(ISNUMBER(SEARCH($AK$430,'Hide this - Workings'!D193)),1,0),\"\")","v":""},{"$f":"IF($AL$431=1,IF(ISNUMBER(SEARCH($AK$431,'Hide this - Workings'!D193)),1,0),\"\")","v":""},{"$f":"IF($AL$432=1,IF(ISNUMBER(SEARCH($AK$432,'Hide this - Workings'!D193)),1,0),\"\")","v":""},{"$f":"IF($AL$433=1,IF(ISNUMBER(SEARCH($AK$433,'Hide this - Workings'!D193)),1,0),\"\")","v":""},0,"A189",0,0,0,0]
[null,null,null,null,null,null,null,null,null,null,null,null,null,{"$f":"IF($AL$417=1,IF(ISNUMBER(SEARCH($AK$417,'Hide this - Workings'!D194)),1,0),\"\")","v":""},{"$f":"IF($AL$418=1,IF(ISNUMBER(SEARCH($AK$418,'Hide this - Workings'!D194)),1,0),\"\")","v":""},{"$f":"IF($AL$419=1,IF(ISNUMBER(SEARCH($AK$419,'Hide this - Workings'!D194)),1,0),\"\")","v":""},{"$f":"IF($AL$420=1,IF(ISNUMBER(SEARCH($AK$420,'Hide this - Workings'!D194)),1,0),\"\")","v":""},{"$f":"IF($AL$421=1,IF(ISNUMBER(SEARCH($AK$421,'Hide this - Workings'!D194)),1,0),\"\")","v":""},{"$f":"IF($AL$422=1,IF(ISNUMBER(SEARCH($AK$422,'Hide this - Workings'!D194)),1,0),\"\")","v":""},{"$f":"IF($AL$423=1,IF(ISNUMBER(SEARCH($AK$423,'Hide this - Workings'!D194)),1,0),\"\")","v":""},{"$f":"IF($AL$424=1,IF(ISNUMBER(SEARCH($AK$424,'Hide this - Workings'!D194)),1,0),\"\")","v":""},{"$f":"IF($AL$425=1,IF(ISNUMBER(SEARCH($AK$425,'Hide this - Workings'!D194)),1,0),\"\")","v":""},{"$f":"IF($AL$426=1,IF(ISNUMBER(SEARCH($AK$426,'Hide this - Workings'!D194)),1,0),\"\")","v":""},{"$f":"IF($AL$427=1,IF(ISNUMBER(SEARCH($AK$427,'Hide this - Workings'!D194)),1,0),\"\")","v":""},{"$f":"IF($AL$428=1,IF(ISNUMBER(SEARCH($AK$428,'Hide this - Workings'!D194)),1,0),\"\")","v":""},{"$f":"IF($AL$429=1,IF(ISNUMBER(SEARCH($AK$429,'Hide this - Workings'!D194)),1,0),\"\")","v":""},{"$f":"IF($AL$430=1,IF(ISNUMBER(SEARCH($AK$430,'Hide this - Workings'!D194)),1,0),\"\")","v":""},{"$f":"IF($AL$431=1,IF(ISNUMBER(SEARCH($AK$431,'Hide this - Workings'!D194)),1,0),\"\")","v":""},{"$f":"IF($AL$432=1,IF(ISNUMBER(SEARCH($AK$432,'Hide this - Workings'!D194)),1,0),\"\")","v":""},{"$f":"IF($AL$433=1,IF(ISNUMBER(SEARCH($AK$433,'Hide this - Workings'!D194)),1,0),\"\")","v":""},0,"A190",0,0,0,0]
[null,null,null,null,null,null,null,null,null,null,null,null,null,{"$f":"IF($AL$417=1,IF(ISNUMBER(SEARCH($AK$417,'Hide this - Workings'!D195)),1,0),\"\")","v":""},{"$f":"IF($AL$418=1,IF(ISNUMBER(SEARCH($AK$418,'Hide this - Workings'!D195)),1,0),\"\")","v":""},{"$f":"IF($AL$419=1,IF(ISNUMBER(SEARCH($AK$419,'Hide this - Workings'!D195)),1,0),\"\")","v":""},{"$f":"IF($AL$420=1,IF(ISNUMBER(SEARCH($AK$420,'Hide this - Workings'!D195)),1,0),\"\")","v":""},{"$f":"IF($AL$421=1,IF(ISNUMBER(SEARCH($AK$421,'Hide this - Workings'!D195)),1,0),\"\")","v":""},{"$f":"IF($AL$422=1,IF(ISNUMBER(SEARCH($AK$422,'Hide this - Workings'!D195)),1,0),\"\")","v":""},{"$f":"IF($AL$423=1,IF(ISNUMBER(SEARCH($AK$423,'Hide this - Workings'!D195)),1,0),\"\")","v":""},{"$f":"IF($AL$424=1,IF(ISNUMBER(SEARCH($AK$424,'Hide this - Workings'!D195)),1,0),\"\")","v":""},{"$f":"IF($AL$425=1,IF(ISNUMBER(SEARCH($AK$425,'Hide this - Workings'!D195)),1,0),\"\")","v":""},{"$f":"IF($AL$426=1,IF(ISNUMBER(SEARCH($AK$426,'Hide this - Workings'!D195)),1,0),\"\")","v":""},{"$f":"IF($AL$427=1,IF(ISNUMBER(SEARCH($AK$427,'Hide this - Workings'!D195)),1,0),\"\")","v":""},{"$f":"IF($AL$428=1,IF(ISNUMBER(SEARCH($AK$428,'Hide this - Workings'!D195)),1,0),\"\")","v":""},{"$f":"IF($AL$429=1,IF(ISNUMBER(SEARCH($AK$429,'Hide this - Workings'!D195)),1,0),\"\")","v":""},{"$f":"IF($AL$430=1,IF(ISNUMBER(SEARCH($AK$430,'Hide this - Workings'!D195)),1,0),\"\")","v":""},{"$f":"IF($AL$431=1,IF(ISNUMBER(SEARCH($AK$431,'Hide this - Workings'!D195)),1,0),\"\")","v":""},{"$f":"IF($AL$432=1,IF(ISNUMBER(SEARCH($AK$432,'Hide this - Workings'!D195)),1,0),\"\")","v":""},{"$f":"IF($AL$433=1,IF(ISNUMBER(SEARCH($AK$433,'Hide this - Workings'!D195)),1,0),\"\")","v":""},0,"A191",0,0,0,0]
[null,null,null,null,null,null,null,null,null,null,null,null,null,{"$f":"IF($AL$417=1,IF(ISNUMBER(SEARCH($AK$417,'Hide this - Workings'!D196)),1,0),\"\")","v":""},{"$f":"IF($AL$418=1,IF(ISNUMBER(SEARCH($AK$418,'Hide this - Workings'!D196)),1,0),\"\")","v":""},{"$f":"IF($AL$419=1,IF(ISNUMBER(SEARCH($AK$419,'Hide this - Workings'!D196)),1,0),\"\")","v":""},{"$f":"IF($AL$420=1,IF(ISNUMBER(SEARCH($AK$420,'Hide this - Workings'!D196)),1,0),\"\")","v":""},{"$f":"IF($AL$421=1,IF(ISNUMBER(SEARCH($AK$421,'Hide this - Workings'!D196)),1,0),\"\")","v":""},{"$f":"IF($AL$422=1,IF(ISNUMBER(SEARCH($AK$422,'Hide this - Workings'!D196)),1,0),\"\")","v":""},{"$f":"IF($AL$423=1,IF(ISNUMBER(SEARCH($AK$423,'Hide this - Workings'!D196)),1,0),\"\")","v":""},{"$f":"IF($AL$424=1,IF(ISNUMBER(SEARCH($AK$424,'Hide this - Workings'!D196)),1,0),\"\")","v":""},{"$f":"IF($AL$425=1,IF(ISNUMBER(SEARCH($AK$425,'Hide this - Workings'!D196)),1,0),\"\")","v":""},{"$f":"IF($AL$426=1,IF(ISNUMBER(SEARCH($AK$426,'Hide this - Workings'!D196)),1,0),\"\")","v":""},{"$f":"IF($AL$427=1,IF(ISNUMBER(SEARCH($AK$427,'Hide this - Workings'!D196)),1,0),\"\")","v":""},{"$f":"IF($AL$428=1,IF(ISNUMBER(SEARCH($AK$428,'Hide this - Workings'!D196)),1,0),\"\")","v":""},{"$f":"IF($AL$429=1,IF(ISNUMBER(SEARCH($AK$429,'Hide this - Workings'!D196)),1,0),\"\")","v":""},{"$f":"IF($AL$430=1,IF(ISNUMBER(SEARCH($AK$430,'Hide this - Workings'!D196)),1,0),\"\")","v":""},{"$f":"IF($AL$431=1,IF(ISNUMBER(SEARCH($AK$431,'Hide this - Workings'!D196)),1,0),\"\")","v":""},{"$f":"IF($AL$432=1,IF(ISNUMBER(SEARCH($AK$432,'Hide this - Workings'!D196)),1,0),\"\")","v":""},{"$f":"IF($AL$433=1,IF(ISNUMBER(SEARCH($AK$433,'Hide this - Workings'!D196)),1,0),\"\")","v":""},0,"A192",0,0,0,0]
[null,null,null,null,null,null,null,null,null,null,null,null,null,{"$f":"IF($AL$417=1,IF(ISNUMBER(SEARCH($AK$417,'Hide this - Workings'!D197)),1,0),\"\")","v":""},{"$f":"IF($AL$418=1,IF(ISNUMBER(SEARCH($AK$418,'Hide this - Workings'!D197)),1,0),\"\")","v":""},{"$f":"IF($AL$419=1,IF(ISNUMBER(SEARCH($AK$419,'Hide this - Workings'!D197)),1,0),\"\")","v":""},{"$f":"IF($AL$420=1,IF(ISNUMBER(SEARCH($AK$420,'Hide this - Workings'!D197)),1,0),\"\")","v":""},{"$f":"IF($AL$421=1,IF(ISNUMBER(SEARCH($AK$421,'Hide this - Workings'!D197)),1,0),\"\")","v":""},{"$f":"IF($AL$422=1,IF(ISNUMBER(SEARCH($AK$422,'Hide this - Workings'!D197)),1,0),\"\")","v":""},{"$f":"IF($AL$423=1,IF(ISNUMBER(SEARCH($AK$423,'Hide this - Workings'!D197)),1,0),\"\")","v":""},{"$f":"IF($AL$424=1,IF(ISNUMBER(SEARCH($AK$424,'Hide this - Workings'!D197)),1,0),\"\")","v":""},{"$f":"IF($AL$425=1,IF(ISNUMBER(SEARCH($AK$425,'Hide this - Workings'!D197)),1,0),\"\")","v":""},{"$f":"IF($AL$426=1,IF(ISNUMBER(SEARCH($AK$426,'Hide this - Workings'!D197)),1,0),\"\")","v":""},{"$f":"IF($AL$427=1,IF(ISNUMBER(SEARCH($AK$427,'Hide this - Workings'!D197)),1,0),\"\")","v":""},{"$f":"IF($AL$428=1,IF(ISNUMBER(SEARCH($AK$428,'Hide this - Workings'!D197)),1,0),\"\")","v":""},{"$f":"IF($AL$429=1,IF(ISNUMBER(SEARCH($AK$429,'Hide this - Workings'!D197)),1,0),\"\")","v":""},{"$f":"IF($AL$430=1,IF(ISNUMBER(SEARCH($AK$430,'Hide this - Workings'!D197)),1,0),\"\")","v":""},{"$f":"IF($AL$431=1,IF(ISNUMBER(SEARCH($AK$431,'Hide this - Workings'!D197)),1,0),\"\")","v":""},{"$f":"IF($AL$432=1,IF(ISNUMBER(SEARCH($AK$432,'Hide this - Workings'!D197)),1,0),\"\")","v":""},{"$f":"IF($AL$433=1,IF(ISNUMBER(SEARCH($AK$433,'Hide this - Workings'!D197)),1,0),\"\")","v":""},0,"A193",0,0,0,0]
[null,null,null,null,null,null,null,null,null,null,null,null,null,{"$f":"IF($AL$417=1,IF(ISNUMBER(SEARCH($AK$417,'Hide this - Workings'!D198)),1,0),\"\")","v":""},{"$f":"IF($AL$418=1,IF(ISNUMBER(SEARCH($AK$418,'Hide this - Workings'!D198)),1,0),\"\")","v":""},{"$f":"IF($AL$419=1,IF(ISNUMBER(SEARCH($AK$419,'Hide this - Workings'!D198)),1,0),\"\")","v":""},{"$f":"IF($AL$420=1,IF(ISNUMBER(SEARCH($AK$420,'Hide this - Workings'!D198)),1,0),\"\")","v":""},{"$f":"IF($AL$421=1,IF(ISNUMBER(SEARCH($AK$421,'Hide this - Workings'!D198)),1,0),\"\")","v":""},{"$f":"IF($AL$422=1,IF(ISNUMBER(SEARCH($AK$422,'Hide this - Workings'!D198)),1,0),\"\")","v":""},{"$f":"IF($AL$423=1,IF(ISNUMBER(SEARCH($AK$423,'Hide this - Workings'!D198)),1,0),\"\")","v":""},{"$f":"IF($AL$424=1,IF(ISNUMBER(SEARCH($AK$424,'Hide this - Workings'!D198)),1,0),\"\")","v":""},{"$f":"IF($AL$425=1,IF(ISNUMBER(SEARCH($AK$425,'Hide this - Workings'!D198)),1,0),\"\")","v":""},{"$f":"IF($AL$426=1,IF(ISNUMBER(SEARCH($AK$426,'Hide this - Workings'!D198)),1,0),\"\")","v":""},{"$f":"IF($AL$427=1,IF(ISNUMBER(SEARCH($AK$427,'Hide this - Workings'!D198)),1,0),\"\")","v":""},{"$f":"IF($AL$428=1,IF(ISNUMBER(SEARCH($AK$428,'Hide this - Workings'!D198)),1,0),\"\")","v":""},{"$f":"IF($AL$429=1,IF(ISNUMBER(SEARCH($AK$429,'Hide this - Workings'!D198)),1,0),\"\")","v":""},{"$f":"IF($AL$430=1,IF(ISNUMBER(SEARCH($AK$430,'Hide this - Workings'!D198)),1,0),\"\")","v":""},{"$f":"IF($AL$431=1,IF(ISNUMBER(SEARCH($AK$431,'Hide this - Workings'!D198)),1,0),\"\")","v":""},{"$f":"IF($AL$432=1,IF(ISNUMBER(SEARCH($AK$432,'Hide this - Workings'!D198)),1,0),\"\")","v":""},{"$f":"IF($AL$433=1,IF(ISNUMBER(SEARCH($AK$433,'Hide this - Workings'!D198)),1,0),\"\")","v":""},0,"A194",0,0,0,0]
[null,null,null,null,null,null,null,null,null,null,null,null,null,{"$f":"IF($AL$417=1,IF(ISNUMBER(SEARCH($AK$417,'Hide this - Workings'!D199)),1,0),\"\")","v":""},{"$f":"IF($AL$418=1,IF(ISNUMBER(SEARCH($AK$418,'Hide this - Workings'!D199)),1,0),\"\")","v":""},{"$f":"IF($AL$419=1,IF(ISNUMBER(SEARCH($AK$419,'Hide this - Workings'!D199)),1,0),\"\")","v":""},{"$f":"IF($AL$420=1,IF(ISNUMBER(SEARCH($AK$420,'Hide this - Workings'!D199)),1,0),\"\")","v":""},{"$f":"IF($AL$421=1,IF(ISNUMBER(SEARCH($AK$421,'Hide this - Workings'!D199)),1,0),\"\")","v":""},{"$f":"IF($AL$422=1,IF(ISNUMBER(SEARCH($AK$422,'Hide this - Workings'!D199)),1,0),\"\")","v":""},{"$f":"IF($AL$423=1,IF(ISNUMBER(SEARCH($AK$423,'Hide this - Workings'!D199)),1,0),\"\")","v":""},{"$f":"IF($AL$424=1,IF(ISNUMBER(SEARCH($AK$424,'Hide this - Workings'!D199)),1,0),\"\")","v":""},{"$f":"IF($AL$425=1,IF(ISNUMBER(SEARCH($AK$425,'Hide this - Workings'!D199)),1,0),\"\")","v":""},{"$f":"IF($AL$426=1,IF(ISNUMBER(SEARCH($AK$426,'Hide this - Workings'!D199)),1,0),\"\")","v":""},{"$f":"IF($AL$427=1,IF(ISNUMBER(SEARCH($AK$427,'Hide this - Workings'!D199)),1,0),\"\")","v":""},{"$f":"IF($AL$428=1,IF(ISNUMBER(SEARCH($AK$428,'Hide this - Workings'!D199)),1,0),\"\")","v":""},{"$f":"IF($AL$429=1,IF(ISNUMBER(SEARCH($AK$429,'Hide this - Workings'!D199)),1,0),\"\")","v":""},{"$f":"IF($AL$430=1,IF(ISNUMBER(SEARCH($AK$430,'Hide this - Workings'!D199)),1,0),\"\")","v":""},{"$f":"IF($AL$431=1,IF(ISNUMBER(SEARCH($AK$431,'Hide this - Workings'!D199)),1,0),\"\")","v":""},{"$f":"IF($AL$432=1,IF(ISNUMBER(SEARCH($AK$432,'Hide this - Workings'!D199)),1,0),\"\")","v":""},{"$f":"IF($AL$433=1,IF(ISNUMBER(SEARCH($AK$433,'Hide this - Workings'!D199)),1,0),\"\")","v":""},0,"A195",0,0,0,0]
[null,null,null,null,null,null,null,null,null,null,null,null,null,{"$f":"IF($AL$417=1,IF(ISNUMBER(SEARCH($AK$417,'Hide this - Workings'!D200)),1,0),\"\")","v":""},{"$f":"IF($AL$418=1,IF(ISNUMBER(SEARCH($AK$418,'Hide this - Workings'!D200)),1,0),\"\")","v":""},{"$f":"IF($AL$419=1,IF(ISNUMBER(SEARCH($AK$419,'Hide this - Workings'!D200)),1,0),\"\")","v":""},{"$f":"IF($AL$420=1,IF(ISNUMBER(SEARCH($AK$420,'Hide this - Workings'!D200)),1,0),\"\")","v":""},{"$f":"IF($AL$421=1,IF(ISNUMBER(SEARCH($AK$421,'Hide this - Workings'!D200)),1,0),\"\")","v":""},{"$f":"IF($AL$422=1,IF(ISNUMBER(SEARCH($AK$422,'Hide this - Workings'!D200)),1,0),\"\")","v":""},{"$f":"IF($AL$423=1,IF(ISNUMBER(SEARCH($AK$423,'Hide this - Workings'!D200)),1,0),\"\")","v":""},{"$f":"IF($AL$424=1,IF(ISNUMBER(SEARCH($AK$424,'Hide this - Workings'!D200)),1,0),\"\")","v":""},{"$f":"IF($AL$425=1,IF(ISNUMBER(SEARCH($AK$425,'Hide this - Workings'!D200)),1,0),\"\")","v":""},{"$f":"IF($AL$426=1,IF(ISNUMBER(SEARCH($AK$426,'Hide this - Workings'!D200)),1,0),\"\")","v":""},{"$f":"IF($AL$427=1,IF(ISNUMBER(SEARCH($AK$427,'Hide this - Workings'!D200)),1,0),\"\")","v":""},{"$f":"IF($AL$428=1,IF(ISNUMBER(SEARCH($AK$428,'Hide this - Workings'!D200)),1,0),\"\")","v":""},{"$f":"IF($AL$429=1,IF(ISNUMBER(SEARCH($AK$429,'Hide this - Workings'!D200)),1,0),\"\")","v":""},{"$f":"IF($AL$430=1,IF(ISNUMBER(SEARCH($AK$430,'Hide this - Workings'!D200)),1,0),\"\")","v":""},{"$f":"IF($AL$431=1,IF(ISNUMBER(SEARCH($AK$431,'Hide this - Workings'!D200)),1,0),\"\")","v":""},{"$f":"IF($AL$432=1,IF(ISNUMBER(SEARCH($AK$432,'Hide this - Workings'!D200)),1,0),\"\")","v":""},{"$f":"IF($AL$433=1,IF(ISNUMBER(SEARCH($AK$433,'Hide this - Workings'!D200)),1,0),\"\")","v":""},0,"A196",0,0,0,0]
[null,null,null,null,null,null,null,null,null,null,null,null,null,{"$f":"IF($AL$417=1,IF(ISNUMBER(SEARCH($AK$417,'Hide this - Workings'!D201)),1,0),\"\")","v":""},{"$f":"IF($AL$418=1,IF(ISNUMBER(SEARCH($AK$418,'Hide this - Workings'!D201)),1,0),\"\")","v":""},{"$f":"IF($AL$419=1,IF(ISNUMBER(SEARCH($AK$419,'Hide this - Workings'!D201)),1,0),\"\")","v":""},{"$f":"IF($AL$420=1,IF(ISNUMBER(SEARCH($AK$420,'Hide this - Workings'!D201)),1,0),\"\")","v":""},{"$f":"IF($AL$421=1,IF(ISNUMBER(SEARCH($AK$421,'Hide this - Workings'!D201)),1,0),\"\")","v":""},{"$f":"IF($AL$422=1,IF(ISNUMBER(SEARCH($AK$422,'Hide this - Workings'!D201)),1,0),\"\")","v":""},{"$f":"IF($AL$423=1,IF(ISNUMBER(SEARCH($AK$423,'Hide this - Workings'!D201)),1,0),\"\")","v":""},{"$f":"IF($AL$424=1,IF(ISNUMBER(SEARCH($AK$424,'Hide this - Workings'!D201)),1,0),\"\")","v":""},{"$f":"IF($AL$425=1,IF(ISNUMBER(SEARCH($AK$425,'Hide this - Workings'!D201)),1,0),\"\")","v":""},{"$f":"IF($AL$426=1,IF(ISNUMBER(SEARCH($AK$426,'Hide this - Workings'!D201)),1,0),\"\")","v":""},{"$f":"IF($AL$427=1,IF(ISNUMBER(SEARCH($AK$427,'Hide this - Workings'!D201)),1,0),\"\")","v":""},{"$f":"IF($AL$428=1,IF(ISNUMBER(SEARCH($AK$428,'Hide this - Workings'!D201)),1,0),\"\")","v":""},{"$f":"IF($AL$429=1,IF(ISNUMBER(SEARCH($AK$429,'Hide this - Workings'!D201)),1,0),\"\")","v":""},{"$f":"IF($AL$430=1,IF(ISNUMBER(SEARCH($AK$430,'Hide this - Workings'!D201)),1,0),\"\")","v":""},{"$f":"IF($AL$431=1,IF(ISNUMBER(SEARCH($AK$431,'Hide this - Workings'!D201)),1,0),\"\")","v":""},{"$f":"IF($AL$432=1,IF(ISNUMBER(SEARCH($AK$432,'Hide this - Workings'!D201)),1,0),\"\")","v":""},{"$f":"IF($AL$433=1,IF(ISNUMBER(SEARCH($AK$433,'Hide this - Workings'!D201)),1,0),\"\")","v":""},0,"A197",0,0,0,0]
[null,null,null,null,null,null,null,null,null,null,null,null,null,{"$f":"IF($AL$417=1,IF(ISNUMBER(SEARCH($AK$417,'Hide this - Workings'!D202)),1,0),\"\")","v":""},{"$f":"IF($AL$418=1,IF(ISNUMBER(SEARCH($AK$418,'Hide this - Workings'!D202)),1,0),\"\")","v":""},{"$f":"IF($AL$419=1,IF(ISNUMBER(SEARCH($AK$419,'Hide this - Workings'!D202)),1,0),\"\")","v":""},{"$f":"IF($AL$420=1,IF(ISNUMBER(SEARCH($AK$420,'Hide this - Workings'!D202)),1,0),\"\")","v":""},{"$f":"IF($AL$421=1,IF(ISNUMBER(SEARCH($AK$421,'Hide this - Workings'!D202)),1,0),\"\")","v":""},{"$f":"IF($AL$422=1,IF(ISNUMBER(SEARCH($AK$422,'Hide this - Workings'!D202)),1,0),\"\")","v":""},{"$f":"IF($AL$423=1,IF(ISNUMBER(SEARCH($AK$423,'Hide this - Workings'!D202)),1,0),\"\")","v":""},{"$f":"IF($AL$424=1,IF(ISNUMBER(SEARCH($AK$424,'Hide this - Workings'!D202)),1,0),\"\")","v":""},{"$f":"IF($AL$425=1,IF(ISNUMBER(SEARCH($AK$425,'Hide this - Workings'!D202)),1,0),\"\")","v":""},{"$f":"IF($AL$426=1,IF(ISNUMBER(SEARCH($AK$426,'Hide this - Workings'!D202)),1,0),\"\")","v":""},{"$f":"IF($AL$427=1,IF(ISNUMBER(SEARCH($AK$427,'Hide this - Workings'!D202)),1,0),\"\")","v":""},{"$f":"IF($AL$428=1,IF(ISNUMBER(SEARCH($AK$428,'Hide this - Workings'!D202)),1,0),\"\")","v":""},{"$f":"IF($AL$429=1,IF(ISNUMBER(SEARCH($AK$429,'Hide this - Workings'!D202)),1,0),\"\")","v":""},{"$f":"IF($AL$430=1,IF(ISNUMBER(SEARCH($AK$430,'Hide this - Workings'!D202)),1,0),\"\")","v":""},{"$f":"IF($AL$431=1,IF(ISNUMBER(SEARCH($AK$431,'Hide this - Workings'!D202)),1,0),\"\")","v":""},{"$f":"IF($AL$432=1,IF(ISNUMBER(SEARCH($AK$432,'Hide this - Workings'!D202)),1,0),\"\")","v":""},{"$f":"IF($AL$433=1,IF(ISNUMBER(SEARCH($AK$433,'Hide this - Workings'!D202)),1,0),\"\")","v":""},0,"A198",0,0,0,0]
[null,null,null,null,null,null,null,null,null,null,null,null,null,null,null,null,null,null,null,null,null,null,null,null,null,null,null,null,null,null,{"$f":"SUM(N203:AD203)","v":0},"A199",{"$f":"AE203","v":0}]
[null,null,null,null,null,null,null,null,null,null,null,null,null,null,null,null,null,null,null,null,null,null,null,null,null,null,null,null,null,null,0,"A200",0]
[]
[]
[]
[]
[]
[]
[]
[]
[null,"Number of iterations needed","Reference of FAQ","Number of search terms in FAQ"]
[null,0,{"$f":"IF((B214<(1+$E$2)),(LEFT(RIGHT($C$2,(($D$2)-(B214*4))),4)),\"\")","v":""},{"$f":"IFERROR(VLOOKUP(C214,AF5:AG202,2),0)","v":0},{"$f":"_xlfn._xlws.SORT(C214:D345,2,-1)","v":""},0]
[null,{"$f":"IFERROR(IF((1+B214)<($E$2),1+B214,\"\"),\"\")","v":""},{"$f":"IF((B215<(1+$E$2)),(LEFT(RIGHT($C$2,(($D$2)-(B215*4))),4)),\"\")","v":""},0,"",0]
[null,{"$f":"IFERROR(IF((1+B215)<($E$2),1+B215,\"\"),\"\")","v":""},{"$f":"IF((B216<(1+$E$2)),(LEFT(RIGHT($C$2,(($D$2)-(B216*4))),4)),\"\")","v":""},0,"",0]
[null,"","",0,"",0]
[null,"","",0,"",0]
[null,"","",0,"",0]
[null,"","",0,"",0]
[null,"","",0,"",0]
[null,"","",0,"",0]
[null,"","",0,"",0]
[null,"","",0,"",0]
[null,"","",0,"",0]
[null,"","",0,"",0]
[null,"","",0,"",0]
[null,"","",0,"",0]
[null,"","",0,"",0]
[null,"","",0,"",0]
[null,"","",0,"",0]
[null,"","",0,"",0]
[null,"","",0,"",0]
[null,"","",0,"",0]
[null,"","",0,"",0]
[null,"","",0,"",0]
[null,"","",0,"",0]
[null,"","",0,"",0]
[null,"","",0,"",0]
[null,"","",0,"",0]
[null,"","",0,"",0]
[null,"","",0,"",0]
[null,"","",0,"",0]
[null,"","",0,"",0]
[null,"","",0,"",0]
[null,"","",{"$f":"IFERROR(VLOOKUP(C246,AF37:AG234,2),0)","v":0},"",0]
[null,"","",0,"",0]
[null,"","",0,"",0]
[null,"","",0,"",0]
[null,"","",0,"",0]
[null,"","",0,"",0]
[null,"","",0,"",0]
[null,"","",0,"",0]
[null,"","",0,"",0]
[null,"","",0,"",0]
[null,"","",0,"",0]
[null,"","",0,"",0]
[null,"","",0,"",0]
[null,"","",0,"",0]
[null,"","",0,"",0]
[null,"","",0,"",0]
[null,"","",0,"",0]
[null,"","",0,"",0]
[null,"","",0,"",0]
[null,"","",0,"",0]
[null,"","",0,"",0]
[null,"","",0,"",0]
[null,"","",0,"",0]
[null,"","",0,"",0]
[null,"","",0,"",0]
[null,"","",0,"",0]
[null,"","",0,"",0]
[null,"","",0,"",0]
[null,"","",0,"",0]
[null,"","",0,"",0]
[null,"","",0,"",0]
[null,"","",0,"",0]
[null,"","",{"$f":"IFERROR(VLOOKUP(C278,AF69:AG266,2),0)","v":0},"",0]
[null,"","",0,"",0]
[null,{"$f":"IFERROR(IF((1+B279)<($E$2),1+B279,\"\"),\"\")","v":""},{"$f":"IF((B280<(1+$E$2)),(LEFT(RIGHT($C$2,(($D$2)-(B280*4))),4)),\"\")","v":""},0,"",0]
[null,"","",0,"",0]
[null,"","",0,"",0]
[null,"","",0,"",0]
[null,"","",0,"",0]
[null,"","",0,"",0]
[null,"","",0,"",0]
[null,"","",0,"",0]
[null,"","",0,"",0]
[null,"","",0,"",0]
[null,"","",0,"",0]
[null,"","",0,"",0]
[null,"","",{"$f":"IFERROR(VLOOKUP(C292,AF82:AG280,2),0)","v":0},"",0]
[null,"","",{"$f":"IFERROR(VLOOKUP(C293,AF83:AG281,2),0)","v":0},"",0]
[null,"","",{"$f":"IFERROR(VLOOKUP(C294,AF83:AG282,2),0)","v":0},"",0]
[null,"","",0,"",0]
[null,"","",0,"",0]
[null,"","",0,"",0]
[null,"","",0,"",0]
[null,"","",0,"",0]
[null,"","",0,"",0]
[null,"","",0,"",0]
[null,"","",0,"",0]
[null,"","",0,"",0]
[null,"","",0,"",0]
[null,"","",0,"",0]
[null,"","",0,"",0]
[null,"","",0,"",0]
[null,"","",0,"",0]
[null,"","",0,"",0]
[null,"","",0,"",0]
[null,"","",0,"",0]
[null,"","",0,"",0]
[null,"","",0,"",0]
[null,"","",0,"",0]
[null,"","",0,"",0]
[null,"","",0,"",0]
[null,"","",0,"",0]
[null,"","",0,"",0]
[null,"","",0,"",0]
[null,"","",0,"",0]
[null,"","",0,"",0]
[null,"","",0,"",0]
[null,"","",0,"",0]
[null,"","",0,"",0]
[null,"","",0,"",0]
[null,"","",0,"",0]
[null,"","",0,"",0]
[null,"","",0,"",0]
[null,"","",0,"",0]
[null,"","",0,"",0]
[null,"","",0,"",0]
[null,"","",0,"",0]
[null,"","",0,"",0]
[null,"","",0,"",0]
[null,"","",0,"",0]
[null,"","",0,"",0]
[null,"","",0,"",0]
[null,"","",0,"",0]
[null,"","",0,"",0]
[null,"","",0,"",0]
[null,"","",0,"",0]
[null,"","",0,"",0]
[null,"","",{"$f":"IFERROR(VLOOKUP(C343,AF132:AG331,2),0)","v":0},"",0]
[null,{"$f":"IFERROR(IF((1+B343)<($E$2),1+B343,\"\"),\"\")","v":""},{"$f":"IF((B344<(1+$E$2)),(LEFT(RIGHT($C$2,(($D$2)-(B344*4))),4)),\"\")","v":""},0,"",0]
[null,"","",0,"",0]
[]
[]
[]
[]
[]
[]
[]
[]
[]
[]
[]
[]
[]
[]
[]
[]
[]
[]
[]
[]
[]
[]
[]
[]
[]
[]
[]
[]
[]
[]
[]
[]
[]
[]
[]
[]
[]
[]
[]
[]
[]
[]
[]
[]
[]
[]
[]
[]
[]
[]
[]
[]
[]
[]
[]
[]
[]
[]
[]
[]
[]
[]
[]
[]
[]
[]
[]
[]
[]
[]
[null,null,null,null,null,null,null,null,null,null,null,null,null,null,null,null,null,null,null,null,null,null,null,null,null,null,null,null,null,null,null,null,null,null,null,"Breaking down the search string","Terms to search","Count search terms","Count number of matches"]
[null,null,null,null,null,null,null,null,null,null,null,null,null,null,null,null,null,null,null,null,null,null,null,null,null,null,null,null,null,null,null,null,null,null,null,{"$f":"'Search Page'!$C$10","v":""},{"$f":"IFERROR(LEFT( AJ417, SEARCH( \" \", AJ417 ) -1 ),AJ417)","v":""},{"$f":"IFERROR(SEARCH(AK417,AJ417),0)","v":0},{"$f":"IF(IFERROR(SEARCH(AK417,AJ417),0)=1,IF(ISNUMBER(SEARCH(AK417,'Hide this - Workings'!$D$5)),1,0),\"\")","v":""}]
[null,null,null,null,null,null,null,null,null,null,null,null,null,null,null,null,null,null,null,null,null,null,null,null,null,null,null,null,null,null,null,null,null,null,null,{"$f":"IFERROR(RIGHT( AJ417, LEN(AJ417) - SEARCH( \" \", AJ417 )),\"\")","v":""},{"$f":"IFERROR(LEFT( AJ418, SEARCH( \" \", AJ418 ) -1 ),AJ418)","v":""},{"$f":"IFERROR(SEARCH(AK418,AJ418),0)","v":0},{"$f":"IF(IFERROR(SEARCH(AK418,AJ418),0)=1,IF(ISNUMBER(SEARCH(AK418,'Hide this - Workings'!$D$5)),1,0),\"\")","v":""}]
[null,null,null,null,null,null,null,null,null,null,null,null,null,null,null,null,null,null,null,null,null,null,null,null,null,null,null,null,null,null,null,null,null,null,null,{"$f":"IFERROR(RIGHT( AJ418, LEN(AJ418) - SEARCH( \" \", AJ418 )),\"\")","v":""},"",0,{"$f":"IF(IFERROR(SEARCH(AK419,AJ419),0)=1,IF(ISNUMBER(SEARCH(AK419,'Hide this - Workings'!$D$5)),1,0),\"\")","v":""}]
[null,null,null,null,null,null,null,null,null,null,null,null,null,null,null,null,null,null,null,null,null,null,null,null,null,null,null,null,null,null,null,null,null,null,null,"","",0,{"$f":"IF(IFERROR(SEARCH(AK420,AJ420),0)=1,IF(ISNUMBER(SEARCH(AK420,'Hide this - Workings'!$D$5)),1,0),\"\")","v":""}]
[null,null,null,null,null,null,null,null,null,null,null,null,null,null,null,null,null,null,null,null,null,null,null,null,null,null,null,null,null,null,null,null,null,null,null,"","",0,{"$f":"IF(IFERROR(SEARCH(AK421,AJ421),0)=1,IF(ISNUMBER(SEARCH(AK421,'Hide this - Workings'!$D$5)),1,0),\"\")","v":""}]
[null,null,null,null,null,null,null,null,null,null,null,null,null,null,null,null,null,null,null,null,null,null,null,null,null,null,null,null,null,null,null,null,null,null,null,"","",0,{"$f":"IF(IFERROR(SEARCH(AK422,AJ422),0)=1,IF(ISNUMBER(SEARCH(AK422,'Hide this - Workings'!$D$5)),1,0),\"\")","v":""}]
[null,null,null,null,null,null,null,null,null,null,null,null,null,null,null,null,null,null,null,null,null,null,null,null,null,null,null,null,null,null,null,null,null,null,null,{"$f":"IFERROR(RIGHT( AJ422, LEN(AJ422) - SEARCH( \" \", AJ422 )),\"\")","v":""},"",0,{"$f":"IF(IFERROR(SEARCH(AK423,AJ423),0)=1,IF(ISNUMBER(SEARCH(AK423,'Hide this - Workings'!$D$5)),1,0),\"\")","v":""}]
[null,null,null,null,null,null,null,null,null,null,null,null,null,null,null,null,null,null,null,null,null,null,null,null,null,null,null,null,null,null,null,null,null,null,null,{"$f":"IFERROR(RIGHT( AJ423, LEN(AJ423) - SEARCH( \" \", AJ423 )),\"\")","v":""},"",0,{"$f":"IF(IFERROR(SEARCH(AK424,AJ424),0)=1,IF(ISNUMBER(SEARCH(AK424,'Hide this - Workings'!$D$5)),1,0),\"\")","v":""}]
[null,null,null,null,null,null,null,null,null,null,null,null,null,null,null,null,null,null,null,null,null,null,null,null,null,null,null,null,null,null,null,null,null,null,null,"","",0,{"$f":"IF(IFERROR(SEARCH(AK425,AJ425),0)=1,IF(ISNUMBER(SEARCH(AK425,'Hide this - Workings'!$D$5)),1,0),\"\")","v":""}]
[null,null,null,null,null,null,null,null,null,null,null,null,null,null,null,null,null,null,null,null,null,null,null,null,null,null,null,null,null,null,null,null,null,null,null,"","",0,{"$f":"IF(IFERROR(SEARCH(AK426,AJ426),0)=1,IF(ISNUMBER(SEARCH(AK426,'Hide this - Workings'!$D$5)),1,0),\"\")","v":""}]
[null,null,null,null,null,null,null,null,null,null,null,null,null,null,null,null,null,null,null,null,null,null,null,null,null,null,null,null,null,null,null,null,null,null,null,"","",0,{"$f":"IF(IFERROR(SEARCH(AK427,AJ427),0)=1,IF(ISNUMBER(SEARCH(AK427,'Hide this - Workings'!$D$5)),1,0),\"\")","v":""}]
[null,null,null,null,null,null,null,null,null,null,null,null,null,null,null,null,null,null,null,null,null,null,null,null,null,null,null,null,null,null,null,null,null,null,null,"","",0,{"$f":"IF(IFERROR(SEARCH(AK428,AJ428),0)=1,IF(ISNUMBER(SEARCH(AK428,'Hide this - Workings'!$D$5)),1,0),\"\")","v":""}]
[null,null,null,null,null,null,null,null,null,null,null,null,null,null,null,null,null,null,null,null,null,null,null,null,null,null,null,null,null,null,null,null,null,null,null,"","",0,{"$f":"IF(IFERROR(SEARCH(AK429,AJ429),0)=1,IF(ISNUMBER(SEARCH(AK429,'Hide this - Workings'!$D$5)),1,0),\"\")","v":""}]
[null,null,null,null,null,null,null,null,null,null,null,null,null,null,null,null,null,null,null,null,null,null,null,null,null,null,null,null,null,null,null,null,null,null,null,"","",0,{"$f":"IF(IFERROR(SEARCH(AK430,AJ430),0)=1,IF(ISNUMBER(SEARCH(AK430,'Hide this - Workings'!$D$5)),1,0),\"\")","v":""}]
[null,null,null,null,null,null,null,null,null,null,null,null,null,null,null,null,null,null,null,null,null,null,null,null,null,null,null,null,null,null,null,null,null,null,null,"","",0,{"$f":"IF(IFERROR(SEARCH(AK431,AJ431),0)=1,IF(ISNUMBER(SEARCH(AK431,'Hide this - Workings'!$D$5)),1,0),\"\")","v":""}]
[null,null,null,null,null,null,null,null,null,null,null,null,null,null,null,null,null,null,null,null,null,null,null,null,null,null,null,null,null,null,null,null,null,null,null,"","",0,{"$f":"IF(IFERROR(SEARCH(AK432,AJ432),0)=1,IF(ISNUMBER(SEARCH(AK432,'Hide this - Workings'!$D$5)),1,0),\"\")","v":""}]
[null,null,null,null,null,null,null,null,null,null,null,null,null,null,null,null,null,null,null,null,null,null,null,null,null,null,null,null,null,null,null,null,null,null,null,"","",0,{"$f":"IF(IFERROR(SEARCH(AK433,AJ433),0)=1,IF(ISNUMBER(SEARCH(AK433,'Hide this - Workings'!$D$5)),1,0),\"\")","v":""}]
[null,null,null,null,null,null,null,null,null,null,null,null,null,null,null,null,null,null,null,null,null,null,null,null,null,null,null,null,null,null,null,null,null,null,null,null,null,"Number of search terms:",{"$f":"IF(IFERROR(SEARCH(AK434,AJ434),0)=1,IF(ISNUMBER(SEARCH(AK434,'Hide this - Workings'!$D$5)),1,0),\"\")","v":""}]
[null,null,null,null,null,null,null,null,null,null,null,null,null,null,null,null,null,null,null,null,null,null,null,null,null,null,null,null,null,null,null,null,null,null,null,null,null,{"$f":"SUM(AL417:AL433)","v":0}]